Tree/Branch: v4.15.17
Git describe: v4.15.17
Commit: b22a1fa1b3 Linux 4.15.17
Build Time: 0 min 27 sec
Passed: 0 / 11 ( 0.00 %)
Failed: 11 / 11 (100.00 %)
Errors: 8
Warnings: 0
Section Mismatches: 0
Failed defconfigs:
arm64-allnoconfig
arm64-allmodconfig
arm-multi_v5_defconfig
arm-multi_v7_defconfig
x86_64-defconfig
arm-allmodconfig
arm-allnoconfig
arm-multi_v4t_defconfig
x86_64-allmodconfig
arm64-defconfig
Errors:
arm64-allnoconfig
../scripts/mod/file2alias.c:97:68: error: 'OFF_tb_service_id_match_flags' undeclared (first use in this function)
../scripts/mod/file2alias.c:103:45: error: 'OFF_tb_service_id_protocol_key' undeclared (first use in this function)
../scripts/mod/file2alias.c:97:68: error: 'OFF_tb_service_id_protocol_id' undeclared (first use in this function)
../scripts/mod/file2alias.c:97:68: error: 'OFF_tb_service_id_protocol_version' undeclared (first use in this function)
../scripts/mod/file2alias.c:97:68: error: 'OFF_tb_service_id_protocol_revision' undeclared (first use in this function)
../scripts/mod/file2alias.c:111:3: error: 'SIZE_tb_service_id' undeclared here (not in a function)
arm64-allmodconfig
../scripts/mod/file2alias.c:97:68: error: 'OFF_tb_service_id_match_flags' undeclared (first use in this function)
../scripts/mod/file2alias.c:103:45: error: 'OFF_tb_service_id_protocol_key' undeclared (first use in this function)
../scripts/mod/file2alias.c:97:68: error: 'OFF_tb_service_id_protocol_id' undeclared (first use in this function)
../scripts/mod/file2alias.c:97:68: error: 'OFF_tb_service_id_protocol_version' undeclared (first use in this function)
../scripts/mod/file2alias.c:97:68: error: 'OFF_tb_service_id_protocol_revision' undeclared (first use in this function)
../scripts/mod/file2alias.c:111:3: error: 'SIZE_tb_service_id' undeclared here (not in a function)
arm-multi_v5_defconfig
../arch/arm/include/asm/string.h:45:3: error: expected identifier or '(' before '{' token
arm-multi_v7_defconfig
../arch/arm/include/asm/string.h:45:3: error: expected identifier or '(' before '{' token
x86_64-defconfig
../scripts/mod/file2alias.c:97:68: error: 'OFF_tb_service_id_match_flags' undeclared (first use in this function)
../scripts/mod/file2alias.c:103:45: error: 'OFF_tb_service_id_protocol_key' undeclared (first use in this function)
../scripts/mod/file2alias.c:97:68: error: 'OFF_tb_service_id_protocol_id' undeclared (first use in this function)
../scripts/mod/file2alias.c:97:68: error: 'OFF_tb_service_id_protocol_version' undeclared (first use in this function)
../scripts/mod/file2alias.c:97:68: error: 'OFF_tb_service_id_protocol_revision' undeclared (first use in this function)
../scripts/mod/file2alias.c:111:3: error: 'SIZE_tb_service_id' undeclared here (not in a function)
arm-allmodconfig
../arch/arm/include/asm/string.h:45:3: error: expected identifier or '(' before '{' token
arm-allnoconfig
orc.h:21:27: fatal error: asm/orc_types.h: No such file or directory
orc.h:21:27: fatal error: asm/orc_types.h: No such file or directory
arm-multi_v4t_defconfig
../arch/arm/include/asm/string.h:45:3: error: expected identifier or '(' before '{' token
x86_64-allmodconfig
../scripts/mod/file2alias.c:97:68: error: 'OFF_tb_service_id_match_flags' undeclared (first use in this function)
../scripts/mod/file2alias.c:103:45: error: 'OFF_tb_service_id_protocol_key' undeclared (first use in this function)
../scripts/mod/file2alias.c:97:68: error: 'OFF_tb_service_id_protocol_id' undeclared (first use in this function)
../scripts/mod/file2alias.c:97:68: error: 'OFF_tb_service_id_protocol_version' undeclared (first use in this function)
../scripts/mod/file2alias.c:97:68: error: 'OFF_tb_service_id_protocol_revision' undeclared (first use in this function)
../scripts/mod/file2alias.c:111:3: error: 'SIZE_tb_service_id' undeclared here (not in a function)
arm64-defconfig
orc.h:21:27: fatal error: asm/orc_types.h: No such file or directory
orc.h:21:27: fatal error: asm/orc_types.h: No such file or directory
orc.h:21:27: fatal error: asm/orc_types.h: No such file or directory
-------------------------------------------------------------------------------
defconfigs with issues (other than build errors):
-------------------------------------------------------------------------------
Errors summary: 8
5 orc.h:21:27: fatal error: asm/orc_types.h: No such file or directory
4 ../scripts/mod/file2alias.c:97:68: error: 'OFF_tb_service_id_protocol_version' undeclared (first use in this function)
4 ../scripts/mod/file2alias.c:97:68: error: 'OFF_tb_service_id_protocol_revision' undeclared (first use in this function)
4 ../scripts/mod/file2alias.c:97:68: error: 'OFF_tb_service_id_protocol_id' undeclared (first use in this function)
4 ../scripts/mod/file2alias.c:97:68: error: 'OFF_tb_service_id_match_flags' undeclared (first use in this function)
4 ../scripts/mod/file2alias.c:111:3: error: 'SIZE_tb_service_id' undeclared here (not in a function)
4 ../scripts/mod/file2alias.c:103:45: error: 'OFF_tb_service_id_protocol_key' undeclared (first use in this function)
4 ../arch/arm/include/asm/string.h:45:3: error: expected identifier or '(' before '{' token
===============================================================================
Detailed per-defconfig build reports below:
-------------------------------------------------------------------------------
arm64-allnoconfig : FAIL, 6 errors, 0 warnings, 0 section mismatches
Errors:
../scripts/mod/file2alias.c:97:68: error: 'OFF_tb_service_id_match_flags' undeclared (first use in this function)
../scripts/mod/file2alias.c:103:45: error: 'OFF_tb_service_id_protocol_key' undeclared (first use in this function)
../scripts/mod/file2alias.c:97:68: error: 'OFF_tb_service_id_protocol_id' undeclared (first use in this function)
../scripts/mod/file2alias.c:97:68: error: 'OFF_tb_service_id_protocol_version' undeclared (first use in this function)
../scripts/mod/file2alias.c:97:68: error: 'OFF_tb_service_id_protocol_revision' undeclared (first use in this function)
../scripts/mod/file2alias.c:111:3: error: 'SIZE_tb_service_id' undeclared here (not in a function)
-------------------------------------------------------------------------------
arm64-allmodconfig : FAIL, 6 errors, 0 warnings, 0 section mismatches
Errors:
../scripts/mod/file2alias.c:97:68: error: 'OFF_tb_service_id_match_flags' undeclared (first use in this function)
../scripts/mod/file2alias.c:103:45: error: 'OFF_tb_service_id_protocol_key' undeclared (first use in this function)
../scripts/mod/file2alias.c:97:68: error: 'OFF_tb_service_id_protocol_id' undeclared (first use in this function)
../scripts/mod/file2alias.c:97:68: error: 'OFF_tb_service_id_protocol_version' undeclared (first use in this function)
../scripts/mod/file2alias.c:97:68: error: 'OFF_tb_service_id_protocol_revision' undeclared (first use in this function)
../scripts/mod/file2alias.c:111:3: error: 'SIZE_tb_service_id' undeclared here (not in a function)
-------------------------------------------------------------------------------
arm-multi_v5_defconfig : FAIL, 1 errors, 0 warnings, 0 section mismatches
Errors:
../arch/arm/include/asm/string.h:45:3: error: expected identifier or '(' before '{' token
-------------------------------------------------------------------------------
arm-multi_v7_defconfig : FAIL, 1 errors, 0 warnings, 0 section mismatches
Errors:
../arch/arm/include/asm/string.h:45:3: error: expected identifier or '(' before '{' token
-------------------------------------------------------------------------------
x86_64-defconfig : FAIL, 6 errors, 0 warnings, 0 section mismatches
Errors:
../scripts/mod/file2alias.c:97:68: error: 'OFF_tb_service_id_match_flags' undeclared (first use in this function)
../scripts/mod/file2alias.c:103:45: error: 'OFF_tb_service_id_protocol_key' undeclared (first use in this function)
../scripts/mod/file2alias.c:97:68: error: 'OFF_tb_service_id_protocol_id' undeclared (first use in this function)
../scripts/mod/file2alias.c:97:68: error: 'OFF_tb_service_id_protocol_version' undeclared (first use in this function)
../scripts/mod/file2alias.c:97:68: error: 'OFF_tb_service_id_protocol_revision' undeclared (first use in this function)
../scripts/mod/file2alias.c:111:3: error: 'SIZE_tb_service_id' undeclared here (not in a function)
-------------------------------------------------------------------------------
arm-allmodconfig : FAIL, 1 errors, 0 warnings, 0 section mismatches
Errors:
../arch/arm/include/asm/string.h:45:3: error: expected identifier or '(' before '{' token
-------------------------------------------------------------------------------
arm-allnoconfig : FAIL, 2 errors, 0 warnings, 0 section mismatches
Errors:
orc.h:21:27: fatal error: asm/orc_types.h: No such file or directory
orc.h:21:27: fatal error: asm/orc_types.h: No such file or directory
-------------------------------------------------------------------------------
arm-multi_v4t_defconfig : FAIL, 1 errors, 0 warnings, 0 section mismatches
Errors:
../arch/arm/include/asm/string.h:45:3: error: expected identifier or '(' before '{' token
-------------------------------------------------------------------------------
x86_64-allmodconfig : FAIL, 6 errors, 0 warnings, 0 section mismatches
Errors:
../scripts/mod/file2alias.c:97:68: error: 'OFF_tb_service_id_match_flags' undeclared (first use in this function)
../scripts/mod/file2alias.c:103:45: error: 'OFF_tb_service_id_protocol_key' undeclared (first use in this function)
../scripts/mod/file2alias.c:97:68: error: 'OFF_tb_service_id_protocol_id' undeclared (first use in this function)
../scripts/mod/file2alias.c:97:68: error: 'OFF_tb_service_id_protocol_version' undeclared (first use in this function)
../scripts/mod/file2alias.c:97:68: error: 'OFF_tb_service_id_protocol_revision' undeclared (first use in this function)
../scripts/mod/file2alias.c:111:3: error: 'SIZE_tb_service_id' undeclared here (not in a function)
-------------------------------------------------------------------------------
arm64-defconfig : FAIL, 3 errors, 0 warnings, 0 section mismatches
Errors:
orc.h:21:27: fatal error: asm/orc_types.h: No such file or directory
orc.h:21:27: fatal error: asm/orc_types.h: No such file or directory
orc.h:21:27: fatal error: asm/orc_types.h: No such file or directory
-------------------------------------------------------------------------------
Passed with no errors, warnings or mismatches:
x86_64-allnoconfig
Tree/Branch: v4.14.34
Git describe: v4.14.34
Commit: ffebeb0d7c Linux 4.14.34
Build Time: 0 min 29 sec
Passed: 0 / 11 ( 0.00 %)
Failed: 11 / 11 (100.00 %)
Errors: 2
Warnings: 4
Section Mismatches: 0
Failed defconfigs:
arm-multi_v5_defconfig
arm-multi_v7_defconfig
arm-allmodconfig
arm-multi_v4t_defconfig
arm-allnoconfig
arm64-defconfig
Errors:
arm-multi_v5_defconfig
../arch/arm/include/asm/string.h:45:3: error: expected identifier or '(' before '{' token
arm-multi_v7_defconfig
../arch/arm/include/asm/string.h:45:3: error: expected identifier or '(' before '{' token
arm-allmodconfig
../arch/arm/include/asm/string.h:45:3: error: expected identifier or '(' before '{' token
arm-multi_v4t_defconfig
../arch/arm/include/asm/string.h:45:3: error: expected identifier or '(' before '{' token
arm-allnoconfig
orc.h:21:27: fatal error: asm/orc_types.h: No such file or directory
orc.h:21:27: fatal error: asm/orc_types.h: No such file or directory
orc.h:21:27: fatal error: asm/orc_types.h: No such file or directory
../arch/arm/include/asm/string.h:45:3: error: expected identifier or '(' before '{' token
arm64-defconfig
orc.h:21:27: fatal error: asm/orc_types.h: No such file or directory
orc.h:21:27: fatal error: asm/orc_types.h: No such file or directory
orc.h:21:27: fatal error: asm/orc_types.h: No such file or directory
-------------------------------------------------------------------------------
defconfigs with issues (other than build errors):
4 warnings 0 mismatches : arm-allnoconfig
-------------------------------------------------------------------------------
Errors summary: 2
6 orc.h:21:27: fatal error: asm/orc_types.h: No such file or directory
5 ../arch/arm/include/asm/string.h:45:3: error: expected identifier or '(' before '{' token
Warnings Summary: 4
1 ../arch/arm/include/asm/barrier.h:9:5: warning: "__LINUX_ARM_ARCH__" is not defined [-Wundef]
1 ../arch/arm/include/asm/barrier.h:20:35: warning: "__LINUX_ARM_ARCH__" is not defined [-Wundef]
1 ../arch/arm/include/asm/barrier.h:16:5: warning: "__LINUX_ARM_ARCH__" is not defined [-Wundef]
1 ../arch/arm/include/asm/barrier.h:10:3: warning: "__LINUX_ARM_ARCH__" is not defined [-Wundef]
===============================================================================
Detailed per-defconfig build reports below:
-------------------------------------------------------------------------------
arm-multi_v5_defconfig : FAIL, 1 errors, 0 warnings, 0 section mismatches
Errors:
../arch/arm/include/asm/string.h:45:3: error: expected identifier or '(' before '{' token
-------------------------------------------------------------------------------
arm-multi_v7_defconfig : FAIL, 1 errors, 0 warnings, 0 section mismatches
Errors:
../arch/arm/include/asm/string.h:45:3: error: expected identifier or '(' before '{' token
-------------------------------------------------------------------------------
arm-allmodconfig : FAIL, 1 errors, 0 warnings, 0 section mismatches
Errors:
../arch/arm/include/asm/string.h:45:3: error: expected identifier or '(' before '{' token
-------------------------------------------------------------------------------
arm-multi_v4t_defconfig : FAIL, 1 errors, 0 warnings, 0 section mismatches
Errors:
../arch/arm/include/asm/string.h:45:3: error: expected identifier or '(' before '{' token
-------------------------------------------------------------------------------
arm-allnoconfig : FAIL, 4 errors, 4 warnings, 0 section mismatches
Errors:
orc.h:21:27: fatal error: asm/orc_types.h: No such file or directory
orc.h:21:27: fatal error: asm/orc_types.h: No such file or directory
orc.h:21:27: fatal error: asm/orc_types.h: No such file or directory
../arch/arm/include/asm/string.h:45:3: error: expected identifier or '(' before '{' token
Warnings:
../arch/arm/include/asm/barrier.h:9:5: warning: "__LINUX_ARM_ARCH__" is not defined [-Wundef]
../arch/arm/include/asm/barrier.h:10:3: warning: "__LINUX_ARM_ARCH__" is not defined [-Wundef]
../arch/arm/include/asm/barrier.h:16:5: warning: "__LINUX_ARM_ARCH__" is not defined [-Wundef]
../arch/arm/include/asm/barrier.h:20:35: warning: "__LINUX_ARM_ARCH__" is not defined [-Wundef]
-------------------------------------------------------------------------------
arm64-defconfig : FAIL, 3 errors, 0 warnings, 0 section mismatches
Errors:
orc.h:21:27: fatal error: asm/orc_types.h: No such file or directory
orc.h:21:27: fatal error: asm/orc_types.h: No such file or directory
orc.h:21:27: fatal error: asm/orc_types.h: No such file or directory
-------------------------------------------------------------------------------
Passed with no errors, warnings or mismatches:
x86_64-allnoconfig
arm64-allnoconfig
arm64-allmodconfig
x86_64-allmodconfig
x86_64-defconfig
The normal request completion can be done before or during handling
BLK_EH_RESET_TIMER, and this race may cause the request to never
be completed since driver's .timeout() may always return
BLK_EH_RESET_TIMER.
This issue can't be fixed completely by driver, since the normal
completion can be done between returning .timeout() and handing
BLK_EH_RESET_TIMER.
This patch fixes this race by introducing rq state of MQ_RQ_COMPLETE_IN_RESET,
and reading/writing rq's state by holding queue lock, which can be
per-request actually, but just not necessary to introduce one lock for
so unusual event.
Cc: Bart Van Assche <bart.vanassche(a)wdc.com>
Cc: Tejun Heo <tj(a)kernel.org>
Cc: Christoph Hellwig <hch(a)lst.de>
Cc: Ming Lei <ming.lei(a)redhat.com>
Cc: Sagi Grimberg <sagi(a)grimberg.me>
Cc: Israel Rukshin <israelr(a)mellanox.com>,
Cc: Max Gurtovoy <maxg(a)mellanox.com>
Cc: stable(a)vger.kernel.org
Signed-off-by: Ming Lei <ming.lei(a)redhat.com>
---
V2:
- rename the new flag as MQ_RQ_COMPLETE_IN_TIMEOUT
- fix lock uses in blk_mq_rq_timed_out
- document re-order between blk_add_timer() and
blk_mq_rq_update_aborted_gstate(req, 0)
block/blk-mq.c | 49 ++++++++++++++++++++++++++++++++++++++++++++-----
block/blk-mq.h | 1 +
2 files changed, 45 insertions(+), 5 deletions(-)
diff --git a/block/blk-mq.c b/block/blk-mq.c
index 0dc9e341c2a7..db1c84b2bb5e 100644
--- a/block/blk-mq.c
+++ b/block/blk-mq.c
@@ -630,10 +630,27 @@ void blk_mq_complete_request(struct request *rq)
* However, that would complicate paths which want to synchronize
* against us. Let stay in sync with the issue path so that
* hctx_lock() covers both issue and completion paths.
+ *
+ * Cover complete vs BLK_EH_RESET_TIMER race in slow path with
+ * helding queue lock.
*/
hctx_lock(hctx, &srcu_idx);
if (blk_mq_rq_aborted_gstate(rq) != rq->gstate)
__blk_mq_complete_request(rq);
+ else {
+ unsigned long flags;
+ bool need_complete = false;
+
+ spin_lock_irqsave(q->queue_lock, flags);
+ if (!blk_mq_rq_aborted_gstate(rq))
+ need_complete = true;
+ else
+ blk_mq_rq_update_state(rq, MQ_RQ_COMPLETE_IN_TIMEOUT);
+ spin_unlock_irqrestore(q->queue_lock, flags);
+
+ if (need_complete)
+ __blk_mq_complete_request(rq);
+ }
hctx_unlock(hctx, srcu_idx);
}
EXPORT_SYMBOL(blk_mq_complete_request);
@@ -814,6 +831,7 @@ static void blk_mq_rq_timed_out(struct request *req, bool reserved)
{
const struct blk_mq_ops *ops = req->q->mq_ops;
enum blk_eh_timer_return ret = BLK_EH_RESET_TIMER;
+ unsigned long flags;
req->rq_flags |= RQF_MQ_TIMEOUT_EXPIRED;
@@ -826,12 +844,33 @@ static void blk_mq_rq_timed_out(struct request *req, bool reserved)
break;
case BLK_EH_RESET_TIMER:
/*
- * As nothing prevents from completion happening while
- * ->aborted_gstate is set, this may lead to ignored
- * completions and further spurious timeouts.
+ * The normal completion may happen during handling the
+ * timeout, or even after returning from .timeout(), so
+ * once the request has been completed, we can't reset
+ * timer any more since this request may be handled as
+ * BLK_EH_RESET_TIMER in next timeout handling too, and
+ * it has to be completed in this situation.
+ *
+ * Holding the queue lock to cover read/write rq's
+ * aborted_gstate and normal state, so the race can be
+ * avoided completely.
+ *
+ * blk_add_timer() may be re-ordered with resetting
+ * aborted_gstate, and the only side-effec is that if this
+ * request is recycled after aborted_gstate is cleared, it
+ * may be timed out a bit late, that is what we can survive
+ * given timeout event is so unusual.
*/
- blk_mq_rq_update_aborted_gstate(req, 0);
- blk_add_timer(req);
+ spin_lock_irqsave(req->q->queue_lock, flags);
+ if (blk_mq_rq_state(req) != MQ_RQ_COMPLETE_IN_TIMEOUT) {
+ blk_add_timer(req);
+ blk_mq_rq_update_aborted_gstate(req, 0);
+ spin_unlock_irqrestore(req->q->queue_lock, flags);
+ } else {
+ blk_mq_rq_update_state(req, MQ_RQ_IN_FLIGHT);
+ spin_unlock_irqrestore(req->q->queue_lock, flags);
+ __blk_mq_complete_request(req);
+ }
break;
case BLK_EH_NOT_HANDLED:
break;
diff --git a/block/blk-mq.h b/block/blk-mq.h
index 88c558f71819..0426d048743d 100644
--- a/block/blk-mq.h
+++ b/block/blk-mq.h
@@ -35,6 +35,7 @@ enum mq_rq_state {
MQ_RQ_IDLE = 0,
MQ_RQ_IN_FLIGHT = 1,
MQ_RQ_COMPLETE = 2,
+ MQ_RQ_COMPLETE_IN_TIMEOUT = 3,
MQ_RQ_STATE_BITS = 2,
MQ_RQ_STATE_MASK = (1 << MQ_RQ_STATE_BITS) - 1,
--
2.9.5
On 14/03/18 09:48, Jan Beulich wrote:
>>>> On 26.02.18 at 15:08, <jgross(a)suse.com> wrote:
>> @@ -35,6 +40,9 @@ void xen_arch_post_suspend(int cancelled)
>>
>> static void xen_vcpu_notify_restore(void *data)
>> {
>> + if (xen_pv_domain() && boot_cpu_has(X86_FEATURE_SPEC_CTRL))
>> + wrmsrl(MSR_IA32_SPEC_CTRL, this_cpu_read(spec_ctrl));
>> +
>> /* Boot processor notified via generic timekeeping_resume() */
>> if (smp_processor_id() == 0)
>> return;
>> @@ -44,7 +52,15 @@ static void xen_vcpu_notify_restore(void *data)
>>
>> static void xen_vcpu_notify_suspend(void *data)
>> {
>> + u64 tmp;
>> +
>> tick_suspend_local();
>> +
>> + if (xen_pv_domain() && boot_cpu_has(X86_FEATURE_SPEC_CTRL)) {
>> + rdmsrl(MSR_IA32_SPEC_CTRL, tmp);
>> + this_cpu_write(spec_ctrl, tmp);
>> + wrmsrl(MSR_IA32_SPEC_CTRL, 0);
>> + }
>> }
>
> While investigating ways how to do something similar on our old,
> non-pvops kernels I've started wondering if this solution is actually
> correct in all cases. Of course discussing this is complicated by the
> fact that the change there might be a conflict with hasn't landed
> in Linus'es tree yet (see e.g.
> https://patchwork.kernel.org/patch/10153843/ for an upstream
> submission; I haven't been able to find any discussion on that
> patch or why it isn't upstream yet), but we have it in our various
> branches. The potential problem I'm seeing is with the clearing
> and re-setting of SPEC_CTRL around CPUs going idle. While the
> active CPU could have preemption disabled (if that isn't the case
> already), the passive CPUs are - afaict - neither under full control
> of drivers/xen/manage.c:do_suspend() nor excluded yet from
> any further scheduling activity. Hence with code like this (taken
> from one of our branches)
>
> static void mwait_idle(void)
> {
> if (!current_set_polling_and_test()) {
> trace_cpu_idle_rcuidle(1, smp_processor_id());
> if (this_cpu_has(X86_BUG_CLFLUSH_MONITOR)) {
> smp_mb(); /* quirk */
> clflush((void *)¤t_thread_info()->flags);
> smp_mb(); /* quirk */
> }
>
> x86_disable_ibrs();
>
> __monitor((void *)¤t_thread_info()->flags, 0, 0);
> if (!need_resched())
> __sti_mwait(0, 0);
> else
> local_irq_enable();
>
> x86_enable_ibrs();
> ...
>
> the MSR might get set to non-zero again after having been
> cleared by the code your patch adds. I therefore think that the
> only race free solution would be to do the clearing from
> stop-machine context. But maybe I'm overlooking something.
Currently and with the above mentioned patch there is no problem: Xen pv
guests always use default_idle(), so mwait_idle() eventually playing
with MSR_IA32_SPEC_CTRL won't affect us.
In order to ensure that won't change in future default_idle() should
never modify MSR_IA32_SPEC_CTRL. In case something like that would be
required we should rather add another idle function doing that.
Juergen
If building a kernel without FTRACE but with TRACING,
ucsi.ko fails to link due to missing trace events. Fix this
by using the correct Kconfig symbol on Makefile.
Reported-by: Tobias Regnery <tobias.regnery(a)gmail.com>
Fixes: c1b0bc2dabfa ("usb: typec: Add support for UCSI interface")
Cc: <stable(a)vger.kernel.org>
Signed-off-by: Heikki Krogerus <heikki.krogerus(a)linux.intel.com>
---
drivers/usb/typec/ucsi/Makefile | 2 +-
1 file changed, 1 insertion(+), 1 deletion(-)
diff --git a/drivers/usb/typec/ucsi/Makefile b/drivers/usb/typec/ucsi/Makefile
index b57891c1fd31..7afbea512207 100644
--- a/drivers/usb/typec/ucsi/Makefile
+++ b/drivers/usb/typec/ucsi/Makefile
@@ -5,6 +5,6 @@ obj-$(CONFIG_TYPEC_UCSI) += typec_ucsi.o
typec_ucsi-y := ucsi.o
-typec_ucsi-$(CONFIG_FTRACE) += trace.o
+typec_ucsi-$(CONFIG_TRACING) += trace.o
obj-$(CONFIG_UCSI_ACPI) += ucsi_acpi.o
--
2.16.3
Commit fe014d4e6b55 (staging: wilc1000: free memory allocated for general info
message from firmware) introduced bug by using wrong source address in
kmemdup(). 'conn_info.req_ies' is used for source address in kempdup()
instead of 'hif_drv->usr_conn_req.ies'.
This commit fixes the NULL pointer dereference issue in
host_int_parse_assoc_resp_info() by using the correct source address in
kmemdup().
Fixes: fe014d4e6b55 (staging: wilc1000: free memory allocated for
general info message from firmware)
Cc: stable(a)vger.kernel.org
Signed-off-by: Ajay Singh <ajay.kathat(a)microchip.com>
Tested-by: Ajay Singh <ajay.kathat(a)microchip.com>
---
drivers/staging/wilc1000/host_interface.c | 2 +-
1 file changed, 1 insertion(+), 1 deletion(-)
diff --git a/drivers/staging/wilc1000/host_interface.c b/drivers/staging/wilc1000/host_interface.c
index 316d73c..302e3cb 100644
--- a/drivers/staging/wilc1000/host_interface.c
+++ b/drivers/staging/wilc1000/host_interface.c
@@ -1387,7 +1387,7 @@ static inline void host_int_parse_assoc_resp_info(struct wilc_vif *vif,
}
if (hif_drv->usr_conn_req.ies) {
- conn_info.req_ies = kmemdup(conn_info.req_ies,
+ conn_info.req_ies = kmemdup(hif_drv->usr_conn_req.ies,
hif_drv->usr_conn_req.ies_len,
GFP_KERNEL);
if (conn_info.req_ies)
--
2.7.4
The patch titled
Subject: fs/reiserfs/journal.c: add missing resierfs_warning() arg
has been removed from the -mm tree. Its filename was
fs-reiserfs-journalc-add-missing-resierfs_warning-arg.patch
This patch was dropped because it was merged into mainline or a subsystem tree
------------------------------------------------------
From: Andrew Morton <akpm(a)linux-foundation.org>
Subject: fs/reiserfs/journal.c: add missing resierfs_warning() arg
One use of the reiserfs_warning() macro in journal_init_dev() is missing a
parameter, causing the following warning:
REISERFS warning (device loop0): journal_init_dev: Cannot open '%s': %i journal_init_dev:
This also causes a WARN_ONCE() warning in the vsprintf code, and then a
panic if panic_on_warn is set.
Please remove unsupported %/ in format string
WARNING: CPU: 1 PID: 4480 at lib/vsprintf.c:2138 format_decode+0x77f/0x830 lib/vsprintf.c:2138
Kernel panic - not syncing: panic_on_warn set ...
Just add another string argument to the macro invocation.
Addresses https://syzkaller.appspot.com/bug?id=0627d4551fdc39bf1ef5d82cd9eef587047f77…
Link: http://lkml.kernel.org/r/d678ebe1-6f54-8090-df4c-b9affad62293@infradead.org
Signed-off-by: Randy Dunlap <rdunlap(a)infradead.org>
Reported-by: <syzbot+6bd77b88c1977c03f584(a)syzkaller.appspotmail.com>
Tested-by: Randy Dunlap <rdunlap(a)infradead.org>
Acked-by: Jeff Mahoney <jeffm(a)suse.com>
Cc: Alexander Viro <viro(a)zeniv.linux.org.uk>
Cc: Jan Kara <jack(a)suse.com>
Cc: <stable(a)vger.kernel.org>
Signed-off-by: Andrew Morton <akpm(a)linux-foundation.org>
---
fs/reiserfs/journal.c | 2 +-
1 file changed, 1 insertion(+), 1 deletion(-)
diff -puN fs/reiserfs/journal.c~fs-reiserfs-journalc-add-missing-resierfs_warning-arg fs/reiserfs/journal.c
--- a/fs/reiserfs/journal.c~fs-reiserfs-journalc-add-missing-resierfs_warning-arg
+++ a/fs/reiserfs/journal.c
@@ -2643,7 +2643,7 @@ static int journal_init_dev(struct super
if (IS_ERR(journal->j_dev_bd)) {
result = PTR_ERR(journal->j_dev_bd);
journal->j_dev_bd = NULL;
- reiserfs_warning(super,
+ reiserfs_warning(super, "sh-457",
"journal_init_dev: Cannot open '%s': %i",
jdev_name, result);
return result;
_
Patches currently in -mm which might be from akpm(a)linux-foundation.org are
i-need-old-gcc.patch
mm-gup_benchmark-handle-gup-failures-fix.patch
mm-pagemap-fix-swap-offset-value-for-pmd-migration-entry-fix.patch
writeback-safer-lock-nesting-fix.patch
arm-arch-arm-include-asm-pageh-needs-personalityh.patch
ocfs2-without-quota-support-try-to-avoid-calling-quota-recovery-checkpatch-fixes.patch
mm.patch
list_lru-prefetch-neighboring-list-entries-before-acquiring-lock-fix.patch
mm-oom-cgroup-aware-oom-killer-fix.patch
mm-oom-docs-describe-the-cgroup-aware-oom-killer-fix-2-fix.patch
fs-fsnotify-account-fsnotify-metadata-to-kmemcg-fix.patch
kernel-forkc-export-kernel_thread-to-modules.patch
slab-leaks3-default-y.patch
The patch titled
Subject: task_struct: only use anon struct under randstruct plugin
has been removed from the -mm tree. Its filename was
task_struct-only-use-anon-struct-under-randstruct-plugin.patch
This patch was dropped because it was merged into mainline or a subsystem tree
------------------------------------------------------
From: Kees Cook <keescook(a)chromium.org>
Subject: task_struct: only use anon struct under randstruct plugin
The original intent for always adding the anonymous struct in task_struct
was to make sure we had compiler coverage. However, this caused
pathological padding of 40 bytes at the start of task_struct. Instead,
move the anonymous struct to being only used when struct layout
randomization is enabled.
Link: http://lkml.kernel.org/r/20180327213609.GA2964@beast
Fixes: 29e48ce87f1e ("task_struct: Allow randomized")
Signed-off-by: Kees Cook <keescook(a)chromium.org>
Reported-by: Peter Zijlstra <peterz(a)infradead.org>
Cc: Peter Zijlstra <peterz(a)infradead.org>
Cc: Ingo Molnar <mingo(a)kernel.org>
Cc: <stable(a)vger.kernel.org>
Signed-off-by: Andrew Morton <akpm(a)linux-foundation.org>
---
include/linux/compiler-clang.h | 3 ---
include/linux/compiler-gcc.h | 12 +++---------
2 files changed, 3 insertions(+), 12 deletions(-)
diff -puN include/linux/compiler-clang.h~task_struct-only-use-anon-struct-under-randstruct-plugin include/linux/compiler-clang.h
--- a/include/linux/compiler-clang.h~task_struct-only-use-anon-struct-under-randstruct-plugin
+++ a/include/linux/compiler-clang.h
@@ -17,9 +17,6 @@
*/
#define __UNIQUE_ID(prefix) __PASTE(__PASTE(__UNIQUE_ID_, prefix), __COUNTER__)
-#define randomized_struct_fields_start struct {
-#define randomized_struct_fields_end };
-
/* all clang versions usable with the kernel support KASAN ABI version 5 */
#define KASAN_ABI_VERSION 5
diff -puN include/linux/compiler-gcc.h~task_struct-only-use-anon-struct-under-randstruct-plugin include/linux/compiler-gcc.h
--- a/include/linux/compiler-gcc.h~task_struct-only-use-anon-struct-under-randstruct-plugin
+++ a/include/linux/compiler-gcc.h
@@ -242,6 +242,9 @@
#if defined(RANDSTRUCT_PLUGIN) && !defined(__CHECKER__)
#define __randomize_layout __attribute__((randomize_layout))
#define __no_randomize_layout __attribute__((no_randomize_layout))
+/* This anon struct can add padding, so only enable it under randstruct. */
+#define randomized_struct_fields_start struct {
+#define randomized_struct_fields_end } __randomize_layout;
#endif
#endif /* GCC_VERSION >= 40500 */
@@ -256,15 +259,6 @@
*/
#define __visible __attribute__((externally_visible))
-/*
- * RANDSTRUCT_PLUGIN wants to use an anonymous struct, but it is only
- * possible since GCC 4.6. To provide as much build testing coverage
- * as possible, this is used for all GCC 4.6+ builds, and not just on
- * RANDSTRUCT_PLUGIN builds.
- */
-#define randomized_struct_fields_start struct {
-#define randomized_struct_fields_end } __randomize_layout;
-
#endif /* GCC_VERSION >= 40600 */
_
Patches currently in -mm which might be from keescook(a)chromium.org are
rslib-remove-vlas-by-setting-upper-bound-on-nroots.patch
fork-unconditionally-clear-stack-on-fork.patch
exofs-avoid-vla-in-structures.patch
The patch titled
Subject: mm/ksm.c: fix inconsistent accounting of zero pages
has been removed from the -mm tree. Its filename was
mm-ksm-fix-inconsistent-accounting-of-zero-pages.patch
This patch was dropped because it was merged into mainline or a subsystem tree
------------------------------------------------------
From: Claudio Imbrenda <imbrenda(a)linux.vnet.ibm.com>
Subject: mm/ksm.c: fix inconsistent accounting of zero pages
When using KSM with use_zero_pages, we replace anonymous pages containing
only zeroes with actual zero pages, which are not anonymous. We need to
do proper accounting of the mm counters, otherwise we will get wrong
values in /proc and a BUG message in dmesg when tearing down the mm.
Link: http://lkml.kernel.org/r/1522931274-15552-1-git-send-email-imbrenda@linux.v…
Fixes: e86c59b1b1 ("mm/ksm: improve deduplication of zero pages with colouring")
Signed-off-by: Claudio Imbrenda <imbrenda(a)linux.vnet.ibm.com>
Reviewed-by: Andrew Morton <akpm(a)linux-foundation.org>
Cc: Andrea Arcangeli <aarcange(a)redhat.com>
Cc: Minchan Kim <minchan(a)kernel.org>
Cc: Kirill A. Shutemov <kirill.shutemov(a)linux.intel.com>
Cc: Hugh Dickins <hughd(a)google.com>
Cc: Christian Borntraeger <borntraeger(a)de.ibm.com>
Cc: Gerald Schaefer <gerald.schaefer(a)de.ibm.com>
Cc: <stable(a)vger.kernel.org>
Signed-off-by: Andrew Morton <akpm(a)linux-foundation.org>
---
mm/ksm.c | 7 +++++++
1 file changed, 7 insertions(+)
diff -puN mm/ksm.c~mm-ksm-fix-inconsistent-accounting-of-zero-pages mm/ksm.c
--- a/mm/ksm.c~mm-ksm-fix-inconsistent-accounting-of-zero-pages
+++ a/mm/ksm.c
@@ -1131,6 +1131,13 @@ static int replace_page(struct vm_area_s
} else {
newpte = pte_mkspecial(pfn_pte(page_to_pfn(kpage),
vma->vm_page_prot));
+ /*
+ * We're replacing an anonymous page with a zero page, which is
+ * not anonymous. We need to do proper accounting otherwise we
+ * will get wrong values in /proc, and a BUG message in dmesg
+ * when tearing down the mm.
+ */
+ dec_mm_counter(mm, MM_ANONPAGES);
}
flush_cache_page(vma, addr, pte_pfn(*ptep));
_
Patches currently in -mm which might be from imbrenda(a)linux.vnet.ibm.com are
The patch titled
Subject: mm/hmm: hmm_pfns_bad() was accessing wrong struct
has been removed from the -mm tree. Its filename was
mm-hmm-hmm_pfns_bad-was-accessing-wrong-struct.patch
This patch was dropped because it was merged into mainline or a subsystem tree
------------------------------------------------------
From: Jérôme Glisse <jglisse(a)redhat.com>
Subject: mm/hmm: hmm_pfns_bad() was accessing wrong struct
The private field of mm_walk struct point to an hmm_vma_walk struct and
not to the hmm_range struct desired. Fix to get proper struct pointer.
Link: http://lkml.kernel.org/r/20180323005527.758-6-jglisse@redhat.com
Signed-off-by: Jérôme Glisse <jglisse(a)redhat.com>
Cc: Evgeny Baskakov <ebaskakov(a)nvidia.com>
Cc: Ralph Campbell <rcampbell(a)nvidia.com>
Cc: Mark Hairgrove <mhairgrove(a)nvidia.com>
Cc: John Hubbard <jhubbard(a)nvidia.com>
Cc: <stable(a)vger.kernel.org>
Signed-off-by: Andrew Morton <akpm(a)linux-foundation.org>
---
mm/hmm.c | 3 ++-
1 file changed, 2 insertions(+), 1 deletion(-)
diff -puN mm/hmm.c~mm-hmm-hmm_pfns_bad-was-accessing-wrong-struct mm/hmm.c
--- a/mm/hmm.c~mm-hmm-hmm_pfns_bad-was-accessing-wrong-struct
+++ a/mm/hmm.c
@@ -336,7 +336,8 @@ static int hmm_pfns_bad(unsigned long ad
unsigned long end,
struct mm_walk *walk)
{
- struct hmm_range *range = walk->private;
+ struct hmm_vma_walk *hmm_vma_walk = walk->private;
+ struct hmm_range *range = hmm_vma_walk->range;
hmm_pfn_t *pfns = range->pfns;
unsigned long i;
_
Patches currently in -mm which might be from jglisse(a)redhat.com are
The patch titled
Subject: mm/hmm: fix header file if/else/endif maze
has been removed from the -mm tree. Its filename was
mm-hmm-fix-header-file-if-else-endif-maze-v2.patch
This patch was dropped because it was merged into mainline or a subsystem tree
------------------------------------------------------
From: Jérôme Glisse <jglisse(a)redhat.com>
Subject: mm/hmm: fix header file if/else/endif maze
The #if/#else/#endif for IS_ENABLED(CONFIG_HMM) were wrong. Because of
this after multiple include there was multiple definition of both
hmm_mm_init() and hmm_mm_destroy() leading to build failure if HMM was
enabled (CONFIG_HMM set).
Link: http://lkml.kernel.org/r/20180323005527.758-3-jglisse@redhat.com
Signed-off-by: Jérôme Glisse <jglisse(a)redhat.com>
Acked-by: Balbir Singh <bsingharora(a)gmail.com>
Cc: Andrew Morton <akpm(a)linux-foundation.org>
Cc: Ralph Campbell <rcampbell(a)nvidia.com>
Cc: John Hubbard <jhubbard(a)nvidia.com>
Cc: Evgeny Baskakov <ebaskakov(a)nvidia.com>
Cc: <stable(a)vger.kernel.org>
Signed-off-by: Andrew Morton <akpm(a)linux-foundation.org>
---
include/linux/hmm.h | 9 +--------
1 file changed, 1 insertion(+), 8 deletions(-)
diff -puN include/linux/hmm.h~mm-hmm-fix-header-file-if-else-endif-maze-v2 include/linux/hmm.h
--- a/include/linux/hmm.h~mm-hmm-fix-header-file-if-else-endif-maze-v2
+++ a/include/linux/hmm.h
@@ -498,23 +498,16 @@ struct hmm_device {
struct hmm_device *hmm_device_new(void *drvdata);
void hmm_device_put(struct hmm_device *hmm_device);
#endif /* CONFIG_DEVICE_PRIVATE || CONFIG_DEVICE_PUBLIC */
-#endif /* IS_ENABLED(CONFIG_HMM) */
/* Below are for HMM internal use only! Not to be used by device driver! */
-#if IS_ENABLED(CONFIG_HMM_MIRROR)
void hmm_mm_destroy(struct mm_struct *mm);
static inline void hmm_mm_init(struct mm_struct *mm)
{
mm->hmm = NULL;
}
-#else /* IS_ENABLED(CONFIG_HMM_MIRROR) */
-static inline void hmm_mm_destroy(struct mm_struct *mm) {}
-static inline void hmm_mm_init(struct mm_struct *mm) {}
-#endif /* IS_ENABLED(CONFIG_HMM_MIRROR) */
-
-
#else /* IS_ENABLED(CONFIG_HMM) */
static inline void hmm_mm_destroy(struct mm_struct *mm) {}
static inline void hmm_mm_init(struct mm_struct *mm) {}
+#endif /* IS_ENABLED(CONFIG_HMM) */
#endif /* LINUX_HMM_H */
_
Patches currently in -mm which might be from jglisse(a)redhat.com are
Hi,
[This is an automated email]
This commit has been processed because it contains a "Fixes:" tag,
fixing commit: d9f9b9a4d05f devlink: Add support for resource abstraction.
The bot has tested the following trees: v4.16.1.
v4.16.1: Failed to apply! Possible dependencies:
37923ed6b8ce ("netdevsim: Add simple FIB resource controller via devlink")
3ed898e8cd05 ("mlxsw: spectrum_kvdl: Make some functions static")
4f4bbf7c4e3d ("devlink: Perform cleanup of resource_set cb")
51d3c08e3371 ("mlxsw: spectrum_kvdl: Add support for linear division resources")
7f47b19bd744 ("mlxsw: spectrum_kvdl: Add support for per part occupancy")
88d2fbcda145 ("mlxsw: spectrum: Pass mlxsw_core as arg of mlxsw_sp_kvdl_resources_register()")
c8276dd250e9 ("mlxsw: spectrum_kvdl: Fix handling of resource_size_param")
f9b9120119ca ("mlxsw: Constify devlink_resource_ops")
--
Thanks,
Sasha
The patch titled
Subject: mm, slab: reschedule cache_reap() on the same CPU
has been added to the -mm tree. Its filename is
mm-slab-reschedule-cache_reap-on-the-same-cpu.patch
This patch should soon appear at
http://ozlabs.org/~akpm/mmots/broken-out/mm-slab-reschedule-cache_reap-on-t…
and later at
http://ozlabs.org/~akpm/mmotm/broken-out/mm-slab-reschedule-cache_reap-on-t…
Before you just go and hit "reply", please:
a) Consider who else should be cc'ed
b) Prefer to cc a suitable mailing list as well
c) Ideally: find the original patch on the mailing list and do a
reply-to-all to that, adding suitable additional cc's
*** Remember to use Documentation/process/submit-checklist.rst when testing your code ***
The -mm tree is included into linux-next and is updated
there every 3-4 working days
------------------------------------------------------
From: Vlastimil Babka <vbabka(a)suse.cz>
Subject: mm, slab: reschedule cache_reap() on the same CPU
cache_reap() is initially scheduled in start_cpu_timer() via
schedule_delayed_work_on(). But then the next iterations are scheduled
via schedule_delayed_work(), i.e. using WORK_CPU_UNBOUND.
Thus since commit ef557180447f ("workqueue: schedule WORK_CPU_UNBOUND work
on wq_unbound_cpumask CPUs") there is no guarantee the future iterations
will run on the originally intended cpu, although it's still preferred. I
was able to demonstrate this with
/sys/module/workqueue/parameters/debug_force_rr_cpu. IIUC, it may also
happen due to migrating timers in nohz context. As a result, some cpu's
would be calling cache_reap() more frequently and others never.
This patch uses schedule_delayed_work_on() with the current cpu when
scheduling the next iteration.
Link: http://lkml.kernel.org/r/20180411070007.32225-1-vbabka@suse.cz
Fixes: ef557180447f ("workqueue: schedule WORK_CPU_UNBOUND work on wq_unbound_cpumask CPUs")
Signed-off-by: Vlastimil Babka <vbabka(a)suse.cz>
Acked-by: Pekka Enberg <penberg(a)kernel.org>
Acked-by: Christoph Lameter <cl(a)linux.com>
Cc: Joonsoo Kim <iamjoonsoo.kim(a)lge.com>
Cc: David Rientjes <rientjes(a)google.com>
Cc: Tejun Heo <tj(a)kernel.org>
Cc: Lai Jiangshan <jiangshanlai(a)gmail.com>
Cc: John Stultz <john.stultz(a)linaro.org>
Cc: Thomas Gleixner <tglx(a)linutronix.de>
Cc: Stephen Boyd <sboyd(a)kernel.org>
Cc: <stable(a)vger.kernel.org>
Signed-off-by: Andrew Morton <akpm(a)linux-foundation.org>
---
mm/slab.c | 3 ++-
1 file changed, 2 insertions(+), 1 deletion(-)
diff -puN mm/slab.c~mm-slab-reschedule-cache_reap-on-the-same-cpu mm/slab.c
--- a/mm/slab.c~mm-slab-reschedule-cache_reap-on-the-same-cpu
+++ a/mm/slab.c
@@ -4086,7 +4086,8 @@ next:
next_reap_node();
out:
/* Set up the next iteration */
- schedule_delayed_work(work, round_jiffies_relative(REAPTIMEOUT_AC));
+ schedule_delayed_work_on(smp_processor_id(), work,
+ round_jiffies_relative(REAPTIMEOUT_AC));
}
void get_slabinfo(struct kmem_cache *cachep, struct slabinfo *sinfo)
_
Patches currently in -mm which might be from vbabka(a)suse.cz are
mm-slab-reschedule-cache_reap-on-the-same-cpu.patch
Tree/Branch: v4.15.16
Git describe: v4.15.16
Commit: 49859d3c55 Linux 4.15.16
Build Time: 85 min 9 sec
Passed: 5 / 11 ( 45.45 %)
Failed: 6 / 11 ( 54.55 %)
Errors: 57
Warnings: 2
Section Mismatches: 0
Failed defconfigs:
arm64-allmodconfig
arm-multi_v5_defconfig
arm-multi_v7_defconfig
arm-allmodconfig
x86_64-allmodconfig
arm64-defconfig
Errors:
arm64-allmodconfig
../include/media/cec.h:94:24: error: 'CEC_EVENT_PIN_HPD_HIGH' undeclared here (not in a function)
../include/media/cec.h:94:24: error: 'CEC_EVENT_PIN_HPD_HIGH' undeclared here (not in a function)
../include/media/cec.h:94:24: error: 'CEC_EVENT_PIN_HPD_HIGH' undeclared here (not in a function)
../include/media/cec.h:94:24: error: 'CEC_EVENT_PIN_HPD_HIGH' undeclared here (not in a function)
../include/media/cec.h:94:24: error: 'CEC_EVENT_PIN_HPD_HIGH' undeclared here (not in a function)
../include/media/cec.h:94:24: error: 'CEC_EVENT_PIN_HPD_HIGH' undeclared here (not in a function)
../drivers/media/cec/cec-core.c:230:27: error: 'CEC_CAP_NEEDS_HPD' undeclared (first use in this function)
../include/media/cec.h:94:24: error: 'CEC_EVENT_PIN_HPD_HIGH' undeclared here (not in a function)
../include/linux/build_bug.h:30:45: error: bit-field '<anonymous>' width not an integer constant
../drivers/media/cec/cec-adap.c:136:22: error: 'CEC_EVENT_FL_DROPPED_EVENTS' undeclared (first use in this function)
../drivers/media/cec/cec-adap.c:160:22: error: 'CEC_EVENT_PIN_CEC_HIGH' undeclared (first use in this function)
../drivers/media/cec/cec-adap.c:161:8: error: 'CEC_EVENT_PIN_CEC_LOW' undeclared (first use in this function)
../drivers/media/cec/cec-adap.c:167:28: error: 'CEC_MODE_MONITOR_PIN' undeclared (first use in this function)
../drivers/media/cec/cec-adap.c:178:8: error: 'CEC_EVENT_PIN_HPD_LOW' undeclared (first use in this function)
../drivers/media/cec/cec-adap.c:710:17: error: 'CEC_MSG_FL_REPLY_TO_FOLLOWERS' undeclared (first use in this function)
../drivers/media/cec/cec-adap.c:1403:21: error: 'CEC_LOG_ADDRS_FL_CDC_ONLY' undeclared (first use in this function)
../drivers/media/cec/cec-adap.c:1563:25: error: 'CEC_LOG_ADDRS_FL_CDC_ONLY' undeclared (first use in this function)
../drivers/media/cec/cec-adap.c:1798:6: error: implicit declaration of function 'cec_is_cdc_only' [-Werror=implicit-function-declaration]
../drivers/media/cec/cec-adap.c:1878:33: error: 'CEC_LOG_ADDRS_FL_ALLOW_RC_PASSTHRU' undeclared (first use in this function)
../drivers/media/cec/cec-adap.c:2019:33: error: 'CEC_MSG_FL_REPLY_TO_FOLLOWERS' undeclared (first use in this function)
../include/media/cec.h:94:24: error: 'CEC_EVENT_PIN_HPD_HIGH' undeclared here (not in a function)
../drivers/media/cec/cec-api.c:168:7: error: 'CEC_LOG_ADDRS_FL_ALLOW_RC_PASSTHRU' undeclared (first use in this function)
../drivers/media/cec/cec-api.c:169:7: error: 'CEC_LOG_ADDRS_FL_CDC_ONLY' undeclared (first use in this function)
../drivers/media/cec/cec-api.c:198:31: error: 'CEC_LOG_ADDRS_FL_CDC_ONLY' undeclared (first use in this function)
../drivers/media/cec/cec-api.c:381:23: error: 'CEC_MODE_MONITOR_PIN' undeclared (first use in this function)
../drivers/media/cec/cec-api.c:382:29: error: 'CEC_CAP_MONITOR_PIN' undeclared (first use in this function)
../drivers/media/cec/cec-api.c:452:38: error: 'CEC_EVENT_PIN_CEC_HIGH' undeclared (first use in this function)
../drivers/media/cec/cec-api.c:453:10: error: 'CEC_EVENT_PIN_CEC_LOW' undeclared (first use in this function)
../drivers/media/cec/cec-api.c:610:27: error: 'CEC_MODE_MONITOR_PIN' undeclared (first use in this function)
../include/media/cec.h:94:24: error: 'CEC_EVENT_PIN_HPD_HIGH' undeclared here (not in a function)
../include/media/cec.h:94:24: error: 'CEC_EVENT_PIN_HPD_HIGH' undeclared here (not in a function)
../include/media/cec.h:94:24: error: 'CEC_EVENT_PIN_HPD_HIGH' undeclared here (not in a function)
../include/media/cec.h:94:24: error: 'CEC_EVENT_PIN_HPD_HIGH' undeclared here (not in a function)
../include/media/cec.h:94:24: error: 'CEC_EVENT_PIN_HPD_HIGH' undeclared here (not in a function)
../include/media/cec.h:94:24: error: 'CEC_EVENT_PIN_HPD_HIGH' undeclared here (not in a function)
../include/media/cec.h:94:24: error: 'CEC_EVENT_PIN_HPD_HIGH' undeclared here (not in a function)
../include/media/cec.h:94:24: error: 'CEC_EVENT_PIN_HPD_HIGH' undeclared here (not in a function)
../drivers/media/platform/s5p-cec/s5p_cec.c:232:35: error: 'CEC_CAP_NEEDS_HPD' undeclared (first use in this function)
../include/media/cec.h:94:24: error: 'CEC_EVENT_PIN_HPD_HIGH' undeclared here (not in a function)
../include/media/cec.h:94:24: error: 'CEC_EVENT_PIN_HPD_HIGH' undeclared here (not in a function)
../include/media/cec.h:94:24: error: 'CEC_EVENT_PIN_HPD_HIGH' undeclared here (not in a function)
../include/media/cec.h:94:24: error: 'CEC_EVENT_PIN_HPD_HIGH' undeclared here (not in a function)
../include/media/cec.h:94:24: error: 'CEC_EVENT_PIN_HPD_HIGH' undeclared here (not in a function)
../include/media/cec.h:94:24: error: 'CEC_EVENT_PIN_HPD_HIGH' undeclared here (not in a function)
../include/media/cec.h:94:24: error: 'CEC_EVENT_PIN_HPD_HIGH' undeclared here (not in a function)
../include/media/cec.h:94:24: error: 'CEC_EVENT_PIN_HPD_HIGH' undeclared here (not in a function)
../include/media/cec.h:94:24: error: 'CEC_EVENT_PIN_HPD_HIGH' undeclared here (not in a function)
../include/media/cec.h:94:24: error: 'CEC_EVENT_PIN_HPD_HIGH' undeclared here (not in a function)
../include/media/cec.h:94:24: error: 'CEC_EVENT_PIN_HPD_HIGH' undeclared here (not in a function)
../include/media/cec.h:94:24: error: 'CEC_EVENT_PIN_HPD_HIGH' undeclared here (not in a function)
../include/media/cec.h:94:24: error: 'CEC_EVENT_PIN_HPD_HIGH' undeclared here (not in a function)
../include/media/cec.h:94:24: error: 'CEC_EVENT_PIN_HPD_HIGH' undeclared here (not in a function)
../include/media/cec.h:94:24: error: 'CEC_EVENT_PIN_HPD_HIGH' undeclared here (not in a function)
../include/media/cec.h:94:24: error: 'CEC_EVENT_PIN_HPD_HIGH' undeclared here (not in a function)
../include/media/cec.h:94:24: error: 'CEC_EVENT_PIN_HPD_HIGH' undeclared here (not in a function)
../include/media/cec.h:94:24: error: 'CEC_EVENT_PIN_HPD_HIGH' undeclared here (not in a function)
../drivers/media/platform/vivid/vivid-cec.c:285:54: error: 'CEC_CAP_MONITOR_PIN' undeclared (first use in this function)
../include/media/cec.h:94:24: error: 'CEC_EVENT_PIN_HPD_HIGH' undeclared here (not in a function)
../include/media/cec.h:94:24: error: 'CEC_EVENT_PIN_HPD_HIGH' undeclared here (not in a function)
../include/media/cec.h:94:24: error: 'CEC_EVENT_PIN_HPD_HIGH' undeclared here (not in a function)
../include/media/cec.h:94:24: error: 'CEC_EVENT_PIN_HPD_HIGH' undeclared here (not in a function)
../include/media/cec.h:94:24: error: 'CEC_EVENT_PIN_HPD_HIGH' undeclared here (not in a function)
../include/media/cec.h:94:24: error: 'CEC_EVENT_PIN_HPD_HIGH' undeclared here (not in a function)
arm-multi_v5_defconfig
../net/socket.c:714:28: error: 'SCM_TIMESTAMPING_PKTINFO' undeclared (first use in this function)
../net/socket.c:770:30: error: 'SCM_TIMESTAMPING_OPT_STATS' undeclared (first use in this function)
../net/core/sock.c:727:7: error: 'SO_REUSEPORT' undeclared (first use in this function)
../net/core/sock.c:930:7: error: 'SO_ATTACH_BPF' undeclared (first use in this function)
../net/core/sock.c:943:7: error: 'SO_ATTACH_REUSEPORT_CBPF' undeclared (first use in this function)
../net/core/sock.c:956:7: error: 'SO_ATTACH_REUSEPORT_EBPF' undeclared (first use in this function)
../net/core/sock.c:973:7: error: 'SO_LOCK_FILTER' undeclared (first use in this function)
../net/core/sock.c:1012:7: error: 'SO_SELECT_ERR_QUEUE' undeclared (first use in this function)
../net/core/sock.c:1017:7: error: 'SO_BUSY_POLL' undeclared (first use in this function)
../net/core/sock.c:1030:7: error: 'SO_MAX_PACING_RATE' undeclared (first use in this function)
../net/core/sock.c:1040:7: error: 'SO_INCOMING_CPU' undeclared (first use in this function)
../net/core/sock.c:1044:7: error: 'SO_CNX_ADVICE' undeclared (first use in this function)
../net/core/sock.c:1049:7: error: 'SO_ZEROCOPY' undeclared (first use in this function)
../net/core/sock.c:1144:7: error: 'SO_REUSEPORT' undeclared (first use in this function)
../net/core/sock.c:1250:7: error: 'SO_PEERGROUPS' undeclared (first use in this function)
../net/core/sock.c:1323:7: error: 'SO_GET_FILTER' undeclared (first use in this function)
../net/core/sock.c:1330:7: error: 'SO_LOCK_FILTER' undeclared (first use in this function)
../net/core/sock.c:1334:7: error: 'SO_BPF_EXTENSIONS' undeclared (first use in this function)
../net/core/sock.c:1338:7: error: 'SO_SELECT_ERR_QUEUE' undeclared (first use in this function)
../net/core/sock.c:1343:7: error: 'SO_BUSY_POLL' undeclared (first use in this function)
../net/core/sock.c:1348:7: error: 'SO_MAX_PACING_RATE' undeclared (first use in this function)
../net/core/sock.c:1352:7: error: 'SO_INCOMING_CPU' undeclared (first use in this function)
../net/core/sock.c:1356:7: error: 'SO_MEMINFO' undeclared (first use in this function)
../net/core/sock.c:1373:7: error: 'SO_INCOMING_NAPI_ID' undeclared (first use in this function)
../net/core/sock.c:1383:7: error: 'SO_COOKIE' undeclared (first use in this function)
../net/core/sock.c:1390:7: error: 'SO_ZEROCOPY' undeclared (first use in this function)
../net/core/filter.c:3214:8: error: 'SO_MAX_PACING_RATE' undeclared (first use in this function)
../net/sunrpc/xprtsock.c:1774:38: error: 'SO_REUSEPORT' undeclared (first use in this function)
arm-multi_v7_defconfig
../net/socket.c:714:28: error: 'SCM_TIMESTAMPING_PKTINFO' undeclared (first use in this function)
../net/socket.c:770:30: error: 'SCM_TIMESTAMPING_OPT_STATS' undeclared (first use in this function)
../net/core/sock.c:727:7: error: 'SO_REUSEPORT' undeclared (first use in this function)
../net/core/sock.c:930:7: error: 'SO_ATTACH_BPF' undeclared (first use in this function)
../net/core/sock.c:943:7: error: 'SO_ATTACH_REUSEPORT_CBPF' undeclared (first use in this function)
../net/core/sock.c:956:7: error: 'SO_ATTACH_REUSEPORT_EBPF' undeclared (first use in this function)
../net/core/sock.c:973:7: error: 'SO_LOCK_FILTER' undeclared (first use in this function)
../net/core/sock.c:1012:7: error: 'SO_SELECT_ERR_QUEUE' undeclared (first use in this function)
../net/core/sock.c:1017:7: error: 'SO_BUSY_POLL' undeclared (first use in this function)
../net/core/sock.c:1030:7: error: 'SO_MAX_PACING_RATE' undeclared (first use in this function)
../net/core/sock.c:1040:7: error: 'SO_INCOMING_CPU' undeclared (first use in this function)
../net/core/sock.c:1044:7: error: 'SO_CNX_ADVICE' undeclared (first use in this function)
../net/core/sock.c:1049:7: error: 'SO_ZEROCOPY' undeclared (first use in this function)
../net/core/sock.c:1144:7: error: 'SO_REUSEPORT' undeclared (first use in this function)
../net/core/sock.c:1250:7: error: 'SO_PEERGROUPS' undeclared (first use in this function)
../net/core/sock.c:1323:7: error: 'SO_GET_FILTER' undeclared (first use in this function)
../net/core/sock.c:1330:7: error: 'SO_LOCK_FILTER' undeclared (first use in this function)
../net/core/sock.c:1334:7: error: 'SO_BPF_EXTENSIONS' undeclared (first use in this function)
../net/core/sock.c:1338:7: error: 'SO_SELECT_ERR_QUEUE' undeclared (first use in this function)
../net/core/sock.c:1343:7: error: 'SO_BUSY_POLL' undeclared (first use in this function)
../net/core/sock.c:1348:7: error: 'SO_MAX_PACING_RATE' undeclared (first use in this function)
../net/core/sock.c:1352:7: error: 'SO_INCOMING_CPU' undeclared (first use in this function)
../net/core/sock.c:1356:7: error: 'SO_MEMINFO' undeclared (first use in this function)
../net/core/sock.c:1373:7: error: 'SO_INCOMING_NAPI_ID' undeclared (first use in this function)
../net/core/sock.c:1383:7: error: 'SO_COOKIE' undeclared (first use in this function)
../net/core/sock.c:1390:7: error: 'SO_ZEROCOPY' undeclared (first use in this function)
../net/core/filter.c:3214:8: error: 'SO_MAX_PACING_RATE' undeclared (first use in this function)
../include/media/cec.h:94:24: error: 'CEC_EVENT_PIN_HPD_HIGH' undeclared here (not in a function)
../include/media/cec.h:94:24: error: 'CEC_EVENT_PIN_HPD_HIGH' undeclared here (not in a function)
../include/media/cec.h:94:24: error: 'CEC_EVENT_PIN_HPD_HIGH' undeclared here (not in a function)
../include/media/cec.h:94:24: error: 'CEC_EVENT_PIN_HPD_HIGH' undeclared here (not in a function)
../include/media/cec.h:94:24: error: 'CEC_EVENT_PIN_HPD_HIGH' undeclared here (not in a function)
../drivers/media/cec/cec-core.c:230:27: error: 'CEC_CAP_NEEDS_HPD' undeclared (first use in this function)
../include/media/cec.h:94:24: error: 'CEC_EVENT_PIN_HPD_HIGH' undeclared here (not in a function)
../include/linux/build_bug.h:30:45: error: bit-field '<anonymous>' width not an integer constant
../drivers/media/cec/cec-adap.c:136:22: error: 'CEC_EVENT_FL_DROPPED_EVENTS' undeclared (first use in this function)
../drivers/media/cec/cec-adap.c:160:22: error: 'CEC_EVENT_PIN_CEC_HIGH' undeclared (first use in this function)
../drivers/media/cec/cec-adap.c:161:8: error: 'CEC_EVENT_PIN_CEC_LOW' undeclared (first use in this function)
../drivers/media/cec/cec-adap.c:167:28: error: 'CEC_MODE_MONITOR_PIN' undeclared (first use in this function)
../drivers/media/cec/cec-adap.c:178:8: error: 'CEC_EVENT_PIN_HPD_LOW' undeclared (first use in this function)
../drivers/media/cec/cec-adap.c:710:17: error: 'CEC_MSG_FL_REPLY_TO_FOLLOWERS' undeclared (first use in this function)
../drivers/media/cec/cec-adap.c:1403:21: error: 'CEC_LOG_ADDRS_FL_CDC_ONLY' undeclared (first use in this function)
../drivers/media/cec/cec-adap.c:1563:25: error: 'CEC_LOG_ADDRS_FL_CDC_ONLY' undeclared (first use in this function)
../drivers/media/cec/cec-adap.c:1798:6: error: implicit declaration of function 'cec_is_cdc_only' [-Werror=implicit-function-declaration]
../drivers/media/cec/cec-adap.c:1878:33: error: 'CEC_LOG_ADDRS_FL_ALLOW_RC_PASSTHRU' undeclared (first use in this function)
../drivers/media/cec/cec-adap.c:2019:33: error: 'CEC_MSG_FL_REPLY_TO_FOLLOWERS' undeclared (first use in this function)
../include/media/cec.h:94:24: error: 'CEC_EVENT_PIN_HPD_HIGH' undeclared here (not in a function)
../drivers/media/cec/cec-api.c:168:7: error: 'CEC_LOG_ADDRS_FL_ALLOW_RC_PASSTHRU' undeclared (first use in this function)
../drivers/media/cec/cec-api.c:169:7: error: 'CEC_LOG_ADDRS_FL_CDC_ONLY' undeclared (first use in this function)
../drivers/media/cec/cec-api.c:198:31: error: 'CEC_LOG_ADDRS_FL_CDC_ONLY' undeclared (first use in this function)
../drivers/media/cec/cec-api.c:381:23: error: 'CEC_MODE_MONITOR_PIN' undeclared (first use in this function)
../drivers/media/cec/cec-api.c:382:29: error: 'CEC_CAP_MONITOR_PIN' undeclared (first use in this function)
../drivers/media/cec/cec-api.c:452:38: error: 'CEC_EVENT_PIN_CEC_HIGH' undeclared (first use in this function)
../drivers/media/cec/cec-api.c:453:10: error: 'CEC_EVENT_PIN_CEC_LOW' undeclared (first use in this function)
../drivers/media/cec/cec-api.c:610:27: error: 'CEC_MODE_MONITOR_PIN' undeclared (first use in this function)
../include/media/cec.h:94:24: error: 'CEC_EVENT_PIN_HPD_HIGH' undeclared here (not in a function)
../net/sunrpc/xprtsock.c:1774:38: error: 'SO_REUSEPORT' undeclared (first use in this function)
../include/media/cec.h:94:24: error: 'CEC_EVENT_PIN_HPD_HIGH' undeclared here (not in a function)
../include/media/cec.h:94:24: error: 'CEC_EVENT_PIN_HPD_HIGH' undeclared here (not in a function)
../include/media/cec.h:94:24: error: 'CEC_EVENT_PIN_HPD_HIGH' undeclared here (not in a function)
../include/media/cec.h:94:24: error: 'CEC_EVENT_PIN_HPD_HIGH' undeclared here (not in a function)
../include/media/cec.h:94:24: error: 'CEC_EVENT_PIN_HPD_HIGH' undeclared here (not in a function)
../include/media/cec.h:94:24: error: 'CEC_EVENT_PIN_HPD_HIGH' undeclared here (not in a function)
../include/media/cec.h:94:24: error: 'CEC_EVENT_PIN_HPD_HIGH' undeclared here (not in a function)
../include/media/cec.h:94:24: error: 'CEC_EVENT_PIN_HPD_HIGH' undeclared here (not in a function)
../include/media/cec.h:94:24: error: 'CEC_EVENT_PIN_HPD_HIGH' undeclared here (not in a function)
../include/media/cec.h:94:24: error: 'CEC_EVENT_PIN_HPD_HIGH' undeclared here (not in a function)
../include/media/cec.h:94:24: error: 'CEC_EVENT_PIN_HPD_HIGH' undeclared here (not in a function)
../include/media/cec.h:94:24: error: 'CEC_EVENT_PIN_HPD_HIGH' undeclared here (not in a function)
../include/media/cec.h:94:24: error: 'CEC_EVENT_PIN_HPD_HIGH' undeclared here (not in a function)
../include/media/cec.h:94:24: error: 'CEC_EVENT_PIN_HPD_HIGH' undeclared here (not in a function)
../include/media/cec.h:94:24: error: 'CEC_EVENT_PIN_HPD_HIGH' undeclared here (not in a function)
../include/media/cec.h:94:24: error: 'CEC_EVENT_PIN_HPD_HIGH' undeclared here (not in a function)
../include/media/cec.h:94:24: error: 'CEC_EVENT_PIN_HPD_HIGH' undeclared here (not in a function)
../include/media/cec.h:94:24: error: 'CEC_EVENT_PIN_HPD_HIGH' undeclared here (not in a function)
../include/media/cec.h:94:24: error: 'CEC_EVENT_PIN_HPD_HIGH' undeclared here (not in a function)
../include/media/cec.h:94:24: error: 'CEC_EVENT_PIN_HPD_HIGH' undeclared here (not in a function)
../include/media/cec.h:94:24: error: 'CEC_EVENT_PIN_HPD_HIGH' undeclared here (not in a function)
../include/media/cec.h:94:24: error: 'CEC_EVENT_PIN_HPD_HIGH' undeclared here (not in a function)
../include/media/cec.h:94:24: error: 'CEC_EVENT_PIN_HPD_HIGH' undeclared here (not in a function)
arm-allmodconfig
../net/socket.c:714:28: error: 'SCM_TIMESTAMPING_PKTINFO' undeclared (first use in this function)
../net/socket.c:770:30: error: 'SCM_TIMESTAMPING_OPT_STATS' undeclared (first use in this function)
../net/core/sock.c:727:7: error: 'SO_REUSEPORT' undeclared (first use in this function)
../net/core/sock.c:930:7: error: 'SO_ATTACH_BPF' undeclared (first use in this function)
../net/core/sock.c:943:7: error: 'SO_ATTACH_REUSEPORT_CBPF' undeclared (first use in this function)
../net/core/sock.c:956:7: error: 'SO_ATTACH_REUSEPORT_EBPF' undeclared (first use in this function)
../net/core/sock.c:973:7: error: 'SO_LOCK_FILTER' undeclared (first use in this function)
../net/core/sock.c:1012:7: error: 'SO_SELECT_ERR_QUEUE' undeclared (first use in this function)
../net/core/sock.c:1017:7: error: 'SO_BUSY_POLL' undeclared (first use in this function)
../net/core/sock.c:1030:7: error: 'SO_MAX_PACING_RATE' undeclared (first use in this function)
../net/core/sock.c:1040:7: error: 'SO_INCOMING_CPU' undeclared (first use in this function)
../net/core/sock.c:1044:7: error: 'SO_CNX_ADVICE' undeclared (first use in this function)
../net/core/sock.c:1049:7: error: 'SO_ZEROCOPY' undeclared (first use in this function)
../net/core/sock.c:1144:7: error: 'SO_REUSEPORT' undeclared (first use in this function)
../net/core/sock.c:1250:7: error: 'SO_PEERGROUPS' undeclared (first use in this function)
../net/core/sock.c:1323:7: error: 'SO_GET_FILTER' undeclared (first use in this function)
../net/core/sock.c:1330:7: error: 'SO_LOCK_FILTER' undeclared (first use in this function)
../net/core/sock.c:1334:7: error: 'SO_BPF_EXTENSIONS' undeclared (first use in this function)
../net/core/sock.c:1338:7: error: 'SO_SELECT_ERR_QUEUE' undeclared (first use in this function)
../net/core/sock.c:1343:7: error: 'SO_BUSY_POLL' undeclared (first use in this function)
../net/core/sock.c:1348:7: error: 'SO_MAX_PACING_RATE' undeclared (first use in this function)
../net/core/sock.c:1352:7: error: 'SO_INCOMING_CPU' undeclared (first use in this function)
../net/core/sock.c:1356:7: error: 'SO_MEMINFO' undeclared (first use in this function)
../net/core/sock.c:1373:7: error: 'SO_INCOMING_NAPI_ID' undeclared (first use in this function)
../net/core/sock.c:1383:7: error: 'SO_COOKIE' undeclared (first use in this function)
../net/core/sock.c:1390:7: error: 'SO_ZEROCOPY' undeclared (first use in this function)
../net/core/filter.c:3214:8: error: 'SO_MAX_PACING_RATE' undeclared (first use in this function)
../include/media/cec.h:94:24: error: 'CEC_EVENT_PIN_HPD_HIGH' undeclared here (not in a function)
../include/media/cec.h:94:24: error: 'CEC_EVENT_PIN_HPD_HIGH' undeclared here (not in a function)
../include/media/cec.h:94:24: error: 'CEC_EVENT_PIN_HPD_HIGH' undeclared here (not in a function)
../include/media/cec.h:94:24: error: 'CEC_EVENT_PIN_HPD_HIGH' undeclared here (not in a function)
../include/media/cec.h:94:24: error: 'CEC_EVENT_PIN_HPD_HIGH' undeclared here (not in a function)
../include/media/cec.h:94:24: error: 'CEC_EVENT_PIN_HPD_HIGH' undeclared here (not in a function)
../include/media/cec.h:94:24: error: 'CEC_EVENT_PIN_HPD_HIGH' undeclared here (not in a function)
../include/media/cec.h:94:24: error: 'CEC_EVENT_PIN_HPD_HIGH' undeclared here (not in a function)
../include/media/cec.h:94:24: error: 'CEC_EVENT_PIN_HPD_HIGH' undeclared here (not in a function)
../include/media/cec.h:94:24: error: 'CEC_EVENT_PIN_HPD_HIGH' undeclared here (not in a function)
../include/media/cec.h:94:24: error: 'CEC_EVENT_PIN_HPD_HIGH' undeclared here (not in a function)
../include/media/cec.h:94:24: error: 'CEC_EVENT_PIN_HPD_HIGH' undeclared here (not in a function)
../include/media/cec.h:94:24: error: 'CEC_EVENT_PIN_HPD_HIGH' undeclared here (not in a function)
../include/media/cec.h:94:24: error: 'CEC_EVENT_PIN_HPD_HIGH' undeclared here (not in a function)
../include/media/cec.h:94:24: error: 'CEC_EVENT_PIN_HPD_HIGH' undeclared here (not in a function)
../include/media/cec.h:94:24: error: 'CEC_EVENT_PIN_HPD_HIGH' undeclared here (not in a function)
../include/media/cec.h:94:24: error: 'CEC_EVENT_PIN_HPD_HIGH' undeclared here (not in a function)
../include/media/cec.h:94:24: error: 'CEC_EVENT_PIN_HPD_HIGH' undeclared here (not in a function)
../include/media/cec.h:94:24: error: 'CEC_EVENT_PIN_HPD_HIGH' undeclared here (not in a function)
../include/media/cec.h:94:24: error: 'CEC_EVENT_PIN_HPD_HIGH' undeclared here (not in a function)
../include/media/cec.h:94:24: error: 'CEC_EVENT_PIN_HPD_HIGH' undeclared here (not in a function)
../drivers/media/cec/cec-core.c:230:27: error: 'CEC_CAP_NEEDS_HPD' undeclared (first use in this function)
../include/media/cec.h:94:24: error: 'CEC_EVENT_PIN_HPD_HIGH' undeclared here (not in a function)
../include/linux/build_bug.h:30:45: error: bit-field '<anonymous>' width not an integer constant
../drivers/media/cec/cec-adap.c:136:22: error: 'CEC_EVENT_FL_DROPPED_EVENTS' undeclared (first use in this function)
../drivers/media/cec/cec-adap.c:160:22: error: 'CEC_EVENT_PIN_CEC_HIGH' undeclared (first use in this function)
../drivers/media/cec/cec-adap.c:161:8: error: 'CEC_EVENT_PIN_CEC_LOW' undeclared (first use in this function)
../drivers/media/cec/cec-adap.c:167:28: error: 'CEC_MODE_MONITOR_PIN' undeclared (first use in this function)
../drivers/media/cec/cec-adap.c:178:8: error: 'CEC_EVENT_PIN_HPD_LOW' undeclared (first use in this function)
../drivers/media/cec/cec-adap.c:710:17: error: 'CEC_MSG_FL_REPLY_TO_FOLLOWERS' undeclared (first use in this function)
../drivers/media/cec/cec-adap.c:1403:21: error: 'CEC_LOG_ADDRS_FL_CDC_ONLY' undeclared (first use in this function)
../drivers/media/cec/cec-adap.c:1563:25: error: 'CEC_LOG_ADDRS_FL_CDC_ONLY' undeclared (first use in this function)
../drivers/media/cec/cec-adap.c:1798:6: error: implicit declaration of function 'cec_is_cdc_only' [-Werror=implicit-function-declaration]
../drivers/media/cec/cec-adap.c:1878:33: error: 'CEC_LOG_ADDRS_FL_ALLOW_RC_PASSTHRU' undeclared (first use in this function)
../drivers/media/cec/cec-adap.c:2019:33: error: 'CEC_MSG_FL_REPLY_TO_FOLLOWERS' undeclared (first use in this function)
../include/media/cec.h:94:24: error: 'CEC_EVENT_PIN_HPD_HIGH' undeclared here (not in a function)
../drivers/media/cec/cec-api.c:168:7: error: 'CEC_LOG_ADDRS_FL_ALLOW_RC_PASSTHRU' undeclared (first use in this function)
../drivers/media/cec/cec-api.c:169:7: error: 'CEC_LOG_ADDRS_FL_CDC_ONLY' undeclared (first use in this function)
../drivers/media/cec/cec-api.c:198:31: error: 'CEC_LOG_ADDRS_FL_CDC_ONLY' undeclared (first use in this function)
../drivers/media/cec/cec-api.c:381:23: error: 'CEC_MODE_MONITOR_PIN' undeclared (first use in this function)
../drivers/media/cec/cec-api.c:382:29: error: 'CEC_CAP_MONITOR_PIN' undeclared (first use in this function)
../drivers/media/cec/cec-api.c:452:38: error: 'CEC_EVENT_PIN_CEC_HIGH' undeclared (first use in this function)
../drivers/media/cec/cec-api.c:453:10: error: 'CEC_EVENT_PIN_CEC_LOW' undeclared (first use in this function)
../drivers/media/cec/cec-api.c:581:7: error: 'CEC_EVENT_PIN_HPD_LOW' undeclared (first use in this function)
../drivers/media/cec/cec-api.c:610:27: error: 'CEC_MODE_MONITOR_PIN' undeclared (first use in this function)
../include/media/cec.h:94:24: error: 'CEC_EVENT_PIN_HPD_HIGH' undeclared here (not in a function)
../include/media/cec.h:94:24: error: 'CEC_EVENT_PIN_HPD_HIGH' undeclared here (not in a function)
../include/media/cec.h:94:24: error: 'CEC_EVENT_PIN_HPD_HIGH' undeclared here (not in a function)
../drivers/media/cec/cec-pin.c:797:37: error: 'CEC_CAP_MONITOR_PIN' undeclared (first use in this function)
../include/media/cec.h:94:24: error: 'CEC_EVENT_PIN_HPD_HIGH' undeclared here (not in a function)
../include/media/cec.h:94:24: error: 'CEC_EVENT_PIN_HPD_HIGH' undeclared here (not in a function)
../include/media/cec.h:94:24: error: 'CEC_EVENT_PIN_HPD_HIGH' undeclared here (not in a function)
../include/media/cec.h:94:24: error: 'CEC_EVENT_PIN_HPD_HIGH' undeclared here (not in a function)
../include/media/cec.h:94:24: error: 'CEC_EVENT_PIN_HPD_HIGH' undeclared here (not in a function)
../include/media/cec.h:94:24: error: 'CEC_EVENT_PIN_HPD_HIGH' undeclared here (not in a function)
../include/media/cec.h:94:24: error: 'CEC_EVENT_PIN_HPD_HIGH' undeclared here (not in a function)
../net/sunrpc/xprtsock.c:1774:38: error: 'SO_REUSEPORT' undeclared (first use in this function)
../include/media/cec.h:94:24: error: 'CEC_EVENT_PIN_HPD_HIGH' undeclared here (not in a function)
../include/media/cec.h:94:24: error: 'CEC_EVENT_PIN_HPD_HIGH' undeclared here (not in a function)
../drivers/media/platform/s5p-cec/s5p_cec.c:232:35: error: 'CEC_CAP_NEEDS_HPD' undeclared (first use in this function)
../include/media/cec.h:94:24: error: 'CEC_EVENT_PIN_HPD_HIGH' undeclared here (not in a function)
../include/media/cec.h:94:24: error: 'CEC_EVENT_PIN_HPD_HIGH' undeclared here (not in a function)
../include/media/cec.h:94:24: error: 'CEC_EVENT_PIN_HPD_HIGH' undeclared here (not in a function)
../include/media/cec.h:94:24: error: 'CEC_EVENT_PIN_HPD_HIGH' undeclared here (not in a function)
../include/media/cec.h:94:24: error: 'CEC_EVENT_PIN_HPD_HIGH' undeclared here (not in a function)
../include/media/cec.h:94:24: error: 'CEC_EVENT_PIN_HPD_HIGH' undeclared here (not in a function)
../include/media/cec.h:94:24: error: 'CEC_EVENT_PIN_HPD_HIGH' undeclared here (not in a function)
../include/media/cec.h:94:24: error: 'CEC_EVENT_PIN_HPD_HIGH' undeclared here (not in a function)
../include/media/cec.h:94:24: error: 'CEC_EVENT_PIN_HPD_HIGH' undeclared here (not in a function)
../include/media/cec.h:94:24: error: 'CEC_EVENT_PIN_HPD_HIGH' undeclared here (not in a function)
../include/media/cec.h:94:24: error: 'CEC_EVENT_PIN_HPD_HIGH' undeclared here (not in a function)
../include/media/cec.h:94:24: error: 'CEC_EVENT_PIN_HPD_HIGH' undeclared here (not in a function)
../include/media/cec.h:94:24: error: 'CEC_EVENT_PIN_HPD_HIGH' undeclared here (not in a function)
../include/media/cec.h:94:24: error: 'CEC_EVENT_PIN_HPD_HIGH' undeclared here (not in a function)
../include/media/cec.h:94:24: error: 'CEC_EVENT_PIN_HPD_HIGH' undeclared here (not in a function)
../include/media/cec.h:94:24: error: 'CEC_EVENT_PIN_HPD_HIGH' undeclared here (not in a function)
../include/media/cec.h:94:24: error: 'CEC_EVENT_PIN_HPD_HIGH' undeclared here (not in a function)
../include/media/cec.h:94:24: error: 'CEC_EVENT_PIN_HPD_HIGH' undeclared here (not in a function)
../include/media/cec.h:94:24: error: 'CEC_EVENT_PIN_HPD_HIGH' undeclared here (not in a function)
../drivers/media/platform/vivid/vivid-cec.c:285:54: error: 'CEC_CAP_MONITOR_PIN' undeclared (first use in this function)
../include/media/cec.h:94:24: error: 'CEC_EVENT_PIN_HPD_HIGH' undeclared here (not in a function)
../include/media/cec.h:94:24: error: 'CEC_EVENT_PIN_HPD_HIGH' undeclared here (not in a function)
../arch/arm/include/asm/parport.h:12:22: error: expected '=', ',', ';', 'asm' or '__attribute__' before 'parport_pc_find_isa_ports'
../arch/arm/include/asm/parport.h:13:22: error: expected '=', ',', ';', 'asm' or '__attribute__' before 'parport_pc_find_nonpci_ports'
../drivers/parport/parport_pc.c:3070:2: error: implicit declaration of function 'parport_pc_find_nonpci_ports' [-Werror=implicit-function-declaration]
x86_64-allmodconfig
../include/media/cec.h:94:24: error: 'CEC_EVENT_PIN_HPD_HIGH' undeclared here (not in a function)
../include/media/cec.h:94:24: error: 'CEC_EVENT_PIN_HPD_HIGH' undeclared here (not in a function)
../include/media/cec.h:94:24: error: 'CEC_EVENT_PIN_HPD_HIGH' undeclared here (not in a function)
../include/media/cec.h:94:24: error: 'CEC_EVENT_PIN_HPD_HIGH' undeclared here (not in a function)
../include/media/cec.h:94:24: error: 'CEC_EVENT_PIN_HPD_HIGH' undeclared here (not in a function)
../include/media/cec.h:94:24: error: 'CEC_EVENT_PIN_HPD_HIGH' undeclared here (not in a function)
../drivers/media/cec/cec-core.c:230:27: error: 'CEC_CAP_NEEDS_HPD' undeclared (first use in this function)
../include/media/cec.h:94:24: error: 'CEC_EVENT_PIN_HPD_HIGH' undeclared here (not in a function)
../include/linux/build_bug.h:30:45: error: bit-field '<anonymous>' width not an integer constant
../drivers/media/cec/cec-adap.c:136:22: error: 'CEC_EVENT_FL_DROPPED_EVENTS' undeclared (first use in this function)
../drivers/media/cec/cec-adap.c:160:22: error: 'CEC_EVENT_PIN_CEC_HIGH' undeclared (first use in this function)
../drivers/media/cec/cec-adap.c:161:8: error: 'CEC_EVENT_PIN_CEC_LOW' undeclared (first use in this function)
../drivers/media/cec/cec-adap.c:167:28: error: 'CEC_MODE_MONITOR_PIN' undeclared (first use in this function)
../drivers/media/cec/cec-adap.c:178:8: error: 'CEC_EVENT_PIN_HPD_LOW' undeclared (first use in this function)
../drivers/media/cec/cec-adap.c:710:17: error: 'CEC_MSG_FL_REPLY_TO_FOLLOWERS' undeclared (first use in this function)
../drivers/media/cec/cec-adap.c:1403:21: error: 'CEC_LOG_ADDRS_FL_CDC_ONLY' undeclared (first use in this function)
../drivers/media/cec/cec-adap.c:1563:25: error: 'CEC_LOG_ADDRS_FL_CDC_ONLY' undeclared (first use in this function)
../drivers/media/cec/cec-adap.c:1798:6: error: implicit declaration of function 'cec_is_cdc_only' [-Werror=implicit-function-declaration]
../drivers/media/cec/cec-adap.c:1878:33: error: 'CEC_LOG_ADDRS_FL_ALLOW_RC_PASSTHRU' undeclared (first use in this function)
../drivers/media/cec/cec-adap.c:2019:33: error: 'CEC_MSG_FL_REPLY_TO_FOLLOWERS' undeclared (first use in this function)
../include/media/cec.h:94:24: error: 'CEC_EVENT_PIN_HPD_HIGH' undeclared here (not in a function)
../drivers/media/cec/cec-api.c:168:7: error: 'CEC_LOG_ADDRS_FL_ALLOW_RC_PASSTHRU' undeclared (first use in this function)
../drivers/media/cec/cec-api.c:169:7: error: 'CEC_LOG_ADDRS_FL_CDC_ONLY' undeclared (first use in this function)
../drivers/media/cec/cec-api.c:198:31: error: 'CEC_LOG_ADDRS_FL_CDC_ONLY' undeclared (first use in this function)
../drivers/media/cec/cec-api.c:381:23: error: 'CEC_MODE_MONITOR_PIN' undeclared (first use in this function)
../drivers/media/cec/cec-api.c:382:29: error: 'CEC_CAP_MONITOR_PIN' undeclared (first use in this function)
../drivers/media/cec/cec-api.c:452:38: error: 'CEC_EVENT_PIN_CEC_HIGH' undeclared (first use in this function)
../drivers/media/cec/cec-api.c:453:10: error: 'CEC_EVENT_PIN_CEC_LOW' undeclared (first use in this function)
../drivers/media/cec/cec-api.c:610:27: error: 'CEC_MODE_MONITOR_PIN' undeclared (first use in this function)
../include/media/cec.h:94:24: error: 'CEC_EVENT_PIN_HPD_HIGH' undeclared here (not in a function)
../include/media/cec.h:94:24: error: 'CEC_EVENT_PIN_HPD_HIGH' undeclared here (not in a function)
../include/media/cec.h:94:24: error: 'CEC_EVENT_PIN_HPD_HIGH' undeclared here (not in a function)
../include/media/cec.h:94:24: error: 'CEC_EVENT_PIN_HPD_HIGH' undeclared here (not in a function)
../include/media/cec.h:94:24: error: 'CEC_EVENT_PIN_HPD_HIGH' undeclared here (not in a function)
../include/media/cec.h:94:24: error: 'CEC_EVENT_PIN_HPD_HIGH' undeclared here (not in a function)
../include/media/cec.h:94:24: error: 'CEC_EVENT_PIN_HPD_HIGH' undeclared here (not in a function)
../include/media/cec.h:94:24: error: 'CEC_EVENT_PIN_HPD_HIGH' undeclared here (not in a function)
../drivers/media/platform/s5p-cec/s5p_cec.c:232:35: error: 'CEC_CAP_NEEDS_HPD' undeclared (first use in this function)
../include/media/cec.h:94:24: error: 'CEC_EVENT_PIN_HPD_HIGH' undeclared here (not in a function)
../include/media/cec.h:94:24: error: 'CEC_EVENT_PIN_HPD_HIGH' undeclared here (not in a function)
../include/media/cec.h:94:24: error: 'CEC_EVENT_PIN_HPD_HIGH' undeclared here (not in a function)
../include/media/cec.h:94:24: error: 'CEC_EVENT_PIN_HPD_HIGH' undeclared here (not in a function)
../include/media/cec.h:94:24: error: 'CEC_EVENT_PIN_HPD_HIGH' undeclared here (not in a function)
../include/media/cec.h:94:24: error: 'CEC_EVENT_PIN_HPD_HIGH' undeclared here (not in a function)
../include/media/cec.h:94:24: error: 'CEC_EVENT_PIN_HPD_HIGH' undeclared here (not in a function)
../include/media/cec.h:94:24: error: 'CEC_EVENT_PIN_HPD_HIGH' undeclared here (not in a function)
../include/media/cec.h:94:24: error: 'CEC_EVENT_PIN_HPD_HIGH' undeclared here (not in a function)
../include/media/cec.h:94:24: error: 'CEC_EVENT_PIN_HPD_HIGH' undeclared here (not in a function)
../include/media/cec.h:94:24: error: 'CEC_EVENT_PIN_HPD_HIGH' undeclared here (not in a function)
../include/media/cec.h:94:24: error: 'CEC_EVENT_PIN_HPD_HIGH' undeclared here (not in a function)
../include/media/cec.h:94:24: error: 'CEC_EVENT_PIN_HPD_HIGH' undeclared here (not in a function)
../include/media/cec.h:94:24: error: 'CEC_EVENT_PIN_HPD_HIGH' undeclared here (not in a function)
../include/media/cec.h:94:24: error: 'CEC_EVENT_PIN_HPD_HIGH' undeclared here (not in a function)
../include/media/cec.h:94:24: error: 'CEC_EVENT_PIN_HPD_HIGH' undeclared here (not in a function)
../include/media/cec.h:94:24: error: 'CEC_EVENT_PIN_HPD_HIGH' undeclared here (not in a function)
../include/media/cec.h:94:24: error: 'CEC_EVENT_PIN_HPD_HIGH' undeclared here (not in a function)
../include/media/cec.h:94:24: error: 'CEC_EVENT_PIN_HPD_HIGH' undeclared here (not in a function)
../drivers/media/platform/vivid/vivid-cec.c:285:54: error: 'CEC_CAP_MONITOR_PIN' undeclared (first use in this function)
../include/media/cec.h:94:24: error: 'CEC_EVENT_PIN_HPD_HIGH' undeclared here (not in a function)
../include/media/cec.h:94:24: error: 'CEC_EVENT_PIN_HPD_HIGH' undeclared here (not in a function)
arm64-defconfig
../include/media/cec.h:94:24: error: 'CEC_EVENT_PIN_HPD_HIGH' undeclared here (not in a function)
../include/media/cec.h:94:24: error: 'CEC_EVENT_PIN_HPD_HIGH' undeclared here (not in a function)
../include/media/cec.h:94:24: error: 'CEC_EVENT_PIN_HPD_HIGH' undeclared here (not in a function)
../include/media/cec.h:94:24: error: 'CEC_EVENT_PIN_HPD_HIGH' undeclared here (not in a function)
../include/media/cec.h:94:24: error: 'CEC_EVENT_PIN_HPD_HIGH' undeclared here (not in a function)
../include/media/cec.h:94:24: error: 'CEC_EVENT_PIN_HPD_HIGH' undeclared here (not in a function)
../include/media/cec.h:94:24: error: 'CEC_EVENT_PIN_HPD_HIGH' undeclared here (not in a function)
../include/media/cec.h:94:24: error: 'CEC_EVENT_PIN_HPD_HIGH' undeclared here (not in a function)
../drivers/media/cec/cec-core.c:230:27: error: 'CEC_CAP_NEEDS_HPD' undeclared (first use in this function)
../include/media/cec.h:94:24: error: 'CEC_EVENT_PIN_HPD_HIGH' undeclared here (not in a function)
../include/linux/build_bug.h:30:45: error: bit-field '<anonymous>' width not an integer constant
../drivers/media/cec/cec-adap.c:136:22: error: 'CEC_EVENT_FL_DROPPED_EVENTS' undeclared (first use in this function)
../drivers/media/cec/cec-adap.c:160:22: error: 'CEC_EVENT_PIN_CEC_HIGH' undeclared (first use in this function)
../drivers/media/cec/cec-adap.c:161:8: error: 'CEC_EVENT_PIN_CEC_LOW' undeclared (first use in this function)
../drivers/media/cec/cec-adap.c:167:28: error: 'CEC_MODE_MONITOR_PIN' undeclared (first use in this function)
../drivers/media/cec/cec-adap.c:178:8: error: 'CEC_EVENT_PIN_HPD_LOW' undeclared (first use in this function)
../drivers/media/cec/cec-adap.c:710:17: error: 'CEC_MSG_FL_REPLY_TO_FOLLOWERS' undeclared (first use in this function)
../drivers/media/cec/cec-adap.c:1403:21: error: 'CEC_LOG_ADDRS_FL_CDC_ONLY' undeclared (first use in this function)
../drivers/media/cec/cec-adap.c:1563:25: error: 'CEC_LOG_ADDRS_FL_CDC_ONLY' undeclared (first use in this function)
../drivers/media/cec/cec-adap.c:1798:6: error: implicit declaration of function 'cec_is_cdc_only' [-Werror=implicit-function-declaration]
../drivers/media/cec/cec-adap.c:1878:33: error: 'CEC_LOG_ADDRS_FL_ALLOW_RC_PASSTHRU' undeclared (first use in this function)
../drivers/media/cec/cec-adap.c:2019:33: error: 'CEC_MSG_FL_REPLY_TO_FOLLOWERS' undeclared (first use in this function)
../include/media/cec.h:94:24: error: 'CEC_EVENT_PIN_HPD_HIGH' undeclared here (not in a function)
../drivers/media/cec/cec-api.c:168:7: error: 'CEC_LOG_ADDRS_FL_ALLOW_RC_PASSTHRU' undeclared (first use in this function)
../drivers/media/cec/cec-api.c:169:7: error: 'CEC_LOG_ADDRS_FL_CDC_ONLY' undeclared (first use in this function)
../drivers/media/cec/cec-api.c:198:31: error: 'CEC_LOG_ADDRS_FL_CDC_ONLY' undeclared (first use in this function)
../drivers/media/cec/cec-api.c:381:23: error: 'CEC_MODE_MONITOR_PIN' undeclared (first use in this function)
../drivers/media/cec/cec-api.c:382:29: error: 'CEC_CAP_MONITOR_PIN' undeclared (first use in this function)
../drivers/media/cec/cec-api.c:452:38: error: 'CEC_EVENT_PIN_CEC_HIGH' undeclared (first use in this function)
../drivers/media/cec/cec-api.c:453:10: error: 'CEC_EVENT_PIN_CEC_LOW' undeclared (first use in this function)
../drivers/media/cec/cec-api.c:610:27: error: 'CEC_MODE_MONITOR_PIN' undeclared (first use in this function)
../include/media/cec.h:94:24: error: 'CEC_EVENT_PIN_HPD_HIGH' undeclared here (not in a function)
-------------------------------------------------------------------------------
defconfigs with issues (other than build errors):
1 warnings 0 mismatches : arm64-allmodconfig
1 warnings 0 mismatches : arm-multi_v7_defconfig
1 warnings 0 mismatches : arm-allmodconfig
2 warnings 0 mismatches : x86_64-allmodconfig
1 warnings 0 mismatches : arm64-defconfig
-------------------------------------------------------------------------------
Errors summary: 57
175 ../include/media/cec.h:94:24: error: 'CEC_EVENT_PIN_HPD_HIGH' undeclared here (not in a function)
5 ../include/linux/build_bug.h:30:45: error: bit-field '<anonymous>' width not an integer constant
5 ../drivers/media/cec/cec-core.c:230:27: error: 'CEC_CAP_NEEDS_HPD' undeclared (first use in this function)
5 ../drivers/media/cec/cec-api.c:610:27: error: 'CEC_MODE_MONITOR_PIN' undeclared (first use in this function)
5 ../drivers/media/cec/cec-api.c:453:10: error: 'CEC_EVENT_PIN_CEC_LOW' undeclared (first use in this function)
5 ../drivers/media/cec/cec-api.c:452:38: error: 'CEC_EVENT_PIN_CEC_HIGH' undeclared (first use in this function)
5 ../drivers/media/cec/cec-api.c:382:29: error: 'CEC_CAP_MONITOR_PIN' undeclared (first use in this function)
5 ../drivers/media/cec/cec-api.c:381:23: error: 'CEC_MODE_MONITOR_PIN' undeclared (first use in this function)
5 ../drivers/media/cec/cec-api.c:198:31: error: 'CEC_LOG_ADDRS_FL_CDC_ONLY' undeclared (first use in this function)
5 ../drivers/media/cec/cec-api.c:169:7: error: 'CEC_LOG_ADDRS_FL_CDC_ONLY' undeclared (first use in this function)
5 ../drivers/media/cec/cec-api.c:168:7: error: 'CEC_LOG_ADDRS_FL_ALLOW_RC_PASSTHRU' undeclared (first use in this function)
5 ../drivers/media/cec/cec-adap.c:710:17: error: 'CEC_MSG_FL_REPLY_TO_FOLLOWERS' undeclared (first use in this function)
5 ../drivers/media/cec/cec-adap.c:2019:33: error: 'CEC_MSG_FL_REPLY_TO_FOLLOWERS' undeclared (first use in this function)
5 ../drivers/media/cec/cec-adap.c:1878:33: error: 'CEC_LOG_ADDRS_FL_ALLOW_RC_PASSTHRU' undeclared (first use in this function)
5 ../drivers/media/cec/cec-adap.c:1798:6: error: implicit declaration of function 'cec_is_cdc_only' [-Werror=implicit-function-declaration]
5 ../drivers/media/cec/cec-adap.c:178:8: error: 'CEC_EVENT_PIN_HPD_LOW' undeclared (first use in this function)
5 ../drivers/media/cec/cec-adap.c:167:28: error: 'CEC_MODE_MONITOR_PIN' undeclared (first use in this function)
5 ../drivers/media/cec/cec-adap.c:161:8: error: 'CEC_EVENT_PIN_CEC_LOW' undeclared (first use in this function)
5 ../drivers/media/cec/cec-adap.c:160:22: error: 'CEC_EVENT_PIN_CEC_HIGH' undeclared (first use in this function)
5 ../drivers/media/cec/cec-adap.c:1563:25: error: 'CEC_LOG_ADDRS_FL_CDC_ONLY' undeclared (first use in this function)
5 ../drivers/media/cec/cec-adap.c:1403:21: error: 'CEC_LOG_ADDRS_FL_CDC_ONLY' undeclared (first use in this function)
5 ../drivers/media/cec/cec-adap.c:136:22: error: 'CEC_EVENT_FL_DROPPED_EVENTS' undeclared (first use in this function)
3 ../net/sunrpc/xprtsock.c:1774:38: error: 'SO_REUSEPORT' undeclared (first use in this function)
3 ../net/socket.c:770:30: error: 'SCM_TIMESTAMPING_OPT_STATS' undeclared (first use in this function)
3 ../net/socket.c:714:28: error: 'SCM_TIMESTAMPING_PKTINFO' undeclared (first use in this function)
3 ../net/core/sock.c:973:7: error: 'SO_LOCK_FILTER' undeclared (first use in this function)
3 ../net/core/sock.c:956:7: error: 'SO_ATTACH_REUSEPORT_EBPF' undeclared (first use in this function)
3 ../net/core/sock.c:943:7: error: 'SO_ATTACH_REUSEPORT_CBPF' undeclared (first use in this function)
3 ../net/core/sock.c:930:7: error: 'SO_ATTACH_BPF' undeclared (first use in this function)
3 ../net/core/sock.c:727:7: error: 'SO_REUSEPORT' undeclared (first use in this function)
3 ../net/core/sock.c:1390:7: error: 'SO_ZEROCOPY' undeclared (first use in this function)
3 ../net/core/sock.c:1383:7: error: 'SO_COOKIE' undeclared (first use in this function)
3 ../net/core/sock.c:1373:7: error: 'SO_INCOMING_NAPI_ID' undeclared (first use in this function)
3 ../net/core/sock.c:1356:7: error: 'SO_MEMINFO' undeclared (first use in this function)
3 ../net/core/sock.c:1352:7: error: 'SO_INCOMING_CPU' undeclared (first use in this function)
3 ../net/core/sock.c:1348:7: error: 'SO_MAX_PACING_RATE' undeclared (first use in this function)
3 ../net/core/sock.c:1343:7: error: 'SO_BUSY_POLL' undeclared (first use in this function)
3 ../net/core/sock.c:1338:7: error: 'SO_SELECT_ERR_QUEUE' undeclared (first use in this function)
3 ../net/core/sock.c:1334:7: error: 'SO_BPF_EXTENSIONS' undeclared (first use in this function)
3 ../net/core/sock.c:1330:7: error: 'SO_LOCK_FILTER' undeclared (first use in this function)
3 ../net/core/sock.c:1323:7: error: 'SO_GET_FILTER' undeclared (first use in this function)
3 ../net/core/sock.c:1250:7: error: 'SO_PEERGROUPS' undeclared (first use in this function)
3 ../net/core/sock.c:1144:7: error: 'SO_REUSEPORT' undeclared (first use in this function)
3 ../net/core/sock.c:1049:7: error: 'SO_ZEROCOPY' undeclared (first use in this function)
3 ../net/core/sock.c:1044:7: error: 'SO_CNX_ADVICE' undeclared (first use in this function)
3 ../net/core/sock.c:1040:7: error: 'SO_INCOMING_CPU' undeclared (first use in this function)
3 ../net/core/sock.c:1030:7: error: 'SO_MAX_PACING_RATE' undeclared (first use in this function)
3 ../net/core/sock.c:1017:7: error: 'SO_BUSY_POLL' undeclared (first use in this function)
3 ../net/core/sock.c:1012:7: error: 'SO_SELECT_ERR_QUEUE' undeclared (first use in this function)
3 ../net/core/filter.c:3214:8: error: 'SO_MAX_PACING_RATE' undeclared (first use in this function)
3 ../drivers/media/platform/vivid/vivid-cec.c:285:54: error: 'CEC_CAP_MONITOR_PIN' undeclared (first use in this function)
3 ../drivers/media/platform/s5p-cec/s5p_cec.c:232:35: error: 'CEC_CAP_NEEDS_HPD' undeclared (first use in this function)
1 ../drivers/parport/parport_pc.c:3070:2: error: implicit declaration of function 'parport_pc_find_nonpci_ports' [-Werror=implicit-function-declaration]
1 ../drivers/media/cec/cec-pin.c:797:37: error: 'CEC_CAP_MONITOR_PIN' undeclared (first use in this function)
1 ../drivers/media/cec/cec-api.c:581:7: error: 'CEC_EVENT_PIN_HPD_LOW' undeclared (first use in this function)
1 ../arch/arm/include/asm/parport.h:13:22: error: expected '=', ',', ';', 'asm' or '__attribute__' before 'parport_pc_find_nonpci_ports'
1 ../arch/arm/include/asm/parport.h:12:22: error: expected '=', ',', ';', 'asm' or '__attribute__' before 'parport_pc_find_isa_ports'
Warnings Summary: 2
5 ../drivers/media/cec/cec-adap.c:88:18: warning: unused variable 'max_events' [-Wunused-variable]
1 drivers/target/iscsi/.tmp_iscsi_target.o: warning: objtool: iscsit_handle_task_mgt_cmd()+0x78f: sibling call from callable instruction with modified stack frame
===============================================================================
Detailed per-defconfig build reports below:
-------------------------------------------------------------------------------
arm64-allmodconfig : FAIL, 63 errors, 1 warnings, 0 section mismatches
Errors:
../include/media/cec.h:94:24: error: 'CEC_EVENT_PIN_HPD_HIGH' undeclared here (not in a function)
../include/media/cec.h:94:24: error: 'CEC_EVENT_PIN_HPD_HIGH' undeclared here (not in a function)
../include/media/cec.h:94:24: error: 'CEC_EVENT_PIN_HPD_HIGH' undeclared here (not in a function)
../include/media/cec.h:94:24: error: 'CEC_EVENT_PIN_HPD_HIGH' undeclared here (not in a function)
../include/media/cec.h:94:24: error: 'CEC_EVENT_PIN_HPD_HIGH' undeclared here (not in a function)
../include/media/cec.h:94:24: error: 'CEC_EVENT_PIN_HPD_HIGH' undeclared here (not in a function)
../drivers/media/cec/cec-core.c:230:27: error: 'CEC_CAP_NEEDS_HPD' undeclared (first use in this function)
../include/media/cec.h:94:24: error: 'CEC_EVENT_PIN_HPD_HIGH' undeclared here (not in a function)
../include/linux/build_bug.h:30:45: error: bit-field '<anonymous>' width not an integer constant
../drivers/media/cec/cec-adap.c:136:22: error: 'CEC_EVENT_FL_DROPPED_EVENTS' undeclared (first use in this function)
../drivers/media/cec/cec-adap.c:160:22: error: 'CEC_EVENT_PIN_CEC_HIGH' undeclared (first use in this function)
../drivers/media/cec/cec-adap.c:161:8: error: 'CEC_EVENT_PIN_CEC_LOW' undeclared (first use in this function)
../drivers/media/cec/cec-adap.c:167:28: error: 'CEC_MODE_MONITOR_PIN' undeclared (first use in this function)
../drivers/media/cec/cec-adap.c:178:8: error: 'CEC_EVENT_PIN_HPD_LOW' undeclared (first use in this function)
../drivers/media/cec/cec-adap.c:710:17: error: 'CEC_MSG_FL_REPLY_TO_FOLLOWERS' undeclared (first use in this function)
../drivers/media/cec/cec-adap.c:1403:21: error: 'CEC_LOG_ADDRS_FL_CDC_ONLY' undeclared (first use in this function)
../drivers/media/cec/cec-adap.c:1563:25: error: 'CEC_LOG_ADDRS_FL_CDC_ONLY' undeclared (first use in this function)
../drivers/media/cec/cec-adap.c:1798:6: error: implicit declaration of function 'cec_is_cdc_only' [-Werror=implicit-function-declaration]
../drivers/media/cec/cec-adap.c:1878:33: error: 'CEC_LOG_ADDRS_FL_ALLOW_RC_PASSTHRU' undeclared (first use in this function)
../drivers/media/cec/cec-adap.c:2019:33: error: 'CEC_MSG_FL_REPLY_TO_FOLLOWERS' undeclared (first use in this function)
../include/media/cec.h:94:24: error: 'CEC_EVENT_PIN_HPD_HIGH' undeclared here (not in a function)
../drivers/media/cec/cec-api.c:168:7: error: 'CEC_LOG_ADDRS_FL_ALLOW_RC_PASSTHRU' undeclared (first use in this function)
../drivers/media/cec/cec-api.c:169:7: error: 'CEC_LOG_ADDRS_FL_CDC_ONLY' undeclared (first use in this function)
../drivers/media/cec/cec-api.c:198:31: error: 'CEC_LOG_ADDRS_FL_CDC_ONLY' undeclared (first use in this function)
../drivers/media/cec/cec-api.c:381:23: error: 'CEC_MODE_MONITOR_PIN' undeclared (first use in this function)
../drivers/media/cec/cec-api.c:382:29: error: 'CEC_CAP_MONITOR_PIN' undeclared (first use in this function)
../drivers/media/cec/cec-api.c:452:38: error: 'CEC_EVENT_PIN_CEC_HIGH' undeclared (first use in this function)
../drivers/media/cec/cec-api.c:453:10: error: 'CEC_EVENT_PIN_CEC_LOW' undeclared (first use in this function)
../drivers/media/cec/cec-api.c:610:27: error: 'CEC_MODE_MONITOR_PIN' undeclared (first use in this function)
../include/media/cec.h:94:24: error: 'CEC_EVENT_PIN_HPD_HIGH' undeclared here (not in a function)
../include/media/cec.h:94:24: error: 'CEC_EVENT_PIN_HPD_HIGH' undeclared here (not in a function)
../include/media/cec.h:94:24: error: 'CEC_EVENT_PIN_HPD_HIGH' undeclared here (not in a function)
../include/media/cec.h:94:24: error: 'CEC_EVENT_PIN_HPD_HIGH' undeclared here (not in a function)
../include/media/cec.h:94:24: error: 'CEC_EVENT_PIN_HPD_HIGH' undeclared here (not in a function)
../include/media/cec.h:94:24: error: 'CEC_EVENT_PIN_HPD_HIGH' undeclared here (not in a function)
../include/media/cec.h:94:24: error: 'CEC_EVENT_PIN_HPD_HIGH' undeclared here (not in a function)
../include/media/cec.h:94:24: error: 'CEC_EVENT_PIN_HPD_HIGH' undeclared here (not in a function)
../drivers/media/platform/s5p-cec/s5p_cec.c:232:35: error: 'CEC_CAP_NEEDS_HPD' undeclared (first use in this function)
../include/media/cec.h:94:24: error: 'CEC_EVENT_PIN_HPD_HIGH' undeclared here (not in a function)
../include/media/cec.h:94:24: error: 'CEC_EVENT_PIN_HPD_HIGH' undeclared here (not in a function)
../include/media/cec.h:94:24: error: 'CEC_EVENT_PIN_HPD_HIGH' undeclared here (not in a function)
../include/media/cec.h:94:24: error: 'CEC_EVENT_PIN_HPD_HIGH' undeclared here (not in a function)
../include/media/cec.h:94:24: error: 'CEC_EVENT_PIN_HPD_HIGH' undeclared here (not in a function)
../include/media/cec.h:94:24: error: 'CEC_EVENT_PIN_HPD_HIGH' undeclared here (not in a function)
../include/media/cec.h:94:24: error: 'CEC_EVENT_PIN_HPD_HIGH' undeclared here (not in a function)
../include/media/cec.h:94:24: error: 'CEC_EVENT_PIN_HPD_HIGH' undeclared here (not in a function)
../include/media/cec.h:94:24: error: 'CEC_EVENT_PIN_HPD_HIGH' undeclared here (not in a function)
../include/media/cec.h:94:24: error: 'CEC_EVENT_PIN_HPD_HIGH' undeclared here (not in a function)
../include/media/cec.h:94:24: error: 'CEC_EVENT_PIN_HPD_HIGH' undeclared here (not in a function)
../include/media/cec.h:94:24: error: 'CEC_EVENT_PIN_HPD_HIGH' undeclared here (not in a function)
../include/media/cec.h:94:24: error: 'CEC_EVENT_PIN_HPD_HIGH' undeclared here (not in a function)
../include/media/cec.h:94:24: error: 'CEC_EVENT_PIN_HPD_HIGH' undeclared here (not in a function)
../include/media/cec.h:94:24: error: 'CEC_EVENT_PIN_HPD_HIGH' undeclared here (not in a function)
../include/media/cec.h:94:24: error: 'CEC_EVENT_PIN_HPD_HIGH' undeclared here (not in a function)
../include/media/cec.h:94:24: error: 'CEC_EVENT_PIN_HPD_HIGH' undeclared here (not in a function)
../include/media/cec.h:94:24: error: 'CEC_EVENT_PIN_HPD_HIGH' undeclared here (not in a function)
../drivers/media/platform/vivid/vivid-cec.c:285:54: error: 'CEC_CAP_MONITOR_PIN' undeclared (first use in this function)
../include/media/cec.h:94:24: error: 'CEC_EVENT_PIN_HPD_HIGH' undeclared here (not in a function)
../include/media/cec.h:94:24: error: 'CEC_EVENT_PIN_HPD_HIGH' undeclared here (not in a function)
../include/media/cec.h:94:24: error: 'CEC_EVENT_PIN_HPD_HIGH' undeclared here (not in a function)
../include/media/cec.h:94:24: error: 'CEC_EVENT_PIN_HPD_HIGH' undeclared here (not in a function)
../include/media/cec.h:94:24: error: 'CEC_EVENT_PIN_HPD_HIGH' undeclared here (not in a function)
../include/media/cec.h:94:24: error: 'CEC_EVENT_PIN_HPD_HIGH' undeclared here (not in a function)
Warnings:
../drivers/media/cec/cec-adap.c:88:18: warning: unused variable 'max_events' [-Wunused-variable]
-------------------------------------------------------------------------------
arm-multi_v5_defconfig : FAIL, 28 errors, 0 warnings, 0 section mismatches
Errors:
../net/socket.c:714:28: error: 'SCM_TIMESTAMPING_PKTINFO' undeclared (first use in this function)
../net/socket.c:770:30: error: 'SCM_TIMESTAMPING_OPT_STATS' undeclared (first use in this function)
../net/core/sock.c:727:7: error: 'SO_REUSEPORT' undeclared (first use in this function)
../net/core/sock.c:930:7: error: 'SO_ATTACH_BPF' undeclared (first use in this function)
../net/core/sock.c:943:7: error: 'SO_ATTACH_REUSEPORT_CBPF' undeclared (first use in this function)
../net/core/sock.c:956:7: error: 'SO_ATTACH_REUSEPORT_EBPF' undeclared (first use in this function)
../net/core/sock.c:973:7: error: 'SO_LOCK_FILTER' undeclared (first use in this function)
../net/core/sock.c:1012:7: error: 'SO_SELECT_ERR_QUEUE' undeclared (first use in this function)
../net/core/sock.c:1017:7: error: 'SO_BUSY_POLL' undeclared (first use in this function)
../net/core/sock.c:1030:7: error: 'SO_MAX_PACING_RATE' undeclared (first use in this function)
../net/core/sock.c:1040:7: error: 'SO_INCOMING_CPU' undeclared (first use in this function)
../net/core/sock.c:1044:7: error: 'SO_CNX_ADVICE' undeclared (first use in this function)
../net/core/sock.c:1049:7: error: 'SO_ZEROCOPY' undeclared (first use in this function)
../net/core/sock.c:1144:7: error: 'SO_REUSEPORT' undeclared (first use in this function)
../net/core/sock.c:1250:7: error: 'SO_PEERGROUPS' undeclared (first use in this function)
../net/core/sock.c:1323:7: error: 'SO_GET_FILTER' undeclared (first use in this function)
../net/core/sock.c:1330:7: error: 'SO_LOCK_FILTER' undeclared (first use in this function)
../net/core/sock.c:1334:7: error: 'SO_BPF_EXTENSIONS' undeclared (first use in this function)
../net/core/sock.c:1338:7: error: 'SO_SELECT_ERR_QUEUE' undeclared (first use in this function)
../net/core/sock.c:1343:7: error: 'SO_BUSY_POLL' undeclared (first use in this function)
../net/core/sock.c:1348:7: error: 'SO_MAX_PACING_RATE' undeclared (first use in this function)
../net/core/sock.c:1352:7: error: 'SO_INCOMING_CPU' undeclared (first use in this function)
../net/core/sock.c:1356:7: error: 'SO_MEMINFO' undeclared (first use in this function)
../net/core/sock.c:1373:7: error: 'SO_INCOMING_NAPI_ID' undeclared (first use in this function)
../net/core/sock.c:1383:7: error: 'SO_COOKIE' undeclared (first use in this function)
../net/core/sock.c:1390:7: error: 'SO_ZEROCOPY' undeclared (first use in this function)
../net/core/filter.c:3214:8: error: 'SO_MAX_PACING_RATE' undeclared (first use in this function)
../net/sunrpc/xprtsock.c:1774:38: error: 'SO_REUSEPORT' undeclared (first use in this function)
-------------------------------------------------------------------------------
arm-multi_v7_defconfig : FAIL, 80 errors, 1 warnings, 0 section mismatches
Errors:
../net/socket.c:714:28: error: 'SCM_TIMESTAMPING_PKTINFO' undeclared (first use in this function)
../net/socket.c:770:30: error: 'SCM_TIMESTAMPING_OPT_STATS' undeclared (first use in this function)
../net/core/sock.c:727:7: error: 'SO_REUSEPORT' undeclared (first use in this function)
../net/core/sock.c:930:7: error: 'SO_ATTACH_BPF' undeclared (first use in this function)
../net/core/sock.c:943:7: error: 'SO_ATTACH_REUSEPORT_CBPF' undeclared (first use in this function)
../net/core/sock.c:956:7: error: 'SO_ATTACH_REUSEPORT_EBPF' undeclared (first use in this function)
../net/core/sock.c:973:7: error: 'SO_LOCK_FILTER' undeclared (first use in this function)
../net/core/sock.c:1012:7: error: 'SO_SELECT_ERR_QUEUE' undeclared (first use in this function)
../net/core/sock.c:1017:7: error: 'SO_BUSY_POLL' undeclared (first use in this function)
../net/core/sock.c:1030:7: error: 'SO_MAX_PACING_RATE' undeclared (first use in this function)
../net/core/sock.c:1040:7: error: 'SO_INCOMING_CPU' undeclared (first use in this function)
../net/core/sock.c:1044:7: error: 'SO_CNX_ADVICE' undeclared (first use in this function)
../net/core/sock.c:1049:7: error: 'SO_ZEROCOPY' undeclared (first use in this function)
../net/core/sock.c:1144:7: error: 'SO_REUSEPORT' undeclared (first use in this function)
../net/core/sock.c:1250:7: error: 'SO_PEERGROUPS' undeclared (first use in this function)
../net/core/sock.c:1323:7: error: 'SO_GET_FILTER' undeclared (first use in this function)
../net/core/sock.c:1330:7: error: 'SO_LOCK_FILTER' undeclared (first use in this function)
../net/core/sock.c:1334:7: error: 'SO_BPF_EXTENSIONS' undeclared (first use in this function)
../net/core/sock.c:1338:7: error: 'SO_SELECT_ERR_QUEUE' undeclared (first use in this function)
../net/core/sock.c:1343:7: error: 'SO_BUSY_POLL' undeclared (first use in this function)
../net/core/sock.c:1348:7: error: 'SO_MAX_PACING_RATE' undeclared (first use in this function)
../net/core/sock.c:1352:7: error: 'SO_INCOMING_CPU' undeclared (first use in this function)
../net/core/sock.c:1356:7: error: 'SO_MEMINFO' undeclared (first use in this function)
../net/core/sock.c:1373:7: error: 'SO_INCOMING_NAPI_ID' undeclared (first use in this function)
../net/core/sock.c:1383:7: error: 'SO_COOKIE' undeclared (first use in this function)
../net/core/sock.c:1390:7: error: 'SO_ZEROCOPY' undeclared (first use in this function)
../net/core/filter.c:3214:8: error: 'SO_MAX_PACING_RATE' undeclared (first use in this function)
../include/media/cec.h:94:24: error: 'CEC_EVENT_PIN_HPD_HIGH' undeclared here (not in a function)
../include/media/cec.h:94:24: error: 'CEC_EVENT_PIN_HPD_HIGH' undeclared here (not in a function)
../include/media/cec.h:94:24: error: 'CEC_EVENT_PIN_HPD_HIGH' undeclared here (not in a function)
../include/media/cec.h:94:24: error: 'CEC_EVENT_PIN_HPD_HIGH' undeclared here (not in a function)
../include/media/cec.h:94:24: error: 'CEC_EVENT_PIN_HPD_HIGH' undeclared here (not in a function)
../drivers/media/cec/cec-core.c:230:27: error: 'CEC_CAP_NEEDS_HPD' undeclared (first use in this function)
../include/media/cec.h:94:24: error: 'CEC_EVENT_PIN_HPD_HIGH' undeclared here (not in a function)
../include/linux/build_bug.h:30:45: error: bit-field '<anonymous>' width not an integer constant
../drivers/media/cec/cec-adap.c:136:22: error: 'CEC_EVENT_FL_DROPPED_EVENTS' undeclared (first use in this function)
../drivers/media/cec/cec-adap.c:160:22: error: 'CEC_EVENT_PIN_CEC_HIGH' undeclared (first use in this function)
../drivers/media/cec/cec-adap.c:161:8: error: 'CEC_EVENT_PIN_CEC_LOW' undeclared (first use in this function)
../drivers/media/cec/cec-adap.c:167:28: error: 'CEC_MODE_MONITOR_PIN' undeclared (first use in this function)
../drivers/media/cec/cec-adap.c:178:8: error: 'CEC_EVENT_PIN_HPD_LOW' undeclared (first use in this function)
../drivers/media/cec/cec-adap.c:710:17: error: 'CEC_MSG_FL_REPLY_TO_FOLLOWERS' undeclared (first use in this function)
../drivers/media/cec/cec-adap.c:1403:21: error: 'CEC_LOG_ADDRS_FL_CDC_ONLY' undeclared (first use in this function)
../drivers/media/cec/cec-adap.c:1563:25: error: 'CEC_LOG_ADDRS_FL_CDC_ONLY' undeclared (first use in this function)
../drivers/media/cec/cec-adap.c:1798:6: error: implicit declaration of function 'cec_is_cdc_only' [-Werror=implicit-function-declaration]
../drivers/media/cec/cec-adap.c:1878:33: error: 'CEC_LOG_ADDRS_FL_ALLOW_RC_PASSTHRU' undeclared (first use in this function)
../drivers/media/cec/cec-adap.c:2019:33: error: 'CEC_MSG_FL_REPLY_TO_FOLLOWERS' undeclared (first use in this function)
../include/media/cec.h:94:24: error: 'CEC_EVENT_PIN_HPD_HIGH' undeclared here (not in a function)
../drivers/media/cec/cec-api.c:168:7: error: 'CEC_LOG_ADDRS_FL_ALLOW_RC_PASSTHRU' undeclared (first use in this function)
../drivers/media/cec/cec-api.c:169:7: error: 'CEC_LOG_ADDRS_FL_CDC_ONLY' undeclared (first use in this function)
../drivers/media/cec/cec-api.c:198:31: error: 'CEC_LOG_ADDRS_FL_CDC_ONLY' undeclared (first use in this function)
../drivers/media/cec/cec-api.c:381:23: error: 'CEC_MODE_MONITOR_PIN' undeclared (first use in this function)
../drivers/media/cec/cec-api.c:382:29: error: 'CEC_CAP_MONITOR_PIN' undeclared (first use in this function)
../drivers/media/cec/cec-api.c:452:38: error: 'CEC_EVENT_PIN_CEC_HIGH' undeclared (first use in this function)
../drivers/media/cec/cec-api.c:453:10: error: 'CEC_EVENT_PIN_CEC_LOW' undeclared (first use in this function)
../drivers/media/cec/cec-api.c:610:27: error: 'CEC_MODE_MONITOR_PIN' undeclared (first use in this function)
../include/media/cec.h:94:24: error: 'CEC_EVENT_PIN_HPD_HIGH' undeclared here (not in a function)
../net/sunrpc/xprtsock.c:1774:38: error: 'SO_REUSEPORT' undeclared (first use in this function)
../include/media/cec.h:94:24: error: 'CEC_EVENT_PIN_HPD_HIGH' undeclared here (not in a function)
../include/media/cec.h:94:24: error: 'CEC_EVENT_PIN_HPD_HIGH' undeclared here (not in a function)
../include/media/cec.h:94:24: error: 'CEC_EVENT_PIN_HPD_HIGH' undeclared here (not in a function)
../include/media/cec.h:94:24: error: 'CEC_EVENT_PIN_HPD_HIGH' undeclared here (not in a function)
../include/media/cec.h:94:24: error: 'CEC_EVENT_PIN_HPD_HIGH' undeclared here (not in a function)
../include/media/cec.h:94:24: error: 'CEC_EVENT_PIN_HPD_HIGH' undeclared here (not in a function)
../include/media/cec.h:94:24: error: 'CEC_EVENT_PIN_HPD_HIGH' undeclared here (not in a function)
../include/media/cec.h:94:24: error: 'CEC_EVENT_PIN_HPD_HIGH' undeclared here (not in a function)
../include/media/cec.h:94:24: error: 'CEC_EVENT_PIN_HPD_HIGH' undeclared here (not in a function)
../include/media/cec.h:94:24: error: 'CEC_EVENT_PIN_HPD_HIGH' undeclared here (not in a function)
../include/media/cec.h:94:24: error: 'CEC_EVENT_PIN_HPD_HIGH' undeclared here (not in a function)
../include/media/cec.h:94:24: error: 'CEC_EVENT_PIN_HPD_HIGH' undeclared here (not in a function)
../include/media/cec.h:94:24: error: 'CEC_EVENT_PIN_HPD_HIGH' undeclared here (not in a function)
../include/media/cec.h:94:24: error: 'CEC_EVENT_PIN_HPD_HIGH' undeclared here (not in a function)
../include/media/cec.h:94:24: error: 'CEC_EVENT_PIN_HPD_HIGH' undeclared here (not in a function)
../include/media/cec.h:94:24: error: 'CEC_EVENT_PIN_HPD_HIGH' undeclared here (not in a function)
../include/media/cec.h:94:24: error: 'CEC_EVENT_PIN_HPD_HIGH' undeclared here (not in a function)
../include/media/cec.h:94:24: error: 'CEC_EVENT_PIN_HPD_HIGH' undeclared here (not in a function)
../include/media/cec.h:94:24: error: 'CEC_EVENT_PIN_HPD_HIGH' undeclared here (not in a function)
../include/media/cec.h:94:24: error: 'CEC_EVENT_PIN_HPD_HIGH' undeclared here (not in a function)
../include/media/cec.h:94:24: error: 'CEC_EVENT_PIN_HPD_HIGH' undeclared here (not in a function)
../include/media/cec.h:94:24: error: 'CEC_EVENT_PIN_HPD_HIGH' undeclared here (not in a function)
../include/media/cec.h:94:24: error: 'CEC_EVENT_PIN_HPD_HIGH' undeclared here (not in a function)
Warnings:
../drivers/media/cec/cec-adap.c:88:18: warning: unused variable 'max_events' [-Wunused-variable]
-------------------------------------------------------------------------------
arm-allmodconfig : FAIL, 112 errors, 1 warnings, 0 section mismatches
Errors:
../net/socket.c:714:28: error: 'SCM_TIMESTAMPING_PKTINFO' undeclared (first use in this function)
../net/socket.c:770:30: error: 'SCM_TIMESTAMPING_OPT_STATS' undeclared (first use in this function)
../net/core/sock.c:727:7: error: 'SO_REUSEPORT' undeclared (first use in this function)
../net/core/sock.c:930:7: error: 'SO_ATTACH_BPF' undeclared (first use in this function)
../net/core/sock.c:943:7: error: 'SO_ATTACH_REUSEPORT_CBPF' undeclared (first use in this function)
../net/core/sock.c:956:7: error: 'SO_ATTACH_REUSEPORT_EBPF' undeclared (first use in this function)
../net/core/sock.c:973:7: error: 'SO_LOCK_FILTER' undeclared (first use in this function)
../net/core/sock.c:1012:7: error: 'SO_SELECT_ERR_QUEUE' undeclared (first use in this function)
../net/core/sock.c:1017:7: error: 'SO_BUSY_POLL' undeclared (first use in this function)
../net/core/sock.c:1030:7: error: 'SO_MAX_PACING_RATE' undeclared (first use in this function)
../net/core/sock.c:1040:7: error: 'SO_INCOMING_CPU' undeclared (first use in this function)
../net/core/sock.c:1044:7: error: 'SO_CNX_ADVICE' undeclared (first use in this function)
../net/core/sock.c:1049:7: error: 'SO_ZEROCOPY' undeclared (first use in this function)
../net/core/sock.c:1144:7: error: 'SO_REUSEPORT' undeclared (first use in this function)
../net/core/sock.c:1250:7: error: 'SO_PEERGROUPS' undeclared (first use in this function)
../net/core/sock.c:1323:7: error: 'SO_GET_FILTER' undeclared (first use in this function)
../net/core/sock.c:1330:7: error: 'SO_LOCK_FILTER' undeclared (first use in this function)
../net/core/sock.c:1334:7: error: 'SO_BPF_EXTENSIONS' undeclared (first use in this function)
../net/core/sock.c:1338:7: error: 'SO_SELECT_ERR_QUEUE' undeclared (first use in this function)
../net/core/sock.c:1343:7: error: 'SO_BUSY_POLL' undeclared (first use in this function)
../net/core/sock.c:1348:7: error: 'SO_MAX_PACING_RATE' undeclared (first use in this function)
../net/core/sock.c:1352:7: error: 'SO_INCOMING_CPU' undeclared (first use in this function)
../net/core/sock.c:1356:7: error: 'SO_MEMINFO' undeclared (first use in this function)
../net/core/sock.c:1373:7: error: 'SO_INCOMING_NAPI_ID' undeclared (first use in this function)
../net/core/sock.c:1383:7: error: 'SO_COOKIE' undeclared (first use in this function)
../net/core/sock.c:1390:7: error: 'SO_ZEROCOPY' undeclared (first use in this function)
../net/core/filter.c:3214:8: error: 'SO_MAX_PACING_RATE' undeclared (first use in this function)
../include/media/cec.h:94:24: error: 'CEC_EVENT_PIN_HPD_HIGH' undeclared here (not in a function)
../include/media/cec.h:94:24: error: 'CEC_EVENT_PIN_HPD_HIGH' undeclared here (not in a function)
../include/media/cec.h:94:24: error: 'CEC_EVENT_PIN_HPD_HIGH' undeclared here (not in a function)
../include/media/cec.h:94:24: error: 'CEC_EVENT_PIN_HPD_HIGH' undeclared here (not in a function)
../include/media/cec.h:94:24: error: 'CEC_EVENT_PIN_HPD_HIGH' undeclared here (not in a function)
../include/media/cec.h:94:24: error: 'CEC_EVENT_PIN_HPD_HIGH' undeclared here (not in a function)
../include/media/cec.h:94:24: error: 'CEC_EVENT_PIN_HPD_HIGH' undeclared here (not in a function)
../include/media/cec.h:94:24: error: 'CEC_EVENT_PIN_HPD_HIGH' undeclared here (not in a function)
../include/media/cec.h:94:24: error: 'CEC_EVENT_PIN_HPD_HIGH' undeclared here (not in a function)
../include/media/cec.h:94:24: error: 'CEC_EVENT_PIN_HPD_HIGH' undeclared here (not in a function)
../include/media/cec.h:94:24: error: 'CEC_EVENT_PIN_HPD_HIGH' undeclared here (not in a function)
../include/media/cec.h:94:24: error: 'CEC_EVENT_PIN_HPD_HIGH' undeclared here (not in a function)
../include/media/cec.h:94:24: error: 'CEC_EVENT_PIN_HPD_HIGH' undeclared here (not in a function)
../include/media/cec.h:94:24: error: 'CEC_EVENT_PIN_HPD_HIGH' undeclared here (not in a function)
../include/media/cec.h:94:24: error: 'CEC_EVENT_PIN_HPD_HIGH' undeclared here (not in a function)
../include/media/cec.h:94:24: error: 'CEC_EVENT_PIN_HPD_HIGH' undeclared here (not in a function)
../include/media/cec.h:94:24: error: 'CEC_EVENT_PIN_HPD_HIGH' undeclared here (not in a function)
../include/media/cec.h:94:24: error: 'CEC_EVENT_PIN_HPD_HIGH' undeclared here (not in a function)
../include/media/cec.h:94:24: error: 'CEC_EVENT_PIN_HPD_HIGH' undeclared here (not in a function)
../include/media/cec.h:94:24: error: 'CEC_EVENT_PIN_HPD_HIGH' undeclared here (not in a function)
../include/media/cec.h:94:24: error: 'CEC_EVENT_PIN_HPD_HIGH' undeclared here (not in a function)
../drivers/media/cec/cec-core.c:230:27: error: 'CEC_CAP_NEEDS_HPD' undeclared (first use in this function)
../include/media/cec.h:94:24: error: 'CEC_EVENT_PIN_HPD_HIGH' undeclared here (not in a function)
../include/linux/build_bug.h:30:45: error: bit-field '<anonymous>' width not an integer constant
../drivers/media/cec/cec-adap.c:136:22: error: 'CEC_EVENT_FL_DROPPED_EVENTS' undeclared (first use in this function)
../drivers/media/cec/cec-adap.c:160:22: error: 'CEC_EVENT_PIN_CEC_HIGH' undeclared (first use in this function)
../drivers/media/cec/cec-adap.c:161:8: error: 'CEC_EVENT_PIN_CEC_LOW' undeclared (first use in this function)
../drivers/media/cec/cec-adap.c:167:28: error: 'CEC_MODE_MONITOR_PIN' undeclared (first use in this function)
../drivers/media/cec/cec-adap.c:178:8: error: 'CEC_EVENT_PIN_HPD_LOW' undeclared (first use in this function)
../drivers/media/cec/cec-adap.c:710:17: error: 'CEC_MSG_FL_REPLY_TO_FOLLOWERS' undeclared (first use in this function)
../drivers/media/cec/cec-adap.c:1403:21: error: 'CEC_LOG_ADDRS_FL_CDC_ONLY' undeclared (first use in this function)
../drivers/media/cec/cec-adap.c:1563:25: error: 'CEC_LOG_ADDRS_FL_CDC_ONLY' undeclared (first use in this function)
../drivers/media/cec/cec-adap.c:1798:6: error: implicit declaration of function 'cec_is_cdc_only' [-Werror=implicit-function-declaration]
../drivers/media/cec/cec-adap.c:1878:33: error: 'CEC_LOG_ADDRS_FL_ALLOW_RC_PASSTHRU' undeclared (first use in this function)
../drivers/media/cec/cec-adap.c:2019:33: error: 'CEC_MSG_FL_REPLY_TO_FOLLOWERS' undeclared (first use in this function)
../include/media/cec.h:94:24: error: 'CEC_EVENT_PIN_HPD_HIGH' undeclared here (not in a function)
../drivers/media/cec/cec-api.c:168:7: error: 'CEC_LOG_ADDRS_FL_ALLOW_RC_PASSTHRU' undeclared (first use in this function)
../drivers/media/cec/cec-api.c:169:7: error: 'CEC_LOG_ADDRS_FL_CDC_ONLY' undeclared (first use in this function)
../drivers/media/cec/cec-api.c:198:31: error: 'CEC_LOG_ADDRS_FL_CDC_ONLY' undeclared (first use in this function)
../drivers/media/cec/cec-api.c:381:23: error: 'CEC_MODE_MONITOR_PIN' undeclared (first use in this function)
../drivers/media/cec/cec-api.c:382:29: error: 'CEC_CAP_MONITOR_PIN' undeclared (first use in this function)
../drivers/media/cec/cec-api.c:452:38: error: 'CEC_EVENT_PIN_CEC_HIGH' undeclared (first use in this function)
../drivers/media/cec/cec-api.c:453:10: error: 'CEC_EVENT_PIN_CEC_LOW' undeclared (first use in this function)
../drivers/media/cec/cec-api.c:581:7: error: 'CEC_EVENT_PIN_HPD_LOW' undeclared (first use in this function)
../drivers/media/cec/cec-api.c:610:27: error: 'CEC_MODE_MONITOR_PIN' undeclared (first use in this function)
../include/media/cec.h:94:24: error: 'CEC_EVENT_PIN_HPD_HIGH' undeclared here (not in a function)
../include/media/cec.h:94:24: error: 'CEC_EVENT_PIN_HPD_HIGH' undeclared here (not in a function)
../include/media/cec.h:94:24: error: 'CEC_EVENT_PIN_HPD_HIGH' undeclared here (not in a function)
../drivers/media/cec/cec-pin.c:797:37: error: 'CEC_CAP_MONITOR_PIN' undeclared (first use in this function)
../include/media/cec.h:94:24: error: 'CEC_EVENT_PIN_HPD_HIGH' undeclared here (not in a function)
../include/media/cec.h:94:24: error: 'CEC_EVENT_PIN_HPD_HIGH' undeclared here (not in a function)
../include/media/cec.h:94:24: error: 'CEC_EVENT_PIN_HPD_HIGH' undeclared here (not in a function)
../include/media/cec.h:94:24: error: 'CEC_EVENT_PIN_HPD_HIGH' undeclared here (not in a function)
../include/media/cec.h:94:24: error: 'CEC_EVENT_PIN_HPD_HIGH' undeclared here (not in a function)
../include/media/cec.h:94:24: error: 'CEC_EVENT_PIN_HPD_HIGH' undeclared here (not in a function)
../include/media/cec.h:94:24: error: 'CEC_EVENT_PIN_HPD_HIGH' undeclared here (not in a function)
../net/sunrpc/xprtsock.c:1774:38: error: 'SO_REUSEPORT' undeclared (first use in this function)
../include/media/cec.h:94:24: error: 'CEC_EVENT_PIN_HPD_HIGH' undeclared here (not in a function)
../include/media/cec.h:94:24: error: 'CEC_EVENT_PIN_HPD_HIGH' undeclared here (not in a function)
../drivers/media/platform/s5p-cec/s5p_cec.c:232:35: error: 'CEC_CAP_NEEDS_HPD' undeclared (first use in this function)
../include/media/cec.h:94:24: error: 'CEC_EVENT_PIN_HPD_HIGH' undeclared here (not in a function)
../include/media/cec.h:94:24: error: 'CEC_EVENT_PIN_HPD_HIGH' undeclared here (not in a function)
../include/media/cec.h:94:24: error: 'CEC_EVENT_PIN_HPD_HIGH' undeclared here (not in a function)
../include/media/cec.h:94:24: error: 'CEC_EVENT_PIN_HPD_HIGH' undeclared here (not in a function)
../include/media/cec.h:94:24: error: 'CEC_EVENT_PIN_HPD_HIGH' undeclared here (not in a function)
../include/media/cec.h:94:24: error: 'CEC_EVENT_PIN_HPD_HIGH' undeclared here (not in a function)
../include/media/cec.h:94:24: error: 'CEC_EVENT_PIN_HPD_HIGH' undeclared here (not in a function)
../include/media/cec.h:94:24: error: 'CEC_EVENT_PIN_HPD_HIGH' undeclared here (not in a function)
../include/media/cec.h:94:24: error: 'CEC_EVENT_PIN_HPD_HIGH' undeclared here (not in a function)
../include/media/cec.h:94:24: error: 'CEC_EVENT_PIN_HPD_HIGH' undeclared here (not in a function)
../include/media/cec.h:94:24: error: 'CEC_EVENT_PIN_HPD_HIGH' undeclared here (not in a function)
../include/media/cec.h:94:24: error: 'CEC_EVENT_PIN_HPD_HIGH' undeclared here (not in a function)
../include/media/cec.h:94:24: error: 'CEC_EVENT_PIN_HPD_HIGH' undeclared here (not in a function)
../include/media/cec.h:94:24: error: 'CEC_EVENT_PIN_HPD_HIGH' undeclared here (not in a function)
../include/media/cec.h:94:24: error: 'CEC_EVENT_PIN_HPD_HIGH' undeclared here (not in a function)
../include/media/cec.h:94:24: error: 'CEC_EVENT_PIN_HPD_HIGH' undeclared here (not in a function)
../include/media/cec.h:94:24: error: 'CEC_EVENT_PIN_HPD_HIGH' undeclared here (not in a function)
../include/media/cec.h:94:24: error: 'CEC_EVENT_PIN_HPD_HIGH' undeclared here (not in a function)
../include/media/cec.h:94:24: error: 'CEC_EVENT_PIN_HPD_HIGH' undeclared here (not in a function)
../drivers/media/platform/vivid/vivid-cec.c:285:54: error: 'CEC_CAP_MONITOR_PIN' undeclared (first use in this function)
../include/media/cec.h:94:24: error: 'CEC_EVENT_PIN_HPD_HIGH' undeclared here (not in a function)
../include/media/cec.h:94:24: error: 'CEC_EVENT_PIN_HPD_HIGH' undeclared here (not in a function)
../arch/arm/include/asm/parport.h:12:22: error: expected '=', ',', ';', 'asm' or '__attribute__' before 'parport_pc_find_isa_ports'
../arch/arm/include/asm/parport.h:13:22: error: expected '=', ',', ';', 'asm' or '__attribute__' before 'parport_pc_find_nonpci_ports'
../drivers/parport/parport_pc.c:3070:2: error: implicit declaration of function 'parport_pc_find_nonpci_ports' [-Werror=implicit-function-declaration]
Warnings:
../drivers/media/cec/cec-adap.c:88:18: warning: unused variable 'max_events' [-Wunused-variable]
-------------------------------------------------------------------------------
x86_64-allmodconfig : FAIL, 60 errors, 2 warnings, 0 section mismatches
Errors:
../include/media/cec.h:94:24: error: 'CEC_EVENT_PIN_HPD_HIGH' undeclared here (not in a function)
../include/media/cec.h:94:24: error: 'CEC_EVENT_PIN_HPD_HIGH' undeclared here (not in a function)
../include/media/cec.h:94:24: error: 'CEC_EVENT_PIN_HPD_HIGH' undeclared here (not in a function)
../include/media/cec.h:94:24: error: 'CEC_EVENT_PIN_HPD_HIGH' undeclared here (not in a function)
../include/media/cec.h:94:24: error: 'CEC_EVENT_PIN_HPD_HIGH' undeclared here (not in a function)
../include/media/cec.h:94:24: error: 'CEC_EVENT_PIN_HPD_HIGH' undeclared here (not in a function)
../drivers/media/cec/cec-core.c:230:27: error: 'CEC_CAP_NEEDS_HPD' undeclared (first use in this function)
../include/media/cec.h:94:24: error: 'CEC_EVENT_PIN_HPD_HIGH' undeclared here (not in a function)
../include/linux/build_bug.h:30:45: error: bit-field '<anonymous>' width not an integer constant
../drivers/media/cec/cec-adap.c:136:22: error: 'CEC_EVENT_FL_DROPPED_EVENTS' undeclared (first use in this function)
../drivers/media/cec/cec-adap.c:160:22: error: 'CEC_EVENT_PIN_CEC_HIGH' undeclared (first use in this function)
../drivers/media/cec/cec-adap.c:161:8: error: 'CEC_EVENT_PIN_CEC_LOW' undeclared (first use in this function)
../drivers/media/cec/cec-adap.c:167:28: error: 'CEC_MODE_MONITOR_PIN' undeclared (first use in this function)
../drivers/media/cec/cec-adap.c:178:8: error: 'CEC_EVENT_PIN_HPD_LOW' undeclared (first use in this function)
../drivers/media/cec/cec-adap.c:710:17: error: 'CEC_MSG_FL_REPLY_TO_FOLLOWERS' undeclared (first use in this function)
../drivers/media/cec/cec-adap.c:1403:21: error: 'CEC_LOG_ADDRS_FL_CDC_ONLY' undeclared (first use in this function)
../drivers/media/cec/cec-adap.c:1563:25: error: 'CEC_LOG_ADDRS_FL_CDC_ONLY' undeclared (first use in this function)
../drivers/media/cec/cec-adap.c:1798:6: error: implicit declaration of function 'cec_is_cdc_only' [-Werror=implicit-function-declaration]
../drivers/media/cec/cec-adap.c:1878:33: error: 'CEC_LOG_ADDRS_FL_ALLOW_RC_PASSTHRU' undeclared (first use in this function)
../drivers/media/cec/cec-adap.c:2019:33: error: 'CEC_MSG_FL_REPLY_TO_FOLLOWERS' undeclared (first use in this function)
../include/media/cec.h:94:24: error: 'CEC_EVENT_PIN_HPD_HIGH' undeclared here (not in a function)
../drivers/media/cec/cec-api.c:168:7: error: 'CEC_LOG_ADDRS_FL_ALLOW_RC_PASSTHRU' undeclared (first use in this function)
../drivers/media/cec/cec-api.c:169:7: error: 'CEC_LOG_ADDRS_FL_CDC_ONLY' undeclared (first use in this function)
../drivers/media/cec/cec-api.c:198:31: error: 'CEC_LOG_ADDRS_FL_CDC_ONLY' undeclared (first use in this function)
../drivers/media/cec/cec-api.c:381:23: error: 'CEC_MODE_MONITOR_PIN' undeclared (first use in this function)
../drivers/media/cec/cec-api.c:382:29: error: 'CEC_CAP_MONITOR_PIN' undeclared (first use in this function)
../drivers/media/cec/cec-api.c:452:38: error: 'CEC_EVENT_PIN_CEC_HIGH' undeclared (first use in this function)
../drivers/media/cec/cec-api.c:453:10: error: 'CEC_EVENT_PIN_CEC_LOW' undeclared (first use in this function)
../drivers/media/cec/cec-api.c:610:27: error: 'CEC_MODE_MONITOR_PIN' undeclared (first use in this function)
../include/media/cec.h:94:24: error: 'CEC_EVENT_PIN_HPD_HIGH' undeclared here (not in a function)
../include/media/cec.h:94:24: error: 'CEC_EVENT_PIN_HPD_HIGH' undeclared here (not in a function)
../include/media/cec.h:94:24: error: 'CEC_EVENT_PIN_HPD_HIGH' undeclared here (not in a function)
../include/media/cec.h:94:24: error: 'CEC_EVENT_PIN_HPD_HIGH' undeclared here (not in a function)
../include/media/cec.h:94:24: error: 'CEC_EVENT_PIN_HPD_HIGH' undeclared here (not in a function)
../include/media/cec.h:94:24: error: 'CEC_EVENT_PIN_HPD_HIGH' undeclared here (not in a function)
../include/media/cec.h:94:24: error: 'CEC_EVENT_PIN_HPD_HIGH' undeclared here (not in a function)
../include/media/cec.h:94:24: error: 'CEC_EVENT_PIN_HPD_HIGH' undeclared here (not in a function)
../drivers/media/platform/s5p-cec/s5p_cec.c:232:35: error: 'CEC_CAP_NEEDS_HPD' undeclared (first use in this function)
../include/media/cec.h:94:24: error: 'CEC_EVENT_PIN_HPD_HIGH' undeclared here (not in a function)
../include/media/cec.h:94:24: error: 'CEC_EVENT_PIN_HPD_HIGH' undeclared here (not in a function)
../include/media/cec.h:94:24: error: 'CEC_EVENT_PIN_HPD_HIGH' undeclared here (not in a function)
../include/media/cec.h:94:24: error: 'CEC_EVENT_PIN_HPD_HIGH' undeclared here (not in a function)
../include/media/cec.h:94:24: error: 'CEC_EVENT_PIN_HPD_HIGH' undeclared here (not in a function)
../include/media/cec.h:94:24: error: 'CEC_EVENT_PIN_HPD_HIGH' undeclared here (not in a function)
../include/media/cec.h:94:24: error: 'CEC_EVENT_PIN_HPD_HIGH' undeclared here (not in a function)
../include/media/cec.h:94:24: error: 'CEC_EVENT_PIN_HPD_HIGH' undeclared here (not in a function)
../include/media/cec.h:94:24: error: 'CEC_EVENT_PIN_HPD_HIGH' undeclared here (not in a function)
../include/media/cec.h:94:24: error: 'CEC_EVENT_PIN_HPD_HIGH' undeclared here (not in a function)
../include/media/cec.h:94:24: error: 'CEC_EVENT_PIN_HPD_HIGH' undeclared here (not in a function)
../include/media/cec.h:94:24: error: 'CEC_EVENT_PIN_HPD_HIGH' undeclared here (not in a function)
../include/media/cec.h:94:24: error: 'CEC_EVENT_PIN_HPD_HIGH' undeclared here (not in a function)
../include/media/cec.h:94:24: error: 'CEC_EVENT_PIN_HPD_HIGH' undeclared here (not in a function)
../include/media/cec.h:94:24: error: 'CEC_EVENT_PIN_HPD_HIGH' undeclared here (not in a function)
../include/media/cec.h:94:24: error: 'CEC_EVENT_PIN_HPD_HIGH' undeclared here (not in a function)
../include/media/cec.h:94:24: error: 'CEC_EVENT_PIN_HPD_HIGH' undeclared here (not in a function)
../include/media/cec.h:94:24: error: 'CEC_EVENT_PIN_HPD_HIGH' undeclared here (not in a function)
../include/media/cec.h:94:24: error: 'CEC_EVENT_PIN_HPD_HIGH' undeclared here (not in a function)
../drivers/media/platform/vivid/vivid-cec.c:285:54: error: 'CEC_CAP_MONITOR_PIN' undeclared (first use in this function)
../include/media/cec.h:94:24: error: 'CEC_EVENT_PIN_HPD_HIGH' undeclared here (not in a function)
../include/media/cec.h:94:24: error: 'CEC_EVENT_PIN_HPD_HIGH' undeclared here (not in a function)
Warnings:
../drivers/media/cec/cec-adap.c:88:18: warning: unused variable 'max_events' [-Wunused-variable]
drivers/target/iscsi/.tmp_iscsi_target.o: warning: objtool: iscsit_handle_task_mgt_cmd()+0x78f: sibling call from callable instruction with modified stack frame
-------------------------------------------------------------------------------
arm64-defconfig : FAIL, 32 errors, 1 warnings, 0 section mismatches
Errors:
../include/media/cec.h:94:24: error: 'CEC_EVENT_PIN_HPD_HIGH' undeclared here (not in a function)
../include/media/cec.h:94:24: error: 'CEC_EVENT_PIN_HPD_HIGH' undeclared here (not in a function)
../include/media/cec.h:94:24: error: 'CEC_EVENT_PIN_HPD_HIGH' undeclared here (not in a function)
../include/media/cec.h:94:24: error: 'CEC_EVENT_PIN_HPD_HIGH' undeclared here (not in a function)
../include/media/cec.h:94:24: error: 'CEC_EVENT_PIN_HPD_HIGH' undeclared here (not in a function)
../include/media/cec.h:94:24: error: 'CEC_EVENT_PIN_HPD_HIGH' undeclared here (not in a function)
../include/media/cec.h:94:24: error: 'CEC_EVENT_PIN_HPD_HIGH' undeclared here (not in a function)
../include/media/cec.h:94:24: error: 'CEC_EVENT_PIN_HPD_HIGH' undeclared here (not in a function)
../drivers/media/cec/cec-core.c:230:27: error: 'CEC_CAP_NEEDS_HPD' undeclared (first use in this function)
../include/media/cec.h:94:24: error: 'CEC_EVENT_PIN_HPD_HIGH' undeclared here (not in a function)
../include/linux/build_bug.h:30:45: error: bit-field '<anonymous>' width not an integer constant
../drivers/media/cec/cec-adap.c:136:22: error: 'CEC_EVENT_FL_DROPPED_EVENTS' undeclared (first use in this function)
../drivers/media/cec/cec-adap.c:160:22: error: 'CEC_EVENT_PIN_CEC_HIGH' undeclared (first use in this function)
../drivers/media/cec/cec-adap.c:161:8: error: 'CEC_EVENT_PIN_CEC_LOW' undeclared (first use in this function)
../drivers/media/cec/cec-adap.c:167:28: error: 'CEC_MODE_MONITOR_PIN' undeclared (first use in this function)
../drivers/media/cec/cec-adap.c:178:8: error: 'CEC_EVENT_PIN_HPD_LOW' undeclared (first use in this function)
../drivers/media/cec/cec-adap.c:710:17: error: 'CEC_MSG_FL_REPLY_TO_FOLLOWERS' undeclared (first use in this function)
../drivers/media/cec/cec-adap.c:1403:21: error: 'CEC_LOG_ADDRS_FL_CDC_ONLY' undeclared (first use in this function)
../drivers/media/cec/cec-adap.c:1563:25: error: 'CEC_LOG_ADDRS_FL_CDC_ONLY' undeclared (first use in this function)
../drivers/media/cec/cec-adap.c:1798:6: error: implicit declaration of function 'cec_is_cdc_only' [-Werror=implicit-function-declaration]
../drivers/media/cec/cec-adap.c:1878:33: error: 'CEC_LOG_ADDRS_FL_ALLOW_RC_PASSTHRU' undeclared (first use in this function)
../drivers/media/cec/cec-adap.c:2019:33: error: 'CEC_MSG_FL_REPLY_TO_FOLLOWERS' undeclared (first use in this function)
../include/media/cec.h:94:24: error: 'CEC_EVENT_PIN_HPD_HIGH' undeclared here (not in a function)
../drivers/media/cec/cec-api.c:168:7: error: 'CEC_LOG_ADDRS_FL_ALLOW_RC_PASSTHRU' undeclared (first use in this function)
../drivers/media/cec/cec-api.c:169:7: error: 'CEC_LOG_ADDRS_FL_CDC_ONLY' undeclared (first use in this function)
../drivers/media/cec/cec-api.c:198:31: error: 'CEC_LOG_ADDRS_FL_CDC_ONLY' undeclared (first use in this function)
../drivers/media/cec/cec-api.c:381:23: error: 'CEC_MODE_MONITOR_PIN' undeclared (first use in this function)
../drivers/media/cec/cec-api.c:382:29: error: 'CEC_CAP_MONITOR_PIN' undeclared (first use in this function)
../drivers/media/cec/cec-api.c:452:38: error: 'CEC_EVENT_PIN_CEC_HIGH' undeclared (first use in this function)
../drivers/media/cec/cec-api.c:453:10: error: 'CEC_EVENT_PIN_CEC_LOW' undeclared (first use in this function)
../drivers/media/cec/cec-api.c:610:27: error: 'CEC_MODE_MONITOR_PIN' undeclared (first use in this function)
../include/media/cec.h:94:24: error: 'CEC_EVENT_PIN_HPD_HIGH' undeclared here (not in a function)
Warnings:
../drivers/media/cec/cec-adap.c:88:18: warning: unused variable 'max_events' [-Wunused-variable]
-------------------------------------------------------------------------------
Passed with no errors, warnings or mismatches:
x86_64-allnoconfig
arm64-allnoconfig
arm-allnoconfig
arm-multi_v4t_defconfig
x86_64-defconfig
The patch below does not apply to the 4.9-stable tree.
If someone wants it applied there, or to any other stable or longterm
tree, then please email the backport, including the original git commit
id to <stable(a)vger.kernel.org>.
thanks,
greg k-h
------------------ original commit in Linus's tree ------------------
>From 82dd0d2a9a76fc8fa2b18d80b987d455728bf83a Mon Sep 17 00:00:00 2001
From: David Ahern <dsahern(a)gmail.com>
Date: Thu, 29 Mar 2018 12:49:52 -0700
Subject: [PATCH] vrf: Fix use after free and double free in vrf_finish_output
Miguel reported an skb use after free / double free in vrf_finish_output
when neigh_output returns an error. The vrf driver should return after
the call to neigh_output as it takes over the skb on error path as well.
Patch is a simplified version of Miguel's patch which was written for 4.9,
and updated to top of tree.
Fixes: 8f58336d3f78a ("net: Add ethernet header for pass through VRF device")
Signed-off-by: Miguel Fadon Perlines <mfadon(a)teldat.com>
Signed-off-by: David Ahern <dsahern(a)gmail.com>
Signed-off-by: David S. Miller <davem(a)davemloft.net>
diff --git a/drivers/net/vrf.c b/drivers/net/vrf.c
index 139c61c8244a..ac40924fe437 100644
--- a/drivers/net/vrf.c
+++ b/drivers/net/vrf.c
@@ -578,12 +578,13 @@ static int vrf_finish_output(struct net *net, struct sock *sk, struct sk_buff *s
if (!IS_ERR(neigh)) {
sock_confirm_neigh(skb, neigh);
ret = neigh_output(neigh, skb);
+ rcu_read_unlock_bh();
+ return ret;
}
rcu_read_unlock_bh();
err:
- if (unlikely(ret < 0))
- vrf_tx_error(skb->dev, skb);
+ vrf_tx_error(skb->dev, skb);
return ret;
}
Hi,
[This is an automated email]
This commit has been processed because it contains a "Fixes:" tag,
fixing commit: 2516035499b9 mm, thp: remove __GFP_NORETRY from khugepaged and madvised allocations.
The bot has also determined it's probably a bug fixing patch. (score: 12.0224)
The bot has tested the following trees: v4.16, v4.15.15, v4.14.32, v4.9.92.
v4.16: Build OK!
v4.15.15: Build OK!
v4.14.32: Build OK!
v4.9.92: Build OK!
--
Thanks,
Sasha
Tree/Branch: v4.9.93
Git describe: v4.9.93
Commit: d32da5bd9f Linux 4.9.93
Build Time: 82 min 46 sec
Passed: 8 / 11 ( 72.73 %)
Failed: 3 / 11 ( 27.27 %)
Errors: 37
Warnings: 2
Section Mismatches: 0
Failed defconfigs:
arm-multi_v7_defconfig
arm-allmodconfig
arm-multi_v5_defconfig
Errors:
arm-multi_v7_defconfig
../net/core/sock.c:691:7: error: 'SO_REUSEPORT' undeclared (first use in this function)
../net/core/sock.c:890:7: error: 'SO_ATTACH_BPF' undeclared (first use in this function)
../net/core/sock.c:903:7: error: 'SO_ATTACH_REUSEPORT_CBPF' undeclared (first use in this function)
../net/core/sock.c:916:7: error: 'SO_ATTACH_REUSEPORT_EBPF' undeclared (first use in this function)
../net/core/sock.c:933:7: error: 'SO_LOCK_FILTER' undeclared (first use in this function)
../net/core/sock.c:972:7: error: 'SO_SELECT_ERR_QUEUE' undeclared (first use in this function)
../net/core/sock.c:977:7: error: 'SO_BUSY_POLL' undeclared (first use in this function)
../net/core/sock.c:990:7: error: 'SO_MAX_PACING_RATE' undeclared (first use in this function)
../net/core/sock.c:996:7: error: 'SO_INCOMING_CPU' undeclared (first use in this function)
../net/core/sock.c:1000:7: error: 'SO_CNX_ADVICE' undeclared (first use in this function)
../net/core/sock.c:1073:7: error: 'SO_REUSEPORT' undeclared (first use in this function)
../net/core/sock.c:1231:7: error: 'SO_GET_FILTER' undeclared (first use in this function)
../net/core/sock.c:1238:7: error: 'SO_LOCK_FILTER' undeclared (first use in this function)
../net/core/sock.c:1242:7: error: 'SO_BPF_EXTENSIONS' undeclared (first use in this function)
../net/core/sock.c:1246:7: error: 'SO_SELECT_ERR_QUEUE' undeclared (first use in this function)
../net/core/sock.c:1251:7: error: 'SO_BUSY_POLL' undeclared (first use in this function)
../net/core/sock.c:1256:7: error: 'SO_MAX_PACING_RATE' undeclared (first use in this function)
../net/core/sock.c:1260:7: error: 'SO_INCOMING_CPU' undeclared (first use in this function)
../net/sunrpc/xprtsock.c:1758:38: error: 'SO_REUSEPORT' undeclared (first use in this function)
arm-allmodconfig
../net/core/sock.c:691:7: error: 'SO_REUSEPORT' undeclared (first use in this function)
../net/core/sock.c:890:7: error: 'SO_ATTACH_BPF' undeclared (first use in this function)
../net/core/sock.c:903:7: error: 'SO_ATTACH_REUSEPORT_CBPF' undeclared (first use in this function)
../net/core/sock.c:916:7: error: 'SO_ATTACH_REUSEPORT_EBPF' undeclared (first use in this function)
../net/core/sock.c:933:7: error: 'SO_LOCK_FILTER' undeclared (first use in this function)
../net/core/sock.c:972:7: error: 'SO_SELECT_ERR_QUEUE' undeclared (first use in this function)
../net/core/sock.c:977:7: error: 'SO_BUSY_POLL' undeclared (first use in this function)
../net/core/sock.c:990:7: error: 'SO_MAX_PACING_RATE' undeclared (first use in this function)
../net/core/sock.c:996:7: error: 'SO_INCOMING_CPU' undeclared (first use in this function)
../net/core/sock.c:1000:7: error: 'SO_CNX_ADVICE' undeclared (first use in this function)
../net/core/sock.c:1073:7: error: 'SO_REUSEPORT' undeclared (first use in this function)
../net/core/sock.c:1231:7: error: 'SO_GET_FILTER' undeclared (first use in this function)
../net/core/sock.c:1238:7: error: 'SO_LOCK_FILTER' undeclared (first use in this function)
../net/core/sock.c:1242:7: error: 'SO_BPF_EXTENSIONS' undeclared (first use in this function)
../net/core/sock.c:1246:7: error: 'SO_SELECT_ERR_QUEUE' undeclared (first use in this function)
../net/core/sock.c:1251:7: error: 'SO_BUSY_POLL' undeclared (first use in this function)
../net/core/sock.c:1256:7: error: 'SO_MAX_PACING_RATE' undeclared (first use in this function)
../net/core/sock.c:1260:7: error: 'SO_INCOMING_CPU' undeclared (first use in this function)
Error: ../arch/arm/boot/dts/tegra20.dtsi:1.1-9 syntax error
Error: ../arch/arm/boot/dts/omap4.dtsi:9.1-9 syntax error
Error: ../arch/arm/boot/dts/emev2.dtsi:11.1-9 syntax error
Error: ../arch/arm/boot/dts/tegra20.dtsi:1.1-9 syntax error
Error: ../arch/arm/boot/dts/tegra20.dtsi:1.1-9 syntax error
../arch/arm/boot/dts/omap3-gta04.dts:132:57: error: unterminated comment
Error: ../arch/arm/boot/dts/r8a7740-armadillo800eva-reference.dts:203.16-17 syntax error
Error: ../arch/arm/boot/dts/tegra30.dtsi:1.1-9 syntax error
Error: ../arch/arm/boot/dts/tegra20.dtsi:1.1-9 syntax error
../arch/arm/boot/dts/ccu8540.dts:13:23: fatal error: dbx5x0.dtsi: No such file or directory
Error: ../arch/arm/boot/dts/r8a7790.dtsi:13.1-9 syntax error
Error: ../arch/arm/boot/dts/vf610-colibri.dts:91.5-6 syntax error
Error: ../arch/arm/boot/dts/tegra30.dtsi:1.1-9 syntax error
Error: ../arch/arm/boot/dts/omap4-panda.dts:10.1-9 syntax error
Error: ../arch/arm/boot/dts/tegra20.dtsi:1.1-9 syntax error
../net/sunrpc/xprtsock.c:1758:38: error: 'SO_REUSEPORT' undeclared (first use in this function)
../arch/arm/include/asm/parport.h:12:22: error: expected '=', ',', ';', 'asm' or '__attribute__' before 'parport_pc_find_isa_ports'
../arch/arm/include/asm/parport.h:13:22: error: expected '=', ',', ';', 'asm' or '__attribute__' before 'parport_pc_find_nonpci_ports'
../drivers/parport/parport_pc.c:3070:2: error: implicit declaration of function 'parport_pc_find_nonpci_ports' [-Werror=implicit-function-declaration]
ERROR (phandle_references): Reference to non-existent node or label "tc3589x_gpio"
ERROR (phandle_references): Reference to non-existent node or label "tc3589x_gpio"
ERROR (phandle_references): Reference to non-existent node or label "tc3589x_gpio"
ERROR (phandle_references): Reference to non-existent node or label "tc3589x_gpio"
ERROR: Input tree has errors, aborting (use -f to force output)
ERROR (phandle_references): Reference to non-existent node or label "tc3589x_gpio"
ERROR: Input tree has errors, aborting (use -f to force output)
ERROR (phandle_references): Reference to non-existent node or label "mainpllclk"
ERROR (phandle_references): Reference to non-existent node or label "refclksys"
ERROR (phandle_references): Reference to non-existent node or label "papllclk"
ERROR: Input tree has errors, aborting (use -f to force output)
arm-multi_v5_defconfig
../net/core/sock.c:691:7: error: 'SO_REUSEPORT' undeclared (first use in this function)
../net/core/sock.c:890:7: error: 'SO_ATTACH_BPF' undeclared (first use in this function)
../net/core/sock.c:903:7: error: 'SO_ATTACH_REUSEPORT_CBPF' undeclared (first use in this function)
../net/core/sock.c:916:7: error: 'SO_ATTACH_REUSEPORT_EBPF' undeclared (first use in this function)
../net/core/sock.c:933:7: error: 'SO_LOCK_FILTER' undeclared (first use in this function)
../net/core/sock.c:972:7: error: 'SO_SELECT_ERR_QUEUE' undeclared (first use in this function)
../net/core/sock.c:977:7: error: 'SO_BUSY_POLL' undeclared (first use in this function)
../net/core/sock.c:990:7: error: 'SO_MAX_PACING_RATE' undeclared (first use in this function)
../net/core/sock.c:996:7: error: 'SO_INCOMING_CPU' undeclared (first use in this function)
../net/core/sock.c:1000:7: error: 'SO_CNX_ADVICE' undeclared (first use in this function)
../net/core/sock.c:1073:7: error: 'SO_REUSEPORT' undeclared (first use in this function)
../net/core/sock.c:1231:7: error: 'SO_GET_FILTER' undeclared (first use in this function)
../net/core/sock.c:1238:7: error: 'SO_LOCK_FILTER' undeclared (first use in this function)
../net/core/sock.c:1242:7: error: 'SO_BPF_EXTENSIONS' undeclared (first use in this function)
../net/core/sock.c:1246:7: error: 'SO_SELECT_ERR_QUEUE' undeclared (first use in this function)
../net/core/sock.c:1251:7: error: 'SO_BUSY_POLL' undeclared (first use in this function)
../net/core/sock.c:1256:7: error: 'SO_MAX_PACING_RATE' undeclared (first use in this function)
../net/core/sock.c:1260:7: error: 'SO_INCOMING_CPU' undeclared (first use in this function)
../net/sunrpc/xprtsock.c:1758:38: error: 'SO_REUSEPORT' undeclared (first use in this function)
-------------------------------------------------------------------------------
defconfigs with issues (other than build errors):
1 warnings 0 mismatches : x86_64-allmodconfig
1 warnings 0 mismatches : arm64-allmodconfig
-------------------------------------------------------------------------------
Errors summary: 37
5 Error: ../arch/arm/boot/dts/tegra20.dtsi:1.1-9 syntax error
5 ERROR (phandle_references): Reference to non-existent node or label "tc3589x_gpio"
3 ERROR: Input tree has errors, aborting (use -f to force output)
3 ../net/sunrpc/xprtsock.c:1758:38: error: 'SO_REUSEPORT' undeclared (first use in this function)
3 ../net/core/sock.c:996:7: error: 'SO_INCOMING_CPU' undeclared (first use in this function)
3 ../net/core/sock.c:990:7: error: 'SO_MAX_PACING_RATE' undeclared (first use in this function)
3 ../net/core/sock.c:977:7: error: 'SO_BUSY_POLL' undeclared (first use in this function)
3 ../net/core/sock.c:972:7: error: 'SO_SELECT_ERR_QUEUE' undeclared (first use in this function)
3 ../net/core/sock.c:933:7: error: 'SO_LOCK_FILTER' undeclared (first use in this function)
3 ../net/core/sock.c:916:7: error: 'SO_ATTACH_REUSEPORT_EBPF' undeclared (first use in this function)
3 ../net/core/sock.c:903:7: error: 'SO_ATTACH_REUSEPORT_CBPF' undeclared (first use in this function)
3 ../net/core/sock.c:890:7: error: 'SO_ATTACH_BPF' undeclared (first use in this function)
3 ../net/core/sock.c:691:7: error: 'SO_REUSEPORT' undeclared (first use in this function)
3 ../net/core/sock.c:1260:7: error: 'SO_INCOMING_CPU' undeclared (first use in this function)
3 ../net/core/sock.c:1256:7: error: 'SO_MAX_PACING_RATE' undeclared (first use in this function)
3 ../net/core/sock.c:1251:7: error: 'SO_BUSY_POLL' undeclared (first use in this function)
3 ../net/core/sock.c:1246:7: error: 'SO_SELECT_ERR_QUEUE' undeclared (first use in this function)
3 ../net/core/sock.c:1242:7: error: 'SO_BPF_EXTENSIONS' undeclared (first use in this function)
3 ../net/core/sock.c:1238:7: error: 'SO_LOCK_FILTER' undeclared (first use in this function)
3 ../net/core/sock.c:1231:7: error: 'SO_GET_FILTER' undeclared (first use in this function)
3 ../net/core/sock.c:1073:7: error: 'SO_REUSEPORT' undeclared (first use in this function)
3 ../net/core/sock.c:1000:7: error: 'SO_CNX_ADVICE' undeclared (first use in this function)
2 Error: ../arch/arm/boot/dts/tegra30.dtsi:1.1-9 syntax error
1 Error: ../arch/arm/boot/dts/vf610-colibri.dts:91.5-6 syntax error
1 Error: ../arch/arm/boot/dts/r8a7790.dtsi:13.1-9 syntax error
1 Error: ../arch/arm/boot/dts/r8a7740-armadillo800eva-reference.dts:203.16-17 syntax error
1 Error: ../arch/arm/boot/dts/omap4.dtsi:9.1-9 syntax error
1 Error: ../arch/arm/boot/dts/omap4-panda.dts:10.1-9 syntax error
1 Error: ../arch/arm/boot/dts/emev2.dtsi:11.1-9 syntax error
1 ERROR (phandle_references): Reference to non-existent node or label "refclksys"
1 ERROR (phandle_references): Reference to non-existent node or label "papllclk"
1 ERROR (phandle_references): Reference to non-existent node or label "mainpllclk"
1 ../drivers/parport/parport_pc.c:3070:2: error: implicit declaration of function 'parport_pc_find_nonpci_ports' [-Werror=implicit-function-declaration]
1 ../arch/arm/include/asm/parport.h:13:22: error: expected '=', ',', ';', 'asm' or '__attribute__' before 'parport_pc_find_nonpci_ports'
1 ../arch/arm/include/asm/parport.h:12:22: error: expected '=', ',', ';', 'asm' or '__attribute__' before 'parport_pc_find_isa_ports'
1 ../arch/arm/boot/dts/omap3-gta04.dts:132:57: error: unterminated comment
1 ../arch/arm/boot/dts/ccu8540.dts:13:23: fatal error: dbx5x0.dtsi: No such file or directory
Warnings Summary: 2
1 drivers/target/iscsi/iscsi_target.o: warning: objtool: iscsit_handle_task_mgt_cmd()+0x78b: sibling call from callable instruction with changed frame pointer
1 ../include/linux/sched.h:2348:56: warning: 'noio_flag' may be used uninitialized in this function [-Wmaybe-uninitialized]
===============================================================================
Detailed per-defconfig build reports below:
-------------------------------------------------------------------------------
x86_64-allmodconfig : PASS, 0 errors, 1 warnings, 0 section mismatches
Warnings:
drivers/target/iscsi/iscsi_target.o: warning: objtool: iscsit_handle_task_mgt_cmd()+0x78b: sibling call from callable instruction with changed frame pointer
-------------------------------------------------------------------------------
arm64-allmodconfig : PASS, 0 errors, 1 warnings, 0 section mismatches
Warnings:
../include/linux/sched.h:2348:56: warning: 'noio_flag' may be used uninitialized in this function [-Wmaybe-uninitialized]
-------------------------------------------------------------------------------
arm-multi_v7_defconfig : FAIL, 19 errors, 0 warnings, 0 section mismatches
Errors:
../net/core/sock.c:691:7: error: 'SO_REUSEPORT' undeclared (first use in this function)
../net/core/sock.c:890:7: error: 'SO_ATTACH_BPF' undeclared (first use in this function)
../net/core/sock.c:903:7: error: 'SO_ATTACH_REUSEPORT_CBPF' undeclared (first use in this function)
../net/core/sock.c:916:7: error: 'SO_ATTACH_REUSEPORT_EBPF' undeclared (first use in this function)
../net/core/sock.c:933:7: error: 'SO_LOCK_FILTER' undeclared (first use in this function)
../net/core/sock.c:972:7: error: 'SO_SELECT_ERR_QUEUE' undeclared (first use in this function)
../net/core/sock.c:977:7: error: 'SO_BUSY_POLL' undeclared (first use in this function)
../net/core/sock.c:990:7: error: 'SO_MAX_PACING_RATE' undeclared (first use in this function)
../net/core/sock.c:996:7: error: 'SO_INCOMING_CPU' undeclared (first use in this function)
../net/core/sock.c:1000:7: error: 'SO_CNX_ADVICE' undeclared (first use in this function)
../net/core/sock.c:1073:7: error: 'SO_REUSEPORT' undeclared (first use in this function)
../net/core/sock.c:1231:7: error: 'SO_GET_FILTER' undeclared (first use in this function)
../net/core/sock.c:1238:7: error: 'SO_LOCK_FILTER' undeclared (first use in this function)
../net/core/sock.c:1242:7: error: 'SO_BPF_EXTENSIONS' undeclared (first use in this function)
../net/core/sock.c:1246:7: error: 'SO_SELECT_ERR_QUEUE' undeclared (first use in this function)
../net/core/sock.c:1251:7: error: 'SO_BUSY_POLL' undeclared (first use in this function)
../net/core/sock.c:1256:7: error: 'SO_MAX_PACING_RATE' undeclared (first use in this function)
../net/core/sock.c:1260:7: error: 'SO_INCOMING_CPU' undeclared (first use in this function)
../net/sunrpc/xprtsock.c:1758:38: error: 'SO_REUSEPORT' undeclared (first use in this function)
-------------------------------------------------------------------------------
arm-allmodconfig : FAIL, 48 errors, 0 warnings, 0 section mismatches
Errors:
../net/core/sock.c:691:7: error: 'SO_REUSEPORT' undeclared (first use in this function)
../net/core/sock.c:890:7: error: 'SO_ATTACH_BPF' undeclared (first use in this function)
../net/core/sock.c:903:7: error: 'SO_ATTACH_REUSEPORT_CBPF' undeclared (first use in this function)
../net/core/sock.c:916:7: error: 'SO_ATTACH_REUSEPORT_EBPF' undeclared (first use in this function)
../net/core/sock.c:933:7: error: 'SO_LOCK_FILTER' undeclared (first use in this function)
../net/core/sock.c:972:7: error: 'SO_SELECT_ERR_QUEUE' undeclared (first use in this function)
../net/core/sock.c:977:7: error: 'SO_BUSY_POLL' undeclared (first use in this function)
../net/core/sock.c:990:7: error: 'SO_MAX_PACING_RATE' undeclared (first use in this function)
../net/core/sock.c:996:7: error: 'SO_INCOMING_CPU' undeclared (first use in this function)
../net/core/sock.c:1000:7: error: 'SO_CNX_ADVICE' undeclared (first use in this function)
../net/core/sock.c:1073:7: error: 'SO_REUSEPORT' undeclared (first use in this function)
../net/core/sock.c:1231:7: error: 'SO_GET_FILTER' undeclared (first use in this function)
../net/core/sock.c:1238:7: error: 'SO_LOCK_FILTER' undeclared (first use in this function)
../net/core/sock.c:1242:7: error: 'SO_BPF_EXTENSIONS' undeclared (first use in this function)
../net/core/sock.c:1246:7: error: 'SO_SELECT_ERR_QUEUE' undeclared (first use in this function)
../net/core/sock.c:1251:7: error: 'SO_BUSY_POLL' undeclared (first use in this function)
../net/core/sock.c:1256:7: error: 'SO_MAX_PACING_RATE' undeclared (first use in this function)
../net/core/sock.c:1260:7: error: 'SO_INCOMING_CPU' undeclared (first use in this function)
Error: ../arch/arm/boot/dts/tegra20.dtsi:1.1-9 syntax error
Error: ../arch/arm/boot/dts/omap4.dtsi:9.1-9 syntax error
Error: ../arch/arm/boot/dts/emev2.dtsi:11.1-9 syntax error
Error: ../arch/arm/boot/dts/tegra20.dtsi:1.1-9 syntax error
Error: ../arch/arm/boot/dts/tegra20.dtsi:1.1-9 syntax error
../arch/arm/boot/dts/omap3-gta04.dts:132:57: error: unterminated comment
Error: ../arch/arm/boot/dts/r8a7740-armadillo800eva-reference.dts:203.16-17 syntax error
Error: ../arch/arm/boot/dts/tegra30.dtsi:1.1-9 syntax error
Error: ../arch/arm/boot/dts/tegra20.dtsi:1.1-9 syntax error
../arch/arm/boot/dts/ccu8540.dts:13:23: fatal error: dbx5x0.dtsi: No such file or directory
Error: ../arch/arm/boot/dts/r8a7790.dtsi:13.1-9 syntax error
Error: ../arch/arm/boot/dts/vf610-colibri.dts:91.5-6 syntax error
Error: ../arch/arm/boot/dts/tegra30.dtsi:1.1-9 syntax error
Error: ../arch/arm/boot/dts/omap4-panda.dts:10.1-9 syntax error
Error: ../arch/arm/boot/dts/tegra20.dtsi:1.1-9 syntax error
../net/sunrpc/xprtsock.c:1758:38: error: 'SO_REUSEPORT' undeclared (first use in this function)
../arch/arm/include/asm/parport.h:12:22: error: expected '=', ',', ';', 'asm' or '__attribute__' before 'parport_pc_find_isa_ports'
../arch/arm/include/asm/parport.h:13:22: error: expected '=', ',', ';', 'asm' or '__attribute__' before 'parport_pc_find_nonpci_ports'
../drivers/parport/parport_pc.c:3070:2: error: implicit declaration of function 'parport_pc_find_nonpci_ports' [-Werror=implicit-function-declaration]
ERROR (phandle_references): Reference to non-existent node or label "tc3589x_gpio"
ERROR (phandle_references): Reference to non-existent node or label "tc3589x_gpio"
ERROR (phandle_references): Reference to non-existent node or label "tc3589x_gpio"
ERROR (phandle_references): Reference to non-existent node or label "tc3589x_gpio"
ERROR: Input tree has errors, aborting (use -f to force output)
ERROR (phandle_references): Reference to non-existent node or label "tc3589x_gpio"
ERROR: Input tree has errors, aborting (use -f to force output)
ERROR (phandle_references): Reference to non-existent node or label "mainpllclk"
ERROR (phandle_references): Reference to non-existent node or label "refclksys"
ERROR (phandle_references): Reference to non-existent node or label "papllclk"
ERROR: Input tree has errors, aborting (use -f to force output)
-------------------------------------------------------------------------------
arm-multi_v5_defconfig : FAIL, 19 errors, 0 warnings, 0 section mismatches
Errors:
../net/core/sock.c:691:7: error: 'SO_REUSEPORT' undeclared (first use in this function)
../net/core/sock.c:890:7: error: 'SO_ATTACH_BPF' undeclared (first use in this function)
../net/core/sock.c:903:7: error: 'SO_ATTACH_REUSEPORT_CBPF' undeclared (first use in this function)
../net/core/sock.c:916:7: error: 'SO_ATTACH_REUSEPORT_EBPF' undeclared (first use in this function)
../net/core/sock.c:933:7: error: 'SO_LOCK_FILTER' undeclared (first use in this function)
../net/core/sock.c:972:7: error: 'SO_SELECT_ERR_QUEUE' undeclared (first use in this function)
../net/core/sock.c:977:7: error: 'SO_BUSY_POLL' undeclared (first use in this function)
../net/core/sock.c:990:7: error: 'SO_MAX_PACING_RATE' undeclared (first use in this function)
../net/core/sock.c:996:7: error: 'SO_INCOMING_CPU' undeclared (first use in this function)
../net/core/sock.c:1000:7: error: 'SO_CNX_ADVICE' undeclared (first use in this function)
../net/core/sock.c:1073:7: error: 'SO_REUSEPORT' undeclared (first use in this function)
../net/core/sock.c:1231:7: error: 'SO_GET_FILTER' undeclared (first use in this function)
../net/core/sock.c:1238:7: error: 'SO_LOCK_FILTER' undeclared (first use in this function)
../net/core/sock.c:1242:7: error: 'SO_BPF_EXTENSIONS' undeclared (first use in this function)
../net/core/sock.c:1246:7: error: 'SO_SELECT_ERR_QUEUE' undeclared (first use in this function)
../net/core/sock.c:1251:7: error: 'SO_BUSY_POLL' undeclared (first use in this function)
../net/core/sock.c:1256:7: error: 'SO_MAX_PACING_RATE' undeclared (first use in this function)
../net/core/sock.c:1260:7: error: 'SO_INCOMING_CPU' undeclared (first use in this function)
../net/sunrpc/xprtsock.c:1758:38: error: 'SO_REUSEPORT' undeclared (first use in this function)
-------------------------------------------------------------------------------
Passed with no errors, warnings or mismatches:
arm64-allnoconfig
x86_64-defconfig
arm-allnoconfig
x86_64-allnoconfig
arm-multi_v4t_defconfig
arm64-defconfig
This is a note to let you know that I've just added the patch titled
vti6: better validate user provided tunnel names
to the 4.9-stable tree which can be found at:
http://www.kernel.org/git/?p=linux/kernel/git/stable/stable-queue.git;a=sum…
The filename of the patch is:
vti6-better-validate-user-provided-tunnel-names.patch
and it can be found in the queue-4.9 subdirectory.
If you, or anyone else, feels it should not be added to the stable tree,
please let <stable(a)vger.kernel.org> know about it.
>From foo@baz Wed Apr 11 10:26:56 CEST 2018
From: Eric Dumazet <edumazet(a)google.com>
Date: Thu, 5 Apr 2018 06:39:31 -0700
Subject: vti6: better validate user provided tunnel names
From: Eric Dumazet <edumazet(a)google.com>
[ Upstream commit 537b361fbcbcc3cd6fe2bb47069fd292b9256d16 ]
Use valid_name() to make sure user does not provide illegal
device name.
Fixes: ed1efb2aefbb ("ipv6: Add support for IPsec virtual tunnel interfaces")
Signed-off-by: Eric Dumazet <edumazet(a)google.com>
Cc: Steffen Klassert <steffen.klassert(a)secunet.com>
Signed-off-by: David S. Miller <davem(a)davemloft.net>
Signed-off-by: Greg Kroah-Hartman <gregkh(a)linuxfoundation.org>
---
net/ipv6/ip6_vti.c | 7 +++++--
1 file changed, 5 insertions(+), 2 deletions(-)
--- a/net/ipv6/ip6_vti.c
+++ b/net/ipv6/ip6_vti.c
@@ -212,10 +212,13 @@ static struct ip6_tnl *vti6_tnl_create(s
char name[IFNAMSIZ];
int err;
- if (p->name[0])
+ if (p->name[0]) {
+ if (!dev_valid_name(p->name))
+ goto failed;
strlcpy(name, p->name, IFNAMSIZ);
- else
+ } else {
sprintf(name, "ip6_vti%%d");
+ }
dev = alloc_netdev(sizeof(*t), name, NET_NAME_UNKNOWN, vti6_dev_setup);
if (!dev)
Patches currently in stable-queue which might be from edumazet(a)google.com are
queue-4.9/tcp-better-validation-of-received-ack-sequences.patch
queue-4.9/sctp-sctp_sockaddr_af-must-check-minimal-addr-length-for-af_inet6.patch
queue-4.9/net-fix-possible-out-of-bound-read-in-skb_network_protocol.patch
queue-4.9/pptp-remove-a-buggy-dst-release-in-pptp_connect.patch
queue-4.9/x86-asm-don-t-use-rbp-as-a-temporary-register-in-csum_partial_copy_generic.patch
queue-4.9/net-fool-proof-dev_valid_name.patch
queue-4.9/ipv6-the-entire-ipv6-header-chain-must-fit-the-first-fragment.patch
queue-4.9/vti6-better-validate-user-provided-tunnel-names.patch
queue-4.9/ipv6-sit-better-validate-user-provided-tunnel-names.patch
queue-4.9/ip6_tunnel-better-validate-user-provided-tunnel-names.patch
queue-4.9/sctp-do-not-leak-kernel-memory-to-user-space.patch
queue-4.9/ip_tunnel-better-validate-user-provided-tunnel-names.patch
queue-4.9/skbuff-only-inherit-relevant-tx_flags.patch
queue-4.9/netlink-make-sure-nladdr-has-correct-size-in-netlink_connect.patch
queue-4.9/ip6_gre-better-validate-user-provided-tunnel-names.patch
This is a note to let you know that I've just added the patch titled
vhost_net: add missing lock nesting notation
to the 4.9-stable tree which can be found at:
http://www.kernel.org/git/?p=linux/kernel/git/stable/stable-queue.git;a=sum…
The filename of the patch is:
vhost_net-add-missing-lock-nesting-notation.patch
and it can be found in the queue-4.9 subdirectory.
If you, or anyone else, feels it should not be added to the stable tree,
please let <stable(a)vger.kernel.org> know about it.
>From foo@baz Wed Apr 11 10:26:56 CEST 2018
From: Jason Wang <jasowang(a)redhat.com>
Date: Mon, 26 Mar 2018 16:10:23 +0800
Subject: vhost_net: add missing lock nesting notation
From: Jason Wang <jasowang(a)redhat.com>
[ Upstream commit aaa3149bbee9ba9b4e6f0bd6e3e7d191edeae942 ]
We try to hold TX virtqueue mutex in vhost_net_rx_peek_head_len()
after RX virtqueue mutex is held in handle_rx(). This requires an
appropriate lock nesting notation to calm down deadlock detector.
Fixes: 0308813724606 ("vhost_net: basic polling support")
Reported-by: syzbot+7f073540b1384a614e09(a)syzkaller.appspotmail.com
Signed-off-by: Jason Wang <jasowang(a)redhat.com>
Acked-by: Michael S. Tsirkin <mst(a)redhat.com>
Signed-off-by: David S. Miller <davem(a)davemloft.net>
Signed-off-by: Greg Kroah-Hartman <gregkh(a)linuxfoundation.org>
---
drivers/vhost/net.c | 4 ++--
1 file changed, 2 insertions(+), 2 deletions(-)
--- a/drivers/vhost/net.c
+++ b/drivers/vhost/net.c
@@ -524,7 +524,7 @@ static int vhost_net_rx_peek_head_len(st
if (!len && vq->busyloop_timeout) {
/* Both tx vq and rx socket were polled here */
- mutex_lock(&vq->mutex);
+ mutex_lock_nested(&vq->mutex, 1);
vhost_disable_notify(&net->dev, vq);
preempt_disable();
@@ -657,7 +657,7 @@ static void handle_rx(struct vhost_net *
struct iov_iter fixup;
__virtio16 num_buffers;
- mutex_lock(&vq->mutex);
+ mutex_lock_nested(&vq->mutex, 0);
sock = vq->private_data;
if (!sock)
goto out;
Patches currently in stable-queue which might be from jasowang(a)redhat.com are
queue-4.9/skbuff-return-emsgsize-in-skb_to_sgvec-to-prevent-overflow.patch
queue-4.9/virtio_net-check-return-value-of-skb_to_sgvec-always.patch
queue-4.9/vhost-validate-log-when-iotlb-is-enabled.patch
queue-4.9/vhost_net-add-missing-lock-nesting-notation.patch
queue-4.9/vhost-correctly-remove-wait-queue-during-poll-failure.patch
queue-4.9/virtio_net-check-return-value-of-skb_to_sgvec-in-one-more-location.patch
This is a note to let you know that I've just added the patch titled
vlan: also check phy_driver ts_info for vlan's real device
to the 4.9-stable tree which can be found at:
http://www.kernel.org/git/?p=linux/kernel/git/stable/stable-queue.git;a=sum…
The filename of the patch is:
vlan-also-check-phy_driver-ts_info-for-vlan-s-real-device.patch
and it can be found in the queue-4.9 subdirectory.
If you, or anyone else, feels it should not be added to the stable tree,
please let <stable(a)vger.kernel.org> know about it.
>From foo@baz Wed Apr 11 10:26:56 CEST 2018
From: Hangbin Liu <liuhangbin(a)gmail.com>
Date: Fri, 30 Mar 2018 09:44:00 +0800
Subject: vlan: also check phy_driver ts_info for vlan's real device
From: Hangbin Liu <liuhangbin(a)gmail.com>
[ Upstream commit ec1d8ccb07deaf30fd0508af6755364ac47dc08d ]
Just like function ethtool_get_ts_info(), we should also consider the
phy_driver ts_info call back. For example, driver dp83640.
Fixes: 37dd9255b2f6 ("vlan: Pass ethtool get_ts_info queries to real device.")
Acked-by: Richard Cochran <richardcochran(a)gmail.com>
Signed-off-by: Hangbin Liu <liuhangbin(a)gmail.com>
Signed-off-by: David S. Miller <davem(a)davemloft.net>
Signed-off-by: Greg Kroah-Hartman <gregkh(a)linuxfoundation.org>
---
net/8021q/vlan_dev.c | 6 +++++-
1 file changed, 5 insertions(+), 1 deletion(-)
--- a/net/8021q/vlan_dev.c
+++ b/net/8021q/vlan_dev.c
@@ -29,6 +29,7 @@
#include <linux/net_tstamp.h>
#include <linux/etherdevice.h>
#include <linux/ethtool.h>
+#include <linux/phy.h>
#include <net/arp.h>
#include <net/switchdev.h>
@@ -658,8 +659,11 @@ static int vlan_ethtool_get_ts_info(stru
{
const struct vlan_dev_priv *vlan = vlan_dev_priv(dev);
const struct ethtool_ops *ops = vlan->real_dev->ethtool_ops;
+ struct phy_device *phydev = vlan->real_dev->phydev;
- if (ops->get_ts_info) {
+ if (phydev && phydev->drv && phydev->drv->ts_info) {
+ return phydev->drv->ts_info(phydev, info);
+ } else if (ops->get_ts_info) {
return ops->get_ts_info(vlan->real_dev, info);
} else {
info->so_timestamping = SOF_TIMESTAMPING_RX_SOFTWARE |
Patches currently in stable-queue which might be from liuhangbin(a)gmail.com are
queue-4.9/vlan-also-check-phy_driver-ts_info-for-vlan-s-real-device.patch
queue-4.9/l2tp-fix-missing-print-session-offset-info.patch