lists.linaro.org
Sign In
Sign Up
Sign In
Sign Up
Manage this list
×
Keyboard Shortcuts
Thread View
j
: Next unread message
k
: Previous unread message
j a
: Jump to all threads
j l
: Jump to MailingList overview
2025
February
January
2024
December
November
October
September
August
July
June
May
April
March
February
January
2023
December
November
October
September
August
July
June
May
April
March
February
January
2022
December
November
October
September
August
July
June
May
April
March
February
January
2021
December
November
October
September
August
July
June
May
April
March
February
January
2020
December
November
October
September
August
July
June
May
April
March
February
January
2019
December
November
October
September
August
July
June
May
April
March
February
January
2018
December
November
October
September
August
July
June
May
April
March
February
January
2017
December
November
List overview
Download
Linux-stable-mirror
May 2023
----- 2025 -----
February 2025
January 2025
----- 2024 -----
December 2024
November 2024
October 2024
September 2024
August 2024
July 2024
June 2024
May 2024
April 2024
March 2024
February 2024
January 2024
----- 2023 -----
December 2023
November 2023
October 2023
September 2023
August 2023
July 2023
June 2023
May 2023
April 2023
March 2023
February 2023
January 2023
----- 2022 -----
December 2022
November 2022
October 2022
September 2022
August 2022
July 2022
June 2022
May 2022
April 2022
March 2022
February 2022
January 2022
----- 2021 -----
December 2021
November 2021
October 2021
September 2021
August 2021
July 2021
June 2021
May 2021
April 2021
March 2021
February 2021
January 2021
----- 2020 -----
December 2020
November 2020
October 2020
September 2020
August 2020
July 2020
June 2020
May 2020
April 2020
March 2020
February 2020
January 2020
----- 2019 -----
December 2019
November 2019
October 2019
September 2019
August 2019
July 2019
June 2019
May 2019
April 2019
March 2019
February 2019
January 2019
----- 2018 -----
December 2018
November 2018
October 2018
September 2018
August 2018
July 2018
June 2018
May 2018
April 2018
March 2018
February 2018
January 2018
----- 2017 -----
December 2017
November 2017
linux-stable-mirror@lists.linaro.org
431 participants
1874 discussions
Start a n
N
ew thread
stable-rc/queue/6.1 build: 166 builds: 1 failed, 165 passed, 4 errors, 17 warnings (v6.1.29-438-g81b569a4c469)
by kernelci.org bot
stable-rc/queue/6.1 build: 166 builds: 1 failed, 165 passed, 4 errors, 17 warnings (v6.1.29-438-g81b569a4c469) Full Build Summary:
https://kernelci.org/build/stable-rc/branch/queue%2F6.1/kernel/v6.1.29-438-…
Tree: stable-rc Branch: queue/6.1 Git Describe: v6.1.29-438-g81b569a4c469 Git Commit: 81b569a4c4697714505e573d1fe2b711de31e62a Git URL:
https://git.kernel.org/pub/scm/linux/kernel/git/stable/linux-stable-rc.git
Built: 7 unique architectures Build Failure Detected: mips:
…
[View More]
decstation_64_defconfig: (gcc-10) FAIL Errors and Warnings Detected: arc: arm64: arm: i386: mips: 32r2el_defconfig (gcc-10): 1 warning bmips_be_defconfig (gcc-10): 8 warnings bmips_stb_defconfig (gcc-10): 8 warnings fuloong2e_defconfig (gcc-10): 1 error lemote2f_defconfig (gcc-10): 1 error loongson2k_defconfig (gcc-10): 1 error loongson3_defconfig (gcc-10): 1 error riscv: x86_64: Errors summary: 4 cc1: error: ‘-mloongson-mmi’ must be used with ‘-mhard-float’ Warnings summary: 2 arch/mips/boot/dts/brcm/bcm63268.dtsi:115.5-22: Warning (reg_format): /ubus/timer-mfd@10000080/watchdog@1c:reg: property has invalid length (8 bytes) (#address-cells == 2, #size-cells == 1) 2 arch/mips/boot/dts/brcm/bcm63268.dtsi:113.21-121.6: Warning (avoid_default_addr_size): /ubus/timer-mfd@10000080/watchdog@1c: Relying on default #size-cells value 2 arch/mips/boot/dts/brcm/bcm63268.dtsi:113.21-121.6: Warning (avoid_default_addr_size): /ubus/timer-mfd@10000080/watchdog@1c: Relying on default #address-cells value 2 arch/mips/boot/dts/brcm/bcm63268.dtsi:111.4-35: Warning (ranges_format): /ubus/timer-mfd@10000080:ranges: "ranges" property has invalid length (12 bytes) (parent #address-cells == 1, child #address-cells == 2, #size-cells == 1) 2 arch/mips/boot/dts/brcm/bcm63268-comtrend-vr-3032u.dtb: Warning (spi_bus_reg): Failed prerequisite 'reg_format' 2 arch/mips/boot/dts/brcm/bcm63268-comtrend-vr-3032u.dtb: Warning (pci_device_reg): Failed prerequisite 'reg_format' 2 arch/mips/boot/dts/brcm/bcm63268-comtrend-vr-3032u.dtb: Warning (pci_device_bus_num): Failed prerequisite 'reg_format' 2 arch/mips/boot/dts/brcm/bcm63268-comtrend-vr-3032u.dtb: Warning (i2c_bus_reg): Failed prerequisite 'reg_format' 1 arch/mips/boot/dts/img/boston.dts:128.19-178.5: Warning (pci_device_reg): /pci@14000000/pci2_root@0,0,0: PCI unit address format error, expected "0,0" ================================================================================ Detailed per-defconfig build reports: -------------------------------------------------------------------------------- 32r2el_defconfig (mips, gcc-10) — PASS, 0 errors, 1 warning, 0 section mismatches Warnings: arch/mips/boot/dts/img/boston.dts:128.19-178.5: Warning (pci_device_reg): /pci@14000000/pci2_root@0,0,0: PCI unit address format error, expected "0,0" -------------------------------------------------------------------------------- allnoconfig (arc, gcc-10) — PASS, 0 errors, 0 warnings, 0 section mismatches -------------------------------------------------------------------------------- allnoconfig (x86_64, gcc-10) — PASS, 0 errors, 0 warnings, 0 section mismatches -------------------------------------------------------------------------------- allnoconfig (i386, gcc-10) — PASS, 0 errors, 0 warnings, 0 section mismatches -------------------------------------------------------------------------------- am200epdkit_defconfig (arm, gcc-10) — PASS, 0 errors, 0 warnings, 0 section mismatches -------------------------------------------------------------------------------- ar7_defconfig (mips, gcc-10) — PASS, 0 errors, 0 warnings, 0 section mismatches -------------------------------------------------------------------------------- aspeed_g4_defconfig (arm, gcc-10) — PASS, 0 errors, 0 warnings, 0 section mismatches -------------------------------------------------------------------------------- aspeed_g5_defconfig (arm, gcc-10) — PASS, 0 errors, 0 warnings, 0 section mismatches -------------------------------------------------------------------------------- assabet_defconfig (arm, gcc-10) — PASS, 0 errors, 0 warnings, 0 section mismatches -------------------------------------------------------------------------------- at91_dt_defconfig (arm, gcc-10) — PASS, 0 errors, 0 warnings, 0 section mismatches -------------------------------------------------------------------------------- ath25_defconfig (mips, gcc-10) — PASS, 0 errors, 0 warnings, 0 section mismatches -------------------------------------------------------------------------------- ath79_defconfig (mips, gcc-10) — PASS, 0 errors, 0 warnings, 0 section mismatches -------------------------------------------------------------------------------- axm55xx_defconfig (arm, gcc-10) — PASS, 0 errors, 0 warnings, 0 section mismatches -------------------------------------------------------------------------------- axs103_defconfig (arc, gcc-10) — PASS, 0 errors, 0 warnings, 0 section mismatches -------------------------------------------------------------------------------- axs103_smp_defconfig (arc, gcc-10) — PASS, 0 errors, 0 warnings, 0 section mismatches -------------------------------------------------------------------------------- badge4_defconfig (arm, gcc-10) — PASS, 0 errors, 0 warnings, 0 section mismatches -------------------------------------------------------------------------------- bcm2835_defconfig (arm, gcc-10) — PASS, 0 errors, 0 warnings, 0 section mismatches -------------------------------------------------------------------------------- bcm47xx_defconfig (mips, gcc-10) — PASS, 0 errors, 0 warnings, 0 section mismatches -------------------------------------------------------------------------------- bcm63xx_defconfig (mips, gcc-10) — PASS, 0 errors, 0 warnings, 0 section mismatches -------------------------------------------------------------------------------- bigsur_defconfig (mips, gcc-10) — PASS, 0 errors, 0 warnings, 0 section mismatches -------------------------------------------------------------------------------- bmips_be_defconfig (mips, gcc-10) — PASS, 0 errors, 8 warnings, 0 section mismatches Warnings: arch/mips/boot/dts/brcm/bcm63268.dtsi:115.5-22: Warning (reg_format): /ubus/timer-mfd@10000080/watchdog@1c:reg: property has invalid length (8 bytes) (#address-cells == 2, #size-cells == 1) arch/mips/boot/dts/brcm/bcm63268.dtsi:111.4-35: Warning (ranges_format): /ubus/timer-mfd@10000080:ranges: "ranges" property has invalid length (12 bytes) (parent #address-cells == 1, child #address-cells == 2, #size-cells == 1) arch/mips/boot/dts/brcm/bcm63268-comtrend-vr-3032u.dtb: Warning (pci_device_reg): Failed prerequisite 'reg_format' arch/mips/boot/dts/brcm/bcm63268-comtrend-vr-3032u.dtb: Warning (pci_device_bus_num): Failed prerequisite 'reg_format' arch/mips/boot/dts/brcm/bcm63268-comtrend-vr-3032u.dtb: Warning (i2c_bus_reg): Failed prerequisite 'reg_format' arch/mips/boot/dts/brcm/bcm63268-comtrend-vr-3032u.dtb: Warning (spi_bus_reg): Failed prerequisite 'reg_format' arch/mips/boot/dts/brcm/bcm63268.dtsi:113.21-121.6: Warning (avoid_default_addr_size): /ubus/timer-mfd@10000080/watchdog@1c: Relying on default #address-cells value arch/mips/boot/dts/brcm/bcm63268.dtsi:113.21-121.6: Warning (avoid_default_addr_size): /ubus/timer-mfd@10000080/watchdog@1c: Relying on default #size-cells value -------------------------------------------------------------------------------- bmips_stb_defconfig (mips, gcc-10) — PASS, 0 errors, 8 warnings, 0 section mismatches Warnings: arch/mips/boot/dts/brcm/bcm63268.dtsi:115.5-22: Warning (reg_format): /ubus/timer-mfd@10000080/watchdog@1c:reg: property has invalid length (8 bytes) (#address-cells == 2, #size-cells == 1) arch/mips/boot/dts/brcm/bcm63268.dtsi:111.4-35: Warning (ranges_format): /ubus/timer-mfd@10000080:ranges: "ranges" property has invalid length (12 bytes) (parent #address-cells == 1, child #address-cells == 2, #size-cells == 1) arch/mips/boot/dts/brcm/bcm63268-comtrend-vr-3032u.dtb: Warning (pci_device_reg): Failed prerequisite 'reg_format' arch/mips/boot/dts/brcm/bcm63268-comtrend-vr-3032u.dtb: Warning (pci_device_bus_num): Failed prerequisite 'reg_format' arch/mips/boot/dts/brcm/bcm63268-comtrend-vr-3032u.dtb: Warning (i2c_bus_reg): Failed prerequisite 'reg_format' arch/mips/boot/dts/brcm/bcm63268-comtrend-vr-3032u.dtb: Warning (spi_bus_reg): Failed prerequisite 'reg_format' arch/mips/boot/dts/brcm/bcm63268.dtsi:113.21-121.6: Warning (avoid_default_addr_size): /ubus/timer-mfd@10000080/watchdog@1c: Relying on default #address-cells value arch/mips/boot/dts/brcm/bcm63268.dtsi:113.21-121.6: Warning (avoid_default_addr_size): /ubus/timer-mfd@10000080/watchdog@1c: Relying on default #size-cells value -------------------------------------------------------------------------------- cavium_octeon_defconfig (mips, gcc-10) — PASS, 0 errors, 0 warnings, 0 section mismatches -------------------------------------------------------------------------------- cerfcube_defconfig (arm, gcc-10) — PASS, 0 errors, 0 warnings, 0 section mismatches -------------------------------------------------------------------------------- ci20_defconfig (mips, gcc-10) — PASS, 0 errors, 0 warnings, 0 section mismatches -------------------------------------------------------------------------------- cm_x300_defconfig (arm, gcc-10) — PASS, 0 errors, 0 warnings, 0 section mismatches -------------------------------------------------------------------------------- cobalt_defconfig (mips, gcc-10) — PASS, 0 errors, 0 warnings, 0 section mismatches -------------------------------------------------------------------------------- colibri_pxa270_defconfig (arm, gcc-10) — PASS, 0 errors, 0 warnings, 0 section mismatches -------------------------------------------------------------------------------- colibri_pxa300_defconfig (arm, gcc-10) — PASS, 0 errors, 0 warnings, 0 section mismatches -------------------------------------------------------------------------------- collie_defconfig (arm, gcc-10) — PASS, 0 errors, 0 warnings, 0 section mismatches -------------------------------------------------------------------------------- corgi_defconfig (arm, gcc-10) — PASS, 0 errors, 0 warnings, 0 section mismatches -------------------------------------------------------------------------------- cu1000-neo_defconfig (mips, gcc-10) — PASS, 0 errors, 0 warnings, 0 section mismatches -------------------------------------------------------------------------------- cu1830-neo_defconfig (mips, gcc-10) — PASS, 0 errors, 0 warnings, 0 section mismatches -------------------------------------------------------------------------------- davinci_all_defconfig (arm, gcc-10) — PASS, 0 errors, 0 warnings, 0 section mismatches -------------------------------------------------------------------------------- db1xxx_defconfig (mips, gcc-10) — PASS, 0 errors, 0 warnings, 0 section mismatches -------------------------------------------------------------------------------- decstation_64_defconfig (mips, gcc-10) — FAIL, 0 errors, 0 warnings, 0 section mismatches -------------------------------------------------------------------------------- decstation_defconfig (mips, gcc-10) — PASS, 0 errors, 0 warnings, 0 section mismatches -------------------------------------------------------------------------------- decstation_r4k_defconfig (mips, gcc-10) — PASS, 0 errors, 0 warnings, 0 section mismatches -------------------------------------------------------------------------------- defconfig (arm64, gcc-10) — PASS, 0 errors, 0 warnings, 0 section mismatches -------------------------------------------------------------------------------- defconfig (riscv, gcc-10) — PASS, 0 errors, 0 warnings, 0 section mismatches -------------------------------------------------------------------------------- defconfig+arm64-chromebook (arm64, gcc-10) — PASS, 0 errors, 0 warnings, 0 section mismatches -------------------------------------------------------------------------------- eseries_pxa_defconfig (arm, gcc-10) — PASS, 0 errors, 0 warnings, 0 section mismatches -------------------------------------------------------------------------------- exynos_defconfig (arm, gcc-10) — PASS, 0 errors, 0 warnings, 0 section mismatches -------------------------------------------------------------------------------- ezx_defconfig (arm, gcc-10) — PASS, 0 errors, 0 warnings, 0 section mismatches -------------------------------------------------------------------------------- footbridge_defconfig (arm, gcc-10) — PASS, 0 errors, 0 warnings, 0 section mismatches -------------------------------------------------------------------------------- fuloong2e_defconfig (mips, gcc-10) — PASS, 1 error, 0 warnings, 0 section mismatches Errors: cc1: error: ‘-mloongson-mmi’ must be used with ‘-mhard-float’ -------------------------------------------------------------------------------- gcw0_defconfig (mips, gcc-10) — PASS, 0 errors, 0 warnings, 0 section mismatches -------------------------------------------------------------------------------- gemini_defconfig (arm, gcc-10) — PASS, 0 errors, 0 warnings, 0 section mismatches -------------------------------------------------------------------------------- gpr_defconfig (mips, gcc-10) — PASS, 0 errors, 0 warnings, 0 section mismatches -------------------------------------------------------------------------------- h3600_defconfig (arm, gcc-10) — PASS, 0 errors, 0 warnings, 0 section mismatches -------------------------------------------------------------------------------- h5000_defconfig (arm, gcc-10) — PASS, 0 errors, 0 warnings, 0 section mismatches -------------------------------------------------------------------------------- hackkit_defconfig (arm, gcc-10) — PASS, 0 errors, 0 warnings, 0 section mismatches -------------------------------------------------------------------------------- haps_hs_defconfig (arc, gcc-10) — PASS, 0 errors, 0 warnings, 0 section mismatches -------------------------------------------------------------------------------- haps_hs_smp_defconfig (arc, gcc-10) — PASS, 0 errors, 0 warnings, 0 section mismatches -------------------------------------------------------------------------------- hisi_defconfig (arm, gcc-10) — PASS, 0 errors, 0 warnings, 0 section mismatches -------------------------------------------------------------------------------- hsdk_defconfig (arc, gcc-10) — PASS, 0 errors, 0 warnings, 0 section mismatches -------------------------------------------------------------------------------- i386_defconfig (i386, gcc-10) — PASS, 0 errors, 0 warnings, 0 section mismatches -------------------------------------------------------------------------------- imx_v4_v5_defconfig (arm, gcc-10) — PASS, 0 errors, 0 warnings, 0 section mismatches -------------------------------------------------------------------------------- imx_v6_v7_defconfig (arm, gcc-10) — PASS, 0 errors, 0 warnings, 0 section mismatches -------------------------------------------------------------------------------- imxrt_defconfig (arm, gcc-10) — PASS, 0 errors, 0 warnings, 0 section mismatches -------------------------------------------------------------------------------- integrator_defconfig (arm, gcc-10) — PASS, 0 errors, 0 warnings, 0 section mismatches -------------------------------------------------------------------------------- ip22_defconfig (mips, gcc-10) — PASS, 0 errors, 0 warnings, 0 section mismatches -------------------------------------------------------------------------------- ip27_defconfig (mips, gcc-10) — PASS, 0 errors, 0 warnings, 0 section mismatches -------------------------------------------------------------------------------- ip28_defconfig (mips, gcc-10) — PASS, 0 errors, 0 warnings, 0 section mismatches -------------------------------------------------------------------------------- ip32_defconfig (mips, gcc-10) — PASS, 0 errors, 0 warnings, 0 section mismatches -------------------------------------------------------------------------------- ixp4xx_defconfig (arm, gcc-10) — PASS, 0 errors, 0 warnings, 0 section mismatches -------------------------------------------------------------------------------- jazz_defconfig (mips, gcc-10) — PASS, 0 errors, 0 warnings, 0 section mismatches -------------------------------------------------------------------------------- jornada720_defconfig (arm, gcc-10) — PASS, 0 errors, 0 warnings, 0 section mismatches -------------------------------------------------------------------------------- keystone_defconfig (arm, gcc-10) — PASS, 0 errors, 0 warnings, 0 section mismatches -------------------------------------------------------------------------------- lart_defconfig (arm, gcc-10) — PASS, 0 errors, 0 warnings, 0 section mismatches -------------------------------------------------------------------------------- lemote2f_defconfig (mips, gcc-10) — PASS, 1 error, 0 warnings, 0 section mismatches Errors: cc1: error: ‘-mloongson-mmi’ must be used with ‘-mhard-float’ -------------------------------------------------------------------------------- loongson1b_defconfig (mips, gcc-10) — PASS, 0 errors, 0 warnings, 0 section mismatches -------------------------------------------------------------------------------- loongson1c_defconfig (mips, gcc-10) — PASS, 0 errors, 0 warnings, 0 section mismatches -------------------------------------------------------------------------------- loongson2k_defconfig (mips, gcc-10) — PASS, 1 error, 0 warnings, 0 section mismatches Errors: cc1: error: ‘-mloongson-mmi’ must be used with ‘-mhard-float’ -------------------------------------------------------------------------------- loongson3_defconfig (mips, gcc-10) — PASS, 1 error, 0 warnings, 0 section mismatches Errors: cc1: error: ‘-mloongson-mmi’ must be used with ‘-mhard-float’ -------------------------------------------------------------------------------- lpc18xx_defconfig (arm, gcc-10) — PASS, 0 errors, 0 warnings, 0 section mismatches -------------------------------------------------------------------------------- lpc32xx_defconfig (arm, gcc-10) — PASS, 0 errors, 0 warnings, 0 section mismatches -------------------------------------------------------------------------------- lpd270_defconfig (arm, gcc-10) — PASS, 0 errors, 0 warnings, 0 section mismatches -------------------------------------------------------------------------------- lubbock_defconfig (arm, gcc-10) — PASS, 0 errors, 0 warnings, 0 section mismatches -------------------------------------------------------------------------------- magician_defconfig (arm, gcc-10) — PASS, 0 errors, 0 warnings, 0 section mismatches -------------------------------------------------------------------------------- mainstone_defconfig (arm, gcc-10) — PASS, 0 errors, 0 warnings, 0 section mismatches -------------------------------------------------------------------------------- malta_defconfig (mips, gcc-10) — PASS, 0 errors, 0 warnings, 0 section mismatches -------------------------------------------------------------------------------- malta_kvm_defconfig (mips, gcc-10) — PASS, 0 errors, 0 warnings, 0 section mismatches -------------------------------------------------------------------------------- malta_qemu_32r6_defconfig (mips, gcc-10) — PASS, 0 errors, 0 warnings, 0 section mismatches -------------------------------------------------------------------------------- maltaaprp_defconfig (mips, gcc-10) — PASS, 0 errors, 0 warnings, 0 section mismatches -------------------------------------------------------------------------------- maltasmvp_defconfig (mips, gcc-10) — PASS, 0 errors, 0 warnings, 0 section mismatches -------------------------------------------------------------------------------- maltasmvp_eva_defconfig (mips, gcc-10) — PASS, 0 errors, 0 warnings, 0 section mismatches -------------------------------------------------------------------------------- maltaup_defconfig (mips, gcc-10) — PASS, 0 errors, 0 warnings, 0 section mismatches -------------------------------------------------------------------------------- maltaup_xpa_defconfig (mips, gcc-10) — PASS, 0 errors, 0 warnings, 0 section mismatches -------------------------------------------------------------------------------- milbeaut_m10v_defconfig (arm, gcc-10) — PASS, 0 errors, 0 warnings, 0 section mismatches -------------------------------------------------------------------------------- mini2440_defconfig (arm, gcc-10) — PASS, 0 errors, 0 warnings, 0 section mismatches -------------------------------------------------------------------------------- mmp2_defconfig (arm, gcc-10) — PASS, 0 errors, 0 warnings, 0 section mismatches -------------------------------------------------------------------------------- moxart_defconfig (arm, gcc-10) — PASS, 0 errors, 0 warnings, 0 section mismatches -------------------------------------------------------------------------------- mps2_defconfig (arm, gcc-10) — PASS, 0 errors, 0 warnings, 0 section mismatches -------------------------------------------------------------------------------- mtx1_defconfig (mips, gcc-10) — PASS, 0 errors, 0 warnings, 0 section mismatches -------------------------------------------------------------------------------- multi_v4t_defconfig (arm, gcc-10) — PASS, 0 errors, 0 warnings, 0 section mismatches -------------------------------------------------------------------------------- multi_v5_defconfig (arm, gcc-10) — PASS, 0 errors, 0 warnings, 0 section mismatches -------------------------------------------------------------------------------- multi_v7_defconfig (arm, gcc-10) — PASS, 0 errors, 0 warnings, 0 section mismatches -------------------------------------------------------------------------------- mvebu_v5_defconfig (arm, gcc-10) — PASS, 0 errors, 0 warnings, 0 section mismatches -------------------------------------------------------------------------------- mvebu_v7_defconfig (arm, gcc-10) — PASS, 0 errors, 0 warnings, 0 section mismatches -------------------------------------------------------------------------------- mxs_defconfig (arm, gcc-10) — PASS, 0 errors, 0 warnings, 0 section mismatches -------------------------------------------------------------------------------- neponset_defconfig (arm, gcc-10) — PASS, 0 errors, 0 warnings, 0 section mismatches -------------------------------------------------------------------------------- netwinder_defconfig (arm, gcc-10) — PASS, 0 errors, 0 warnings, 0 section mismatches -------------------------------------------------------------------------------- nhk8815_defconfig (arm, gcc-10) — PASS, 0 errors, 0 warnings, 0 section mismatches -------------------------------------------------------------------------------- nommu_k210_defconfig (riscv, gcc-10) — PASS, 0 errors, 0 warnings, 0 section mismatches -------------------------------------------------------------------------------- nommu_k210_sdcard_defconfig (riscv, gcc-10) — PASS, 0 errors, 0 warnings, 0 section mismatches -------------------------------------------------------------------------------- nsimosci_hs_defconfig (arc, gcc-10) — PASS, 0 errors, 0 warnings, 0 section mismatches -------------------------------------------------------------------------------- nsimosci_hs_smp_defconfig (arc, gcc-10) — PASS, 0 errors, 0 warnings, 0 section mismatches -------------------------------------------------------------------------------- omap2plus_defconfig (arm, gcc-10) — PASS, 0 errors, 0 warnings, 0 section mismatches -------------------------------------------------------------------------------- omega2p_defconfig (mips, gcc-10) — PASS, 0 errors, 0 warnings, 0 section mismatches -------------------------------------------------------------------------------- orion5x_defconfig (arm, gcc-10) — PASS, 0 errors, 0 warnings, 0 section mismatches -------------------------------------------------------------------------------- oxnas_v6_defconfig (arm, gcc-10) — PASS, 0 errors, 0 warnings, 0 section mismatches -------------------------------------------------------------------------------- palmz72_defconfig (arm, gcc-10) — PASS, 0 errors, 0 warnings, 0 section mismatches -------------------------------------------------------------------------------- pcm027_defconfig (arm, gcc-10) — PASS, 0 errors, 0 warnings, 0 section mismatches -------------------------------------------------------------------------------- pic32mzda_defconfig (mips, gcc-10) — PASS, 0 errors, 0 warnings, 0 section mismatches -------------------------------------------------------------------------------- pleb_defconfig (arm, gcc-10) — PASS, 0 errors, 0 warnings, 0 section mismatches -------------------------------------------------------------------------------- pxa168_defconfig (arm, gcc-10) — PASS, 0 errors, 0 warnings, 0 section mismatches -------------------------------------------------------------------------------- pxa255-idp_defconfig (arm, gcc-10) — PASS, 0 errors, 0 warnings, 0 section mismatches -------------------------------------------------------------------------------- pxa3xx_defconfig (arm, gcc-10) — PASS, 0 errors, 0 warnings, 0 section mismatches -------------------------------------------------------------------------------- pxa910_defconfig (arm, gcc-10) — PASS, 0 errors, 0 warnings, 0 section mismatches -------------------------------------------------------------------------------- pxa_defconfig (arm, gcc-10) — PASS, 0 errors, 0 warnings, 0 section mismatches -------------------------------------------------------------------------------- qcom_defconfig (arm, gcc-10) — PASS, 0 errors, 0 warnings, 0 section mismatches -------------------------------------------------------------------------------- qi_lb60_defconfig (mips, gcc-10) — PASS, 0 errors, 0 warnings, 0 section mismatches -------------------------------------------------------------------------------- rb532_defconfig (mips, gcc-10) — PASS, 0 errors, 0 warnings, 0 section mismatches -------------------------------------------------------------------------------- rbtx49xx_defconfig (mips, gcc-10) — PASS, 0 errors, 0 warnings, 0 section mismatches -------------------------------------------------------------------------------- realview_defconfig (arm, gcc-10) — PASS, 0 errors, 0 warnings, 0 section mismatches -------------------------------------------------------------------------------- rm200_defconfig (mips, gcc-10) — PASS, 0 errors, 0 warnings, 0 section mismatches -------------------------------------------------------------------------------- rs90_defconfig (mips, gcc-10) — PASS, 0 errors, 0 warnings, 0 section mismatches -------------------------------------------------------------------------------- rt305x_defconfig (mips, gcc-10) — PASS, 0 errors, 0 warnings, 0 section mismatches -------------------------------------------------------------------------------- rv32_defconfig (riscv, gcc-10) — PASS, 0 errors, 0 warnings, 0 section mismatches -------------------------------------------------------------------------------- s3c2410_defconfig (arm, gcc-10) — PASS, 0 errors, 0 warnings, 0 section mismatches -------------------------------------------------------------------------------- s3c6400_defconfig (arm, gcc-10) — PASS, 0 errors, 0 warnings, 0 section mismatches -------------------------------------------------------------------------------- s5pv210_defconfig (arm, gcc-10) — PASS, 0 errors, 0 warnings, 0 section mismatches -------------------------------------------------------------------------------- sama5_defconfig (arm, gcc-10) — PASS, 0 errors, 0 warnings, 0 section mismatches -------------------------------------------------------------------------------- sama7_defconfig (arm, gcc-10) — PASS, 0 errors, 0 warnings, 0 section mismatches -------------------------------------------------------------------------------- sb1250_swarm_defconfig (mips, gcc-10) — PASS, 0 errors, 0 warnings, 0 section mismatches -------------------------------------------------------------------------------- shannon_defconfig (arm, gcc-10) — PASS, 0 errors, 0 warnings, 0 section mismatches -------------------------------------------------------------------------------- shmobile_defconfig (arm, gcc-10) — PASS, 0 errors, 0 warnings, 0 section mismatches -------------------------------------------------------------------------------- simpad_defconfig (arm, gcc-10) — PASS, 0 errors, 0 warnings, 0 section mismatches -------------------------------------------------------------------------------- socfpga_defconfig (arm, gcc-10) — PASS, 0 errors, 0 warnings, 0 section mismatches -------------------------------------------------------------------------------- sp7021_defconfig (arm, gcc-10) — PASS, 0 errors, 0 warnings, 0 section mismatches -------------------------------------------------------------------------------- spear13xx_defconfig (arm, gcc-10) — PASS, 0 errors, 0 warnings, 0 section mismatches -------------------------------------------------------------------------------- spear3xx_defconfig (arm, gcc-10) — PASS, 0 errors, 0 warnings, 0 section mismatches -------------------------------------------------------------------------------- spear6xx_defconfig (arm, gcc-10) — PASS, 0 errors, 0 warnings, 0 section mismatches -------------------------------------------------------------------------------- spitz_defconfig (arm, gcc-10) — PASS, 0 errors, 0 warnings, 0 section mismatches -------------------------------------------------------------------------------- stm32_defconfig (arm, gcc-10) — PASS, 0 errors, 0 warnings, 0 section mismatches -------------------------------------------------------------------------------- sunxi_defconfig (arm, gcc-10) — PASS, 0 errors, 0 warnings, 0 section mismatches -------------------------------------------------------------------------------- tct_hammer_defconfig (arm, gcc-10) — PASS, 0 errors, 0 warnings, 0 section mismatches -------------------------------------------------------------------------------- tegra_defconfig (arm, gcc-10) — PASS, 0 errors, 0 warnings, 0 section mismatches -------------------------------------------------------------------------------- tinyconfig (x86_64, gcc-10) — PASS, 0 errors, 0 warnings, 0 section mismatches -------------------------------------------------------------------------------- tinyconfig (arc, gcc-10) — PASS, 0 errors, 0 warnings, 0 section mismatches -------------------------------------------------------------------------------- tinyconfig (i386, gcc-10) — PASS, 0 errors, 0 warnings, 0 section mismatches -------------------------------------------------------------------------------- trizeps4_defconfig (arm, gcc-10) — PASS, 0 errors, 0 warnings, 0 section mismatches -------------------------------------------------------------------------------- u8500_defconfig (arm, gcc-10) — PASS, 0 errors, 0 warnings, 0 section mismatches -------------------------------------------------------------------------------- vdk_hs38_defconfig (arc, gcc-10) — PASS, 0 errors, 0 warnings, 0 section mismatches -------------------------------------------------------------------------------- vdk_hs38_smp_defconfig (arc, gcc-10) — PASS, 0 errors, 0 warnings, 0 section mismatches -------------------------------------------------------------------------------- versatile_defconfig (arm, gcc-10) — PASS, 0 errors, 0 warnings, 0 section mismatches -------------------------------------------------------------------------------- vexpress_defconfig (arm, gcc-10) — PASS, 0 errors, 0 warnings, 0 section mismatches -------------------------------------------------------------------------------- vf610m4_defconfig (arm, gcc-10) — PASS, 0 errors, 0 warnings, 0 section mismatches -------------------------------------------------------------------------------- viper_defconfig (arm, gcc-10) — PASS, 0 errors, 0 warnings, 0 section mismatches -------------------------------------------------------------------------------- vocore2_defconfig (mips, gcc-10) — PASS, 0 errors, 0 warnings, 0 section mismatches -------------------------------------------------------------------------------- vt8500_v6_v7_defconfig (arm, gcc-10) — PASS, 0 errors, 0 warnings, 0 section mismatches -------------------------------------------------------------------------------- x86_64_defconfig (x86_64, gcc-10) — PASS, 0 errors, 0 warnings, 0 section mismatches -------------------------------------------------------------------------------- x86_64_defconfig+x86-chromebook (x86_64, gcc-10) — PASS, 0 errors, 0 warnings, 0 section mismatches -------------------------------------------------------------------------------- xcep_defconfig (arm, gcc-10) — PASS, 0 errors, 0 warnings, 0 section mismatches -------------------------------------------------------------------------------- zeus_defconfig (arm, gcc-10) — PASS, 0 errors, 0 warnings, 0 section mismatches --- For more info write to <info(a)kernelci.org>
[View Less]
1 year, 9 months
1
0
0
0
stable-rc/queue/5.15 build: 179 builds: 3 failed, 176 passed, 9 errors, 5 warnings (v5.15.112-286-gb4a5fdb6a8b48)
by kernelci.org bot
stable-rc/queue/5.15 build: 179 builds: 3 failed, 176 passed, 9 errors, 5 warnings (v5.15.112-286-gb4a5fdb6a8b48) Full Build Summary:
https://kernelci.org/build/stable-rc/branch/queue%2F5.15/kernel/v5.15.112-2…
Tree: stable-rc Branch: queue/5.15 Git Describe: v5.15.112-286-gb4a5fdb6a8b48 Git Commit: b4a5fdb6a8b486752b4d25b15e09ab72f54e59bd Git URL:
https://git.kernel.org/pub/scm/linux/kernel/git/stable/linux-stable-rc.git
Built: 7 unique architectures Build Failures Detected: mips:
…
[View More]
decstation_64_defconfig: (gcc-10) FAIL ip27_defconfig: (gcc-10) FAIL ip28_defconfig: (gcc-10) FAIL Errors and Warnings Detected: arc: tinyconfig (gcc-10): 1 warning arm64: arm: i386: mips: 32r2el_defconfig (gcc-10): 1 warning bigsur_defconfig (gcc-10): 1 error cavium_octeon_defconfig (gcc-10): 1 error decstation_64_defconfig (gcc-10): 1 error ip32_defconfig (gcc-10): 1 error lemote2f_defconfig (gcc-10): 1 error loongson2k_defconfig (gcc-10): 1 error loongson3_defconfig (gcc-10): 1 error nlm_xlp_defconfig (gcc-10): 1 error rm200_defconfig (gcc-10): 1 warning sb1250_swarm_defconfig (gcc-10): 1 error riscv: x86_64: x86_64_defconfig (gcc-10): 1 warning x86_64_defconfig+x86-chromebook (gcc-10): 1 warning Errors summary: 9 expr: syntax error: unexpected argument ‘0xffffffff80000000’ Warnings summary: 2 arch/x86/kernel/smp.o: warning: objtool: sysvec_reboot()+0x45: unreachable instruction 1 drivers/block/paride/bpck.c:32: warning: "PC" redefined 1 arch/mips/boot/dts/img/boston.dts:128.19-178.5: Warning (pci_device_reg): /pci@14000000/pci2_root@0,0,0: PCI unit address format error, expected "0,0" 1 arch/arc/Makefile:26: ** WARNING ** CONFIG_ARC_TUNE_MCPU flag '' is unknown, fallback to '' Section mismatches summary: 1 WARNING: modpost: vmlinux.o(___ksymtab_gpl+ixp4xx_irq_init+0x0): Section mismatch in reference from the variable __ksymtab_ixp4xx_irq_init to the function .init.text:ixp4xx_irq_init() 1 WARNING: modpost: vmlinux.o(___ksymtab+prom_init_numa_memory+0x0): Section mismatch in reference from the variable __ksymtab_prom_init_numa_memory to the function .init.text:prom_init_numa_memory() ================================================================================ Detailed per-defconfig build reports: -------------------------------------------------------------------------------- 32r2el_defconfig (mips, gcc-10) — PASS, 0 errors, 1 warning, 0 section mismatches Warnings: arch/mips/boot/dts/img/boston.dts:128.19-178.5: Warning (pci_device_reg): /pci@14000000/pci2_root@0,0,0: PCI unit address format error, expected "0,0" -------------------------------------------------------------------------------- allnoconfig (i386, gcc-10) — PASS, 0 errors, 0 warnings, 0 section mismatches -------------------------------------------------------------------------------- allnoconfig (x86_64, gcc-10) — PASS, 0 errors, 0 warnings, 0 section mismatches -------------------------------------------------------------------------------- allnoconfig (arc, gcc-10) — PASS, 0 errors, 0 warnings, 0 section mismatches -------------------------------------------------------------------------------- am200epdkit_defconfig (arm, gcc-10) — PASS, 0 errors, 0 warnings, 0 section mismatches -------------------------------------------------------------------------------- ar7_defconfig (mips, gcc-10) — PASS, 0 errors, 0 warnings, 0 section mismatches -------------------------------------------------------------------------------- aspeed_g4_defconfig (arm, gcc-10) — PASS, 0 errors, 0 warnings, 0 section mismatches -------------------------------------------------------------------------------- aspeed_g5_defconfig (arm, gcc-10) — PASS, 0 errors, 0 warnings, 0 section mismatches -------------------------------------------------------------------------------- assabet_defconfig (arm, gcc-10) — PASS, 0 errors, 0 warnings, 0 section mismatches -------------------------------------------------------------------------------- at91_dt_defconfig (arm, gcc-10) — PASS, 0 errors, 0 warnings, 0 section mismatches -------------------------------------------------------------------------------- ath25_defconfig (mips, gcc-10) — PASS, 0 errors, 0 warnings, 0 section mismatches -------------------------------------------------------------------------------- ath79_defconfig (mips, gcc-10) — PASS, 0 errors, 0 warnings, 0 section mismatches -------------------------------------------------------------------------------- axm55xx_defconfig (arm, gcc-10) — PASS, 0 errors, 0 warnings, 0 section mismatches -------------------------------------------------------------------------------- axs103_defconfig (arc, gcc-10) — PASS, 0 errors, 0 warnings, 0 section mismatches -------------------------------------------------------------------------------- axs103_smp_defconfig (arc, gcc-10) — PASS, 0 errors, 0 warnings, 0 section mismatches -------------------------------------------------------------------------------- badge4_defconfig (arm, gcc-10) — PASS, 0 errors, 0 warnings, 0 section mismatches -------------------------------------------------------------------------------- bcm2835_defconfig (arm, gcc-10) — PASS, 0 errors, 0 warnings, 0 section mismatches -------------------------------------------------------------------------------- bcm47xx_defconfig (mips, gcc-10) — PASS, 0 errors, 0 warnings, 0 section mismatches -------------------------------------------------------------------------------- bcm63xx_defconfig (mips, gcc-10) — PASS, 0 errors, 0 warnings, 0 section mismatches -------------------------------------------------------------------------------- bigsur_defconfig (mips, gcc-10) — PASS, 1 error, 0 warnings, 0 section mismatches Errors: expr: syntax error: unexpected argument ‘0xffffffff80000000’ -------------------------------------------------------------------------------- bmips_be_defconfig (mips, gcc-10) — PASS, 0 errors, 0 warnings, 0 section mismatches -------------------------------------------------------------------------------- bmips_stb_defconfig (mips, gcc-10) — PASS, 0 errors, 0 warnings, 0 section mismatches -------------------------------------------------------------------------------- capcella_defconfig (mips, gcc-10) — PASS, 0 errors, 0 warnings, 0 section mismatches -------------------------------------------------------------------------------- cavium_octeon_defconfig (mips, gcc-10) — PASS, 1 error, 0 warnings, 0 section mismatches Errors: expr: syntax error: unexpected argument ‘0xffffffff80000000’ -------------------------------------------------------------------------------- cerfcube_defconfig (arm, gcc-10) — PASS, 0 errors, 0 warnings, 0 section mismatches -------------------------------------------------------------------------------- ci20_defconfig (mips, gcc-10) — PASS, 0 errors, 0 warnings, 0 section mismatches -------------------------------------------------------------------------------- cm_x300_defconfig (arm, gcc-10) — PASS, 0 errors, 0 warnings, 0 section mismatches -------------------------------------------------------------------------------- cobalt_defconfig (mips, gcc-10) — PASS, 0 errors, 0 warnings, 0 section mismatches -------------------------------------------------------------------------------- colibri_pxa270_defconfig (arm, gcc-10) — PASS, 0 errors, 0 warnings, 0 section mismatches -------------------------------------------------------------------------------- colibri_pxa300_defconfig (arm, gcc-10) — PASS, 0 errors, 0 warnings, 0 section mismatches -------------------------------------------------------------------------------- collie_defconfig (arm, gcc-10) — PASS, 0 errors, 0 warnings, 0 section mismatches -------------------------------------------------------------------------------- corgi_defconfig (arm, gcc-10) — PASS, 0 errors, 0 warnings, 0 section mismatches -------------------------------------------------------------------------------- cu1000-neo_defconfig (mips, gcc-10) — PASS, 0 errors, 0 warnings, 0 section mismatches -------------------------------------------------------------------------------- cu1830-neo_defconfig (mips, gcc-10) — PASS, 0 errors, 0 warnings, 0 section mismatches -------------------------------------------------------------------------------- davinci_all_defconfig (arm, gcc-10) — PASS, 0 errors, 0 warnings, 0 section mismatches -------------------------------------------------------------------------------- db1xxx_defconfig (mips, gcc-10) — PASS, 0 errors, 0 warnings, 0 section mismatches -------------------------------------------------------------------------------- decstation_64_defconfig (mips, gcc-10) — FAIL, 1 error, 0 warnings, 0 section mismatches Errors: expr: syntax error: unexpected argument ‘0xffffffff80000000’ -------------------------------------------------------------------------------- decstation_defconfig (mips, gcc-10) — PASS, 0 errors, 0 warnings, 0 section mismatches -------------------------------------------------------------------------------- decstation_r4k_defconfig (mips, gcc-10) — PASS, 0 errors, 0 warnings, 0 section mismatches -------------------------------------------------------------------------------- defconfig (riscv, gcc-10) — PASS, 0 errors, 0 warnings, 0 section mismatches -------------------------------------------------------------------------------- defconfig (arm64, gcc-10) — PASS, 0 errors, 0 warnings, 0 section mismatches -------------------------------------------------------------------------------- defconfig+arm64-chromebook (arm64, gcc-10) — PASS, 0 errors, 0 warnings, 0 section mismatches -------------------------------------------------------------------------------- dove_defconfig (arm, gcc-10) — PASS, 0 errors, 0 warnings, 0 section mismatches -------------------------------------------------------------------------------- e55_defconfig (mips, gcc-10) — PASS, 0 errors, 0 warnings, 0 section mismatches -------------------------------------------------------------------------------- ep93xx_defconfig (arm, gcc-10) — PASS, 0 errors, 0 warnings, 0 section mismatches -------------------------------------------------------------------------------- eseries_pxa_defconfig (arm, gcc-10) — PASS, 0 errors, 0 warnings, 0 section mismatches -------------------------------------------------------------------------------- exynos_defconfig (arm, gcc-10) — PASS, 0 errors, 0 warnings, 0 section mismatches -------------------------------------------------------------------------------- ezx_defconfig (arm, gcc-10) — PASS, 0 errors, 0 warnings, 0 section mismatches -------------------------------------------------------------------------------- footbridge_defconfig (arm, gcc-10) — PASS, 0 errors, 0 warnings, 0 section mismatches -------------------------------------------------------------------------------- gcw0_defconfig (mips, gcc-10) — PASS, 0 errors, 0 warnings, 0 section mismatches -------------------------------------------------------------------------------- gemini_defconfig (arm, gcc-10) — PASS, 0 errors, 0 warnings, 0 section mismatches -------------------------------------------------------------------------------- gpr_defconfig (mips, gcc-10) — PASS, 0 errors, 0 warnings, 0 section mismatches -------------------------------------------------------------------------------- h3600_defconfig (arm, gcc-10) — PASS, 0 errors, 0 warnings, 0 section mismatches -------------------------------------------------------------------------------- h5000_defconfig (arm, gcc-10) — PASS, 0 errors, 0 warnings, 0 section mismatches -------------------------------------------------------------------------------- hackkit_defconfig (arm, gcc-10) — PASS, 0 errors, 0 warnings, 0 section mismatches -------------------------------------------------------------------------------- haps_hs_defconfig (arc, gcc-10) — PASS, 0 errors, 0 warnings, 0 section mismatches -------------------------------------------------------------------------------- haps_hs_smp_defconfig (arc, gcc-10) — PASS, 0 errors, 0 warnings, 0 section mismatches -------------------------------------------------------------------------------- hisi_defconfig (arm, gcc-10) — PASS, 0 errors, 0 warnings, 0 section mismatches -------------------------------------------------------------------------------- hsdk_defconfig (arc, gcc-10) — PASS, 0 errors, 0 warnings, 0 section mismatches -------------------------------------------------------------------------------- i386_defconfig (i386, gcc-10) — PASS, 0 errors, 0 warnings, 0 section mismatches -------------------------------------------------------------------------------- imote2_defconfig (arm, gcc-10) — PASS, 0 errors, 0 warnings, 0 section mismatches -------------------------------------------------------------------------------- imx_v4_v5_defconfig (arm, gcc-10) — PASS, 0 errors, 0 warnings, 0 section mismatches -------------------------------------------------------------------------------- imx_v6_v7_defconfig (arm, gcc-10) — PASS, 0 errors, 0 warnings, 0 section mismatches -------------------------------------------------------------------------------- integrator_defconfig (arm, gcc-10) — PASS, 0 errors, 0 warnings, 0 section mismatches -------------------------------------------------------------------------------- iop32x_defconfig (arm, gcc-10) — PASS, 0 errors, 0 warnings, 0 section mismatches -------------------------------------------------------------------------------- ip22_defconfig (mips, gcc-10) — PASS, 0 errors, 0 warnings, 0 section mismatches -------------------------------------------------------------------------------- ip27_defconfig (mips, gcc-10) — FAIL, 0 errors, 0 warnings, 0 section mismatches -------------------------------------------------------------------------------- ip28_defconfig (mips, gcc-10) — FAIL, 0 errors, 0 warnings, 0 section mismatches -------------------------------------------------------------------------------- ip32_defconfig (mips, gcc-10) — PASS, 1 error, 0 warnings, 0 section mismatches Errors: expr: syntax error: unexpected argument ‘0xffffffff80000000’ -------------------------------------------------------------------------------- ixp4xx_defconfig (arm, gcc-10) — PASS, 0 errors, 0 warnings, 0 section mismatches Section mismatches: WARNING: modpost: vmlinux.o(___ksymtab_gpl+ixp4xx_irq_init+0x0): Section mismatch in reference from the variable __ksymtab_ixp4xx_irq_init to the function .init.text:ixp4xx_irq_init() -------------------------------------------------------------------------------- jazz_defconfig (mips, gcc-10) — PASS, 0 errors, 0 warnings, 0 section mismatches -------------------------------------------------------------------------------- jmr3927_defconfig (mips, gcc-10) — PASS, 0 errors, 0 warnings, 0 section mismatches -------------------------------------------------------------------------------- jornada720_defconfig (arm, gcc-10) — PASS, 0 errors, 0 warnings, 0 section mismatches -------------------------------------------------------------------------------- keystone_defconfig (arm, gcc-10) — PASS, 0 errors, 0 warnings, 0 section mismatches -------------------------------------------------------------------------------- lart_defconfig (arm, gcc-10) — PASS, 0 errors, 0 warnings, 0 section mismatches -------------------------------------------------------------------------------- lemote2f_defconfig (mips, gcc-10) — PASS, 1 error, 0 warnings, 0 section mismatches Errors: expr: syntax error: unexpected argument ‘0xffffffff80000000’ -------------------------------------------------------------------------------- loongson1b_defconfig (mips, gcc-10) — PASS, 0 errors, 0 warnings, 0 section mismatches -------------------------------------------------------------------------------- loongson1c_defconfig (mips, gcc-10) — PASS, 0 errors, 0 warnings, 0 section mismatches -------------------------------------------------------------------------------- loongson2k_defconfig (mips, gcc-10) — PASS, 1 error, 0 warnings, 0 section mismatches Errors: expr: syntax error: unexpected argument ‘0xffffffff80000000’ -------------------------------------------------------------------------------- loongson3_defconfig (mips, gcc-10) — PASS, 1 error, 0 warnings, 0 section mismatches Errors: expr: syntax error: unexpected argument ‘0xffffffff80000000’ Section mismatches: WARNING: modpost: vmlinux.o(___ksymtab+prom_init_numa_memory+0x0): Section mismatch in reference from the variable __ksymtab_prom_init_numa_memory to the function .init.text:prom_init_numa_memory() -------------------------------------------------------------------------------- lpc18xx_defconfig (arm, gcc-10) — PASS, 0 errors, 0 warnings, 0 section mismatches -------------------------------------------------------------------------------- lpc32xx_defconfig (arm, gcc-10) — PASS, 0 errors, 0 warnings, 0 section mismatches -------------------------------------------------------------------------------- lpd270_defconfig (arm, gcc-10) — PASS, 0 errors, 0 warnings, 0 section mismatches -------------------------------------------------------------------------------- lubbock_defconfig (arm, gcc-10) — PASS, 0 errors, 0 warnings, 0 section mismatches -------------------------------------------------------------------------------- magician_defconfig (arm, gcc-10) — PASS, 0 errors, 0 warnings, 0 section mismatches -------------------------------------------------------------------------------- mainstone_defconfig (arm, gcc-10) — PASS, 0 errors, 0 warnings, 0 section mismatches -------------------------------------------------------------------------------- malta_defconfig (mips, gcc-10) — PASS, 0 errors, 0 warnings, 0 section mismatches -------------------------------------------------------------------------------- malta_kvm_defconfig (mips, gcc-10) — PASS, 0 errors, 0 warnings, 0 section mismatches -------------------------------------------------------------------------------- malta_qemu_32r6_defconfig (mips, gcc-10) — PASS, 0 errors, 0 warnings, 0 section mismatches -------------------------------------------------------------------------------- maltaaprp_defconfig (mips, gcc-10) — PASS, 0 errors, 0 warnings, 0 section mismatches -------------------------------------------------------------------------------- maltasmvp_defconfig (mips, gcc-10) — PASS, 0 errors, 0 warnings, 0 section mismatches -------------------------------------------------------------------------------- maltasmvp_eva_defconfig (mips, gcc-10) — PASS, 0 errors, 0 warnings, 0 section mismatches -------------------------------------------------------------------------------- maltaup_defconfig (mips, gcc-10) — PASS, 0 errors, 0 warnings, 0 section mismatches -------------------------------------------------------------------------------- maltaup_xpa_defconfig (mips, gcc-10) — PASS, 0 errors, 0 warnings, 0 section mismatches -------------------------------------------------------------------------------- milbeaut_m10v_defconfig (arm, gcc-10) — PASS, 0 errors, 0 warnings, 0 section mismatches -------------------------------------------------------------------------------- mini2440_defconfig (arm, gcc-10) — PASS, 0 errors, 0 warnings, 0 section mismatches -------------------------------------------------------------------------------- mmp2_defconfig (arm, gcc-10) — PASS, 0 errors, 0 warnings, 0 section mismatches -------------------------------------------------------------------------------- moxart_defconfig (arm, gcc-10) — PASS, 0 errors, 0 warnings, 0 section mismatches -------------------------------------------------------------------------------- mpc30x_defconfig (mips, gcc-10) — PASS, 0 errors, 0 warnings, 0 section mismatches -------------------------------------------------------------------------------- mps2_defconfig (arm, gcc-10) — PASS, 0 errors, 0 warnings, 0 section mismatches -------------------------------------------------------------------------------- mtx1_defconfig (mips, gcc-10) — PASS, 0 errors, 0 warnings, 0 section mismatches -------------------------------------------------------------------------------- multi_v4t_defconfig (arm, gcc-10) — PASS, 0 errors, 0 warnings, 0 section mismatches -------------------------------------------------------------------------------- multi_v5_defconfig (arm, gcc-10) — PASS, 0 errors, 0 warnings, 0 section mismatches -------------------------------------------------------------------------------- multi_v7_defconfig (arm, gcc-10) — PASS, 0 errors, 0 warnings, 0 section mismatches -------------------------------------------------------------------------------- mvebu_v5_defconfig (arm, gcc-10) — PASS, 0 errors, 0 warnings, 0 section mismatches -------------------------------------------------------------------------------- mvebu_v7_defconfig (arm, gcc-10) — PASS, 0 errors, 0 warnings, 0 section mismatches -------------------------------------------------------------------------------- mxs_defconfig (arm, gcc-10) — PASS, 0 errors, 0 warnings, 0 section mismatches -------------------------------------------------------------------------------- neponset_defconfig (arm, gcc-10) — PASS, 0 errors, 0 warnings, 0 section mismatches -------------------------------------------------------------------------------- netwinder_defconfig (arm, gcc-10) — PASS, 0 errors, 0 warnings, 0 section mismatches -------------------------------------------------------------------------------- nhk8815_defconfig (arm, gcc-10) — PASS, 0 errors, 0 warnings, 0 section mismatches -------------------------------------------------------------------------------- nlm_xlp_defconfig (mips, gcc-10) — PASS, 1 error, 0 warnings, 0 section mismatches Errors: expr: syntax error: unexpected argument ‘0xffffffff80000000’ -------------------------------------------------------------------------------- nlm_xlr_defconfig (mips, gcc-10) — PASS, 0 errors, 0 warnings, 0 section mismatches -------------------------------------------------------------------------------- nommu_k210_defconfig (riscv, gcc-10) — PASS, 0 errors, 0 warnings, 0 section mismatches -------------------------------------------------------------------------------- nommu_k210_sdcard_defconfig (riscv, gcc-10) — PASS, 0 errors, 0 warnings, 0 section mismatches -------------------------------------------------------------------------------- nsimosci_hs_defconfig (arc, gcc-10) — PASS, 0 errors, 0 warnings, 0 section mismatches -------------------------------------------------------------------------------- nsimosci_hs_smp_defconfig (arc, gcc-10) — PASS, 0 errors, 0 warnings, 0 section mismatches -------------------------------------------------------------------------------- omap1_defconfig (arm, gcc-10) — PASS, 0 errors, 0 warnings, 0 section mismatches -------------------------------------------------------------------------------- omap2plus_defconfig (arm, gcc-10) — PASS, 0 errors, 0 warnings, 0 section mismatches -------------------------------------------------------------------------------- omega2p_defconfig (mips, gcc-10) — PASS, 0 errors, 0 warnings, 0 section mismatches -------------------------------------------------------------------------------- orion5x_defconfig (arm, gcc-10) — PASS, 0 errors, 0 warnings, 0 section mismatches -------------------------------------------------------------------------------- oxnas_v6_defconfig (arm, gcc-10) — PASS, 0 errors, 0 warnings, 0 section mismatches -------------------------------------------------------------------------------- palmz72_defconfig (arm, gcc-10) — PASS, 0 errors, 0 warnings, 0 section mismatches -------------------------------------------------------------------------------- pcm027_defconfig (arm, gcc-10) — PASS, 0 errors, 0 warnings, 0 section mismatches -------------------------------------------------------------------------------- pic32mzda_defconfig (mips, gcc-10) — PASS, 0 errors, 0 warnings, 0 section mismatches -------------------------------------------------------------------------------- pleb_defconfig (arm, gcc-10) — PASS, 0 errors, 0 warnings, 0 section mismatches -------------------------------------------------------------------------------- pxa168_defconfig (arm, gcc-10) — PASS, 0 errors, 0 warnings, 0 section mismatches -------------------------------------------------------------------------------- pxa255-idp_defconfig (arm, gcc-10) — PASS, 0 errors, 0 warnings, 0 section mismatches -------------------------------------------------------------------------------- pxa3xx_defconfig (arm, gcc-10) — PASS, 0 errors, 0 warnings, 0 section mismatches -------------------------------------------------------------------------------- pxa910_defconfig (arm, gcc-10) — PASS, 0 errors, 0 warnings, 0 section mismatches -------------------------------------------------------------------------------- pxa_defconfig (arm, gcc-10) — PASS, 0 errors, 0 warnings, 0 section mismatches -------------------------------------------------------------------------------- qcom_defconfig (arm, gcc-10) — PASS, 0 errors, 0 warnings, 0 section mismatches -------------------------------------------------------------------------------- qi_lb60_defconfig (mips, gcc-10) — PASS, 0 errors, 0 warnings, 0 section mismatches -------------------------------------------------------------------------------- rb532_defconfig (mips, gcc-10) — PASS, 0 errors, 0 warnings, 0 section mismatches -------------------------------------------------------------------------------- rbtx49xx_defconfig (mips, gcc-10) — PASS, 0 errors, 0 warnings, 0 section mismatches -------------------------------------------------------------------------------- realview_defconfig (arm, gcc-10) — PASS, 0 errors, 0 warnings, 0 section mismatches -------------------------------------------------------------------------------- rm200_defconfig (mips, gcc-10) — PASS, 0 errors, 1 warning, 0 section mismatches Warnings: drivers/block/paride/bpck.c:32: warning: "PC" redefined -------------------------------------------------------------------------------- rs90_defconfig (mips, gcc-10) — PASS, 0 errors, 0 warnings, 0 section mismatches -------------------------------------------------------------------------------- rt305x_defconfig (mips, gcc-10) — PASS, 0 errors, 0 warnings, 0 section mismatches -------------------------------------------------------------------------------- rv32_defconfig (riscv, gcc-10) — PASS, 0 errors, 0 warnings, 0 section mismatches -------------------------------------------------------------------------------- s3c2410_defconfig (arm, gcc-10) — PASS, 0 errors, 0 warnings, 0 section mismatches -------------------------------------------------------------------------------- s3c6400_defconfig (arm, gcc-10) — PASS, 0 errors, 0 warnings, 0 section mismatches -------------------------------------------------------------------------------- s5pv210_defconfig (arm, gcc-10) — PASS, 0 errors, 0 warnings, 0 section mismatches -------------------------------------------------------------------------------- sama5_defconfig (arm, gcc-10) — PASS, 0 errors, 0 warnings, 0 section mismatches -------------------------------------------------------------------------------- sama7_defconfig (arm, gcc-10) — PASS, 0 errors, 0 warnings, 0 section mismatches -------------------------------------------------------------------------------- sb1250_swarm_defconfig (mips, gcc-10) — PASS, 1 error, 0 warnings, 0 section mismatches Errors: expr: syntax error: unexpected argument ‘0xffffffff80000000’ -------------------------------------------------------------------------------- shannon_defconfig (arm, gcc-10) — PASS, 0 errors, 0 warnings, 0 section mismatches -------------------------------------------------------------------------------- shmobile_defconfig (arm, gcc-10) — PASS, 0 errors, 0 warnings, 0 section mismatches -------------------------------------------------------------------------------- simpad_defconfig (arm, gcc-10) — PASS, 0 errors, 0 warnings, 0 section mismatches -------------------------------------------------------------------------------- socfpga_defconfig (arm, gcc-10) — PASS, 0 errors, 0 warnings, 0 section mismatches -------------------------------------------------------------------------------- spear13xx_defconfig (arm, gcc-10) — PASS, 0 errors, 0 warnings, 0 section mismatches -------------------------------------------------------------------------------- spear3xx_defconfig (arm, gcc-10) — PASS, 0 errors, 0 warnings, 0 section mismatches -------------------------------------------------------------------------------- spear6xx_defconfig (arm, gcc-10) — PASS, 0 errors, 0 warnings, 0 section mismatches -------------------------------------------------------------------------------- spitz_defconfig (arm, gcc-10) — PASS, 0 errors, 0 warnings, 0 section mismatches -------------------------------------------------------------------------------- stm32_defconfig (arm, gcc-10) — PASS, 0 errors, 0 warnings, 0 section mismatches -------------------------------------------------------------------------------- sunxi_defconfig (arm, gcc-10) — PASS, 0 errors, 0 warnings, 0 section mismatches -------------------------------------------------------------------------------- tb0219_defconfig (mips, gcc-10) — PASS, 0 errors, 0 warnings, 0 section mismatches -------------------------------------------------------------------------------- tb0226_defconfig (mips, gcc-10) — PASS, 0 errors, 0 warnings, 0 section mismatches -------------------------------------------------------------------------------- tb0287_defconfig (mips, gcc-10) — PASS, 0 errors, 0 warnings, 0 section mismatches -------------------------------------------------------------------------------- tct_hammer_defconfig (arm, gcc-10) — PASS, 0 errors, 0 warnings, 0 section mismatches -------------------------------------------------------------------------------- tegra_defconfig (arm, gcc-10) — PASS, 0 errors, 0 warnings, 0 section mismatches -------------------------------------------------------------------------------- tinyconfig (arc, gcc-10) — PASS, 0 errors, 1 warning, 0 section mismatches Warnings: arch/arc/Makefile:26: ** WARNING ** CONFIG_ARC_TUNE_MCPU flag '' is unknown, fallback to '' -------------------------------------------------------------------------------- tinyconfig (i386, gcc-10) — PASS, 0 errors, 0 warnings, 0 section mismatches -------------------------------------------------------------------------------- tinyconfig (x86_64, gcc-10) — PASS, 0 errors, 0 warnings, 0 section mismatches -------------------------------------------------------------------------------- trizeps4_defconfig (arm, gcc-10) — PASS, 0 errors, 0 warnings, 0 section mismatches -------------------------------------------------------------------------------- u8500_defconfig (arm, gcc-10) — PASS, 0 errors, 0 warnings, 0 section mismatches -------------------------------------------------------------------------------- vdk_hs38_defconfig (arc, gcc-10) — PASS, 0 errors, 0 warnings, 0 section mismatches -------------------------------------------------------------------------------- vdk_hs38_smp_defconfig (arc, gcc-10) — PASS, 0 errors, 0 warnings, 0 section mismatches -------------------------------------------------------------------------------- versatile_defconfig (arm, gcc-10) — PASS, 0 errors, 0 warnings, 0 section mismatches -------------------------------------------------------------------------------- vexpress_defconfig (arm, gcc-10) — PASS, 0 errors, 0 warnings, 0 section mismatches -------------------------------------------------------------------------------- vf610m4_defconfig (arm, gcc-10) — PASS, 0 errors, 0 warnings, 0 section mismatches -------------------------------------------------------------------------------- viper_defconfig (arm, gcc-10) — PASS, 0 errors, 0 warnings, 0 section mismatches -------------------------------------------------------------------------------- vocore2_defconfig (mips, gcc-10) — PASS, 0 errors, 0 warnings, 0 section mismatches -------------------------------------------------------------------------------- vt8500_v6_v7_defconfig (arm, gcc-10) — PASS, 0 errors, 0 warnings, 0 section mismatches -------------------------------------------------------------------------------- workpad_defconfig (mips, gcc-10) — PASS, 0 errors, 0 warnings, 0 section mismatches -------------------------------------------------------------------------------- x86_64_defconfig (x86_64, gcc-10) — PASS, 0 errors, 1 warning, 0 section mismatches Warnings: arch/x86/kernel/smp.o: warning: objtool: sysvec_reboot()+0x45: unreachable instruction -------------------------------------------------------------------------------- x86_64_defconfig+x86-chromebook (x86_64, gcc-10) — PASS, 0 errors, 1 warning, 0 section mismatches Warnings: arch/x86/kernel/smp.o: warning: objtool: sysvec_reboot()+0x45: unreachable instruction -------------------------------------------------------------------------------- xcep_defconfig (arm, gcc-10) — PASS, 0 errors, 0 warnings, 0 section mismatches -------------------------------------------------------------------------------- zeus_defconfig (arm, gcc-10) — PASS, 0 errors, 0 warnings, 0 section mismatches --- For more info write to <info(a)kernelci.org>
[View Less]
1 year, 9 months
1
0
0
0
stable-rc/queue/5.4 build: 187 builds: 2 failed, 185 passed, 35 warnings (v5.4.243-169-g2892d1676c18)
by kernelci.org bot
stable-rc/queue/5.4 build: 187 builds: 2 failed, 185 passed, 35 warnings (v5.4.243-169-g2892d1676c18) Full Build Summary:
https://kernelci.org/build/stable-rc/branch/queue%2F5.4/kernel/v5.4.243-169…
Tree: stable-rc Branch: queue/5.4 Git Describe: v5.4.243-169-g2892d1676c18 Git Commit: 2892d1676c18849cfbf4d2ed89f537d299e19af0 Git URL:
https://git.kernel.org/pub/scm/linux/kernel/git/stable/linux-stable-rc.git
Built: 7 unique architectures Build Failures Detected: mips: ip27_defconfig: (
…
[View More]
gcc-10) FAIL ip28_defconfig: (gcc-10) FAIL Warnings Detected: arc: arm64: defconfig (gcc-10): 2 warnings defconfig+arm64-chromebook (gcc-10): 2 warnings arm: assabet_defconfig (gcc-10): 1 warning collie_defconfig (gcc-10): 1 warning h3600_defconfig (gcc-10): 1 warning neponset_defconfig (gcc-10): 1 warning shannon_defconfig (gcc-10): 1 warning i386: allnoconfig (gcc-10): 2 warnings i386_defconfig (gcc-10): 2 warnings tinyconfig (gcc-10): 2 warnings mips: bmips_be_defconfig (gcc-10): 1 warning mtx1_defconfig (gcc-10): 3 warnings riscv: x86_64: allnoconfig (gcc-10): 4 warnings tinyconfig (gcc-10): 4 warnings x86_64_defconfig (gcc-10): 4 warnings x86_64_defconfig+x86-chromebook (gcc-10): 4 warnings Warnings summary: 7 ld: warning: creating DT_TEXTREL in a PIE 5 drivers/video/fbdev/sa1100fb.c:975:21: warning: ‘sa1100fb_min_dma_period’ defined but not used [-Wunused-function] 4 ld: arch/x86/boot/compressed/head_64.o: warning: relocation in read-only section `.head.text' 4 arch/arm64/include/asm/memory.h:238:15: warning: cast from pointer to integer of different size [-Wpointer-to-int-cast] 3 ld: arch/x86/boot/compressed/head_32.o: warning: relocation in read-only section `.head.text' 2 sound/pci/echoaudio/echoaudio_dsp.c:647:9: warning: iteration 1073741824 invokes undefined behavior [-Waggressive-loop-optimizations] 2 arch/x86/entry/entry_64.o: warning: objtool: If this is a retpoline, please patch it in with alternatives and annotate it with ANNOTATE_NOSPEC_ALTERNATIVE. 2 arch/x86/entry/entry_64.o: warning: objtool: .entry.text+0x1c1: unsupported intra-function call 2 arch/x86/entry/entry_64.o: warning: objtool: .entry.text+0x151: unsupported intra-function call 2 arch/x86/entry/entry_64.S:1756: Warning: no instruction mnemonic suffix given and no register operands; using default for `sysret' 1 sound/pci/echoaudio/echoaudio_dsp.c:658:9: warning: iteration 1073741824 invokes undefined behavior [-Waggressive-loop-optimizations] 1 include/uapi/linux/byteorder/big_endian.h:33:26: warning: conversion from ‘unsigned int’ to ‘__le16’ {aka ‘short unsigned int’} changes value from ‘402653184’ to ‘0’ [-Woverflow] Section mismatches summary: 10 WARNING: vmlinux.o(___ksymtab_gpl+vic_init_cascaded+0x0): Section mismatch in reference from the variable __ksymtab_vic_init_cascaded to the function .init.text:vic_init_cascaded() 1 WARNING: vmlinux.o(___ksymtab_gpl+ixp4xx_irq_init+0x0): Section mismatch in reference from the variable __ksymtab_ixp4xx_irq_init to the function .init.text:ixp4xx_irq_init() 1 WARNING: vmlinux.o(.text.unlikely+0x3a90): Section mismatch in reference from the function pmax_setup_memory_region() to the function .init.text:add_memory_region() ================================================================================ Detailed per-defconfig build reports: -------------------------------------------------------------------------------- 32r2el_defconfig (mips, gcc-10) — PASS, 0 errors, 0 warnings, 0 section mismatches -------------------------------------------------------------------------------- allnoconfig (i386, gcc-10) — PASS, 0 errors, 2 warnings, 0 section mismatches Warnings: ld: arch/x86/boot/compressed/head_32.o: warning: relocation in read-only section `.head.text' ld: warning: creating DT_TEXTREL in a PIE -------------------------------------------------------------------------------- allnoconfig (x86_64, gcc-10) — PASS, 0 errors, 4 warnings, 0 section mismatches Warnings: arch/x86/entry/entry_64.S:1756: Warning: no instruction mnemonic suffix given and no register operands; using default for `sysret' arch/x86/entry/entry_64.o: warning: objtool: .entry.text+0x151: unsupported intra-function call ld: arch/x86/boot/compressed/head_64.o: warning: relocation in read-only section `.head.text' ld: warning: creating DT_TEXTREL in a PIE -------------------------------------------------------------------------------- allnoconfig (arc, gcc-10) — PASS, 0 errors, 0 warnings, 0 section mismatches -------------------------------------------------------------------------------- am200epdkit_defconfig (arm, gcc-10) — PASS, 0 errors, 0 warnings, 0 section mismatches -------------------------------------------------------------------------------- ar7_defconfig (mips, gcc-10) — PASS, 0 errors, 0 warnings, 0 section mismatches -------------------------------------------------------------------------------- aspeed_g4_defconfig (arm, gcc-10) — PASS, 0 errors, 0 warnings, 0 section mismatches -------------------------------------------------------------------------------- aspeed_g5_defconfig (arm, gcc-10) — PASS, 0 errors, 0 warnings, 0 section mismatches -------------------------------------------------------------------------------- assabet_defconfig (arm, gcc-10) — PASS, 0 errors, 1 warning, 0 section mismatches Warnings: drivers/video/fbdev/sa1100fb.c:975:21: warning: ‘sa1100fb_min_dma_period’ defined but not used [-Wunused-function] -------------------------------------------------------------------------------- at91_dt_defconfig (arm, gcc-10) — PASS, 0 errors, 0 warnings, 0 section mismatches -------------------------------------------------------------------------------- ath25_defconfig (mips, gcc-10) — PASS, 0 errors, 0 warnings, 0 section mismatches -------------------------------------------------------------------------------- ath79_defconfig (mips, gcc-10) — PASS, 0 errors, 0 warnings, 0 section mismatches -------------------------------------------------------------------------------- axm55xx_defconfig (arm, gcc-10) — PASS, 0 errors, 0 warnings, 0 section mismatches -------------------------------------------------------------------------------- axs103_defconfig (arc, gcc-10) — PASS, 0 errors, 0 warnings, 0 section mismatches -------------------------------------------------------------------------------- axs103_smp_defconfig (arc, gcc-10) — PASS, 0 errors, 0 warnings, 0 section mismatches -------------------------------------------------------------------------------- badge4_defconfig (arm, gcc-10) — PASS, 0 errors, 0 warnings, 0 section mismatches -------------------------------------------------------------------------------- bcm2835_defconfig (arm, gcc-10) — PASS, 0 errors, 0 warnings, 0 section mismatches -------------------------------------------------------------------------------- bcm47xx_defconfig (mips, gcc-10) — PASS, 0 errors, 0 warnings, 0 section mismatches -------------------------------------------------------------------------------- bcm63xx_defconfig (mips, gcc-10) — PASS, 0 errors, 0 warnings, 0 section mismatches -------------------------------------------------------------------------------- bigsur_defconfig (mips, gcc-10) — PASS, 0 errors, 0 warnings, 0 section mismatches -------------------------------------------------------------------------------- bmips_be_defconfig (mips, gcc-10) — PASS, 0 errors, 1 warning, 0 section mismatches Warnings: include/uapi/linux/byteorder/big_endian.h:33:26: warning: conversion from ‘unsigned int’ to ‘__le16’ {aka ‘short unsigned int’} changes value from ‘402653184’ to ‘0’ [-Woverflow] -------------------------------------------------------------------------------- bmips_stb_defconfig (mips, gcc-10) — PASS, 0 errors, 0 warnings, 0 section mismatches -------------------------------------------------------------------------------- capcella_defconfig (mips, gcc-10) — PASS, 0 errors, 0 warnings, 0 section mismatches -------------------------------------------------------------------------------- cavium_octeon_defconfig (mips, gcc-10) — PASS, 0 errors, 0 warnings, 0 section mismatches -------------------------------------------------------------------------------- cerfcube_defconfig (arm, gcc-10) — PASS, 0 errors, 0 warnings, 0 section mismatches -------------------------------------------------------------------------------- ci20_defconfig (mips, gcc-10) — PASS, 0 errors, 0 warnings, 0 section mismatches -------------------------------------------------------------------------------- cm_x2xx_defconfig (arm, gcc-10) — PASS, 0 errors, 0 warnings, 0 section mismatches -------------------------------------------------------------------------------- cm_x300_defconfig (arm, gcc-10) — PASS, 0 errors, 0 warnings, 0 section mismatches -------------------------------------------------------------------------------- cobalt_defconfig (mips, gcc-10) — PASS, 0 errors, 0 warnings, 0 section mismatches -------------------------------------------------------------------------------- colibri_pxa270_defconfig (arm, gcc-10) — PASS, 0 errors, 0 warnings, 0 section mismatches -------------------------------------------------------------------------------- colibri_pxa300_defconfig (arm, gcc-10) — PASS, 0 errors, 0 warnings, 0 section mismatches -------------------------------------------------------------------------------- collie_defconfig (arm, gcc-10) — PASS, 0 errors, 1 warning, 0 section mismatches Warnings: drivers/video/fbdev/sa1100fb.c:975:21: warning: ‘sa1100fb_min_dma_period’ defined but not used [-Wunused-function] -------------------------------------------------------------------------------- corgi_defconfig (arm, gcc-10) — PASS, 0 errors, 0 warnings, 0 section mismatches -------------------------------------------------------------------------------- davinci_all_defconfig (arm, gcc-10) — PASS, 0 errors, 0 warnings, 0 section mismatches -------------------------------------------------------------------------------- db1xxx_defconfig (mips, gcc-10) — PASS, 0 errors, 0 warnings, 0 section mismatches -------------------------------------------------------------------------------- decstation_defconfig (mips, gcc-10) — PASS, 0 errors, 0 warnings, 0 section mismatches Section mismatches: WARNING: vmlinux.o(.text.unlikely+0x3a90): Section mismatch in reference from the function pmax_setup_memory_region() to the function .init.text:add_memory_region() -------------------------------------------------------------------------------- decstation_r4k_defconfig (mips, gcc-10) — PASS, 0 errors, 0 warnings, 0 section mismatches -------------------------------------------------------------------------------- defconfig (riscv, gcc-10) — PASS, 0 errors, 0 warnings, 0 section mismatches -------------------------------------------------------------------------------- defconfig (arm64, gcc-10) — PASS, 0 errors, 2 warnings, 0 section mismatches Warnings: arch/arm64/include/asm/memory.h:238:15: warning: cast from pointer to integer of different size [-Wpointer-to-int-cast] arch/arm64/include/asm/memory.h:238:15: warning: cast from pointer to integer of different size [-Wpointer-to-int-cast] -------------------------------------------------------------------------------- defconfig+arm64-chromebook (arm64, gcc-10) — PASS, 0 errors, 2 warnings, 0 section mismatches Warnings: arch/arm64/include/asm/memory.h:238:15: warning: cast from pointer to integer of different size [-Wpointer-to-int-cast] arch/arm64/include/asm/memory.h:238:15: warning: cast from pointer to integer of different size [-Wpointer-to-int-cast] -------------------------------------------------------------------------------- dove_defconfig (arm, gcc-10) — PASS, 0 errors, 0 warnings, 0 section mismatches -------------------------------------------------------------------------------- e55_defconfig (mips, gcc-10) — PASS, 0 errors, 0 warnings, 0 section mismatches -------------------------------------------------------------------------------- ebsa110_defconfig (arm, gcc-10) — PASS, 0 errors, 0 warnings, 0 section mismatches -------------------------------------------------------------------------------- efm32_defconfig (arm, gcc-10) — PASS, 0 errors, 0 warnings, 0 section mismatches -------------------------------------------------------------------------------- em_x270_defconfig (arm, gcc-10) — PASS, 0 errors, 0 warnings, 0 section mismatches -------------------------------------------------------------------------------- ep93xx_defconfig (arm, gcc-10) — PASS, 0 errors, 0 warnings, 0 section mismatches Section mismatches: WARNING: vmlinux.o(___ksymtab_gpl+vic_init_cascaded+0x0): Section mismatch in reference from the variable __ksymtab_vic_init_cascaded to the function .init.text:vic_init_cascaded() -------------------------------------------------------------------------------- eseries_pxa_defconfig (arm, gcc-10) — PASS, 0 errors, 0 warnings, 0 section mismatches -------------------------------------------------------------------------------- exynos_defconfig (arm, gcc-10) — PASS, 0 errors, 0 warnings, 0 section mismatches -------------------------------------------------------------------------------- ezx_defconfig (arm, gcc-10) — PASS, 0 errors, 0 warnings, 0 section mismatches -------------------------------------------------------------------------------- footbridge_defconfig (arm, gcc-10) — PASS, 0 errors, 0 warnings, 0 section mismatches -------------------------------------------------------------------------------- fuloong2e_defconfig (mips, gcc-10) — PASS, 0 errors, 0 warnings, 0 section mismatches -------------------------------------------------------------------------------- gcw0_defconfig (mips, gcc-10) — PASS, 0 errors, 0 warnings, 0 section mismatches -------------------------------------------------------------------------------- gemini_defconfig (arm, gcc-10) — PASS, 0 errors, 0 warnings, 0 section mismatches -------------------------------------------------------------------------------- gpr_defconfig (mips, gcc-10) — PASS, 0 errors, 0 warnings, 0 section mismatches -------------------------------------------------------------------------------- h3600_defconfig (arm, gcc-10) — PASS, 0 errors, 1 warning, 0 section mismatches Warnings: drivers/video/fbdev/sa1100fb.c:975:21: warning: ‘sa1100fb_min_dma_period’ defined but not used [-Wunused-function] -------------------------------------------------------------------------------- h5000_defconfig (arm, gcc-10) — PASS, 0 errors, 0 warnings, 0 section mismatches -------------------------------------------------------------------------------- hackkit_defconfig (arm, gcc-10) — PASS, 0 errors, 0 warnings, 0 section mismatches -------------------------------------------------------------------------------- haps_hs_defconfig (arc, gcc-10) — PASS, 0 errors, 0 warnings, 0 section mismatches -------------------------------------------------------------------------------- haps_hs_smp_defconfig (arc, gcc-10) — PASS, 0 errors, 0 warnings, 0 section mismatches -------------------------------------------------------------------------------- hisi_defconfig (arm, gcc-10) — PASS, 0 errors, 0 warnings, 0 section mismatches -------------------------------------------------------------------------------- hsdk_defconfig (arc, gcc-10) — PASS, 0 errors, 0 warnings, 0 section mismatches -------------------------------------------------------------------------------- i386_defconfig (i386, gcc-10) — PASS, 0 errors, 2 warnings, 0 section mismatches Warnings: ld: arch/x86/boot/compressed/head_32.o: warning: relocation in read-only section `.head.text' ld: warning: creating DT_TEXTREL in a PIE -------------------------------------------------------------------------------- imote2_defconfig (arm, gcc-10) — PASS, 0 errors, 0 warnings, 0 section mismatches -------------------------------------------------------------------------------- imx_v4_v5_defconfig (arm, gcc-10) — PASS, 0 errors, 0 warnings, 0 section mismatches -------------------------------------------------------------------------------- imx_v6_v7_defconfig (arm, gcc-10) — PASS, 0 errors, 0 warnings, 0 section mismatches -------------------------------------------------------------------------------- integrator_defconfig (arm, gcc-10) — PASS, 0 errors, 0 warnings, 0 section mismatches Section mismatches: WARNING: vmlinux.o(___ksymtab_gpl+vic_init_cascaded+0x0): Section mismatch in reference from the variable __ksymtab_vic_init_cascaded to the function .init.text:vic_init_cascaded() -------------------------------------------------------------------------------- iop32x_defconfig (arm, gcc-10) — PASS, 0 errors, 0 warnings, 0 section mismatches -------------------------------------------------------------------------------- ip22_defconfig (mips, gcc-10) — PASS, 0 errors, 0 warnings, 0 section mismatches -------------------------------------------------------------------------------- ip27_defconfig (mips, gcc-10) — FAIL, 0 errors, 0 warnings, 0 section mismatches -------------------------------------------------------------------------------- ip28_defconfig (mips, gcc-10) — FAIL, 0 errors, 0 warnings, 0 section mismatches -------------------------------------------------------------------------------- ip32_defconfig (mips, gcc-10) — PASS, 0 errors, 0 warnings, 0 section mismatches -------------------------------------------------------------------------------- ixp4xx_defconfig (arm, gcc-10) — PASS, 0 errors, 0 warnings, 0 section mismatches Section mismatches: WARNING: vmlinux.o(___ksymtab_gpl+ixp4xx_irq_init+0x0): Section mismatch in reference from the variable __ksymtab_ixp4xx_irq_init to the function .init.text:ixp4xx_irq_init() -------------------------------------------------------------------------------- jazz_defconfig (mips, gcc-10) — PASS, 0 errors, 0 warnings, 0 section mismatches -------------------------------------------------------------------------------- jmr3927_defconfig (mips, gcc-10) — PASS, 0 errors, 0 warnings, 0 section mismatches -------------------------------------------------------------------------------- jornada720_defconfig (arm, gcc-10) — PASS, 0 errors, 0 warnings, 0 section mismatches -------------------------------------------------------------------------------- keystone_defconfig (arm, gcc-10) — PASS, 0 errors, 0 warnings, 0 section mismatches -------------------------------------------------------------------------------- lart_defconfig (arm, gcc-10) — PASS, 0 errors, 0 warnings, 0 section mismatches -------------------------------------------------------------------------------- lasat_defconfig (mips, gcc-10) — PASS, 0 errors, 0 warnings, 0 section mismatches -------------------------------------------------------------------------------- lemote2f_defconfig (mips, gcc-10) — PASS, 0 errors, 0 warnings, 0 section mismatches -------------------------------------------------------------------------------- loongson1b_defconfig (mips, gcc-10) — PASS, 0 errors, 0 warnings, 0 section mismatches -------------------------------------------------------------------------------- loongson1c_defconfig (mips, gcc-10) — PASS, 0 errors, 0 warnings, 0 section mismatches -------------------------------------------------------------------------------- loongson3_defconfig (mips, gcc-10) — PASS, 0 errors, 0 warnings, 0 section mismatches -------------------------------------------------------------------------------- lpc18xx_defconfig (arm, gcc-10) — PASS, 0 errors, 0 warnings, 0 section mismatches -------------------------------------------------------------------------------- lpc32xx_defconfig (arm, gcc-10) — PASS, 0 errors, 0 warnings, 0 section mismatches -------------------------------------------------------------------------------- lpd270_defconfig (arm, gcc-10) — PASS, 0 errors, 0 warnings, 0 section mismatches -------------------------------------------------------------------------------- lubbock_defconfig (arm, gcc-10) — PASS, 0 errors, 0 warnings, 0 section mismatches -------------------------------------------------------------------------------- magician_defconfig (arm, gcc-10) — PASS, 0 errors, 0 warnings, 0 section mismatches -------------------------------------------------------------------------------- mainstone_defconfig (arm, gcc-10) — PASS, 0 errors, 0 warnings, 0 section mismatches -------------------------------------------------------------------------------- malta_defconfig (mips, gcc-10) — PASS, 0 errors, 0 warnings, 0 section mismatches -------------------------------------------------------------------------------- malta_kvm_defconfig (mips, gcc-10) — PASS, 0 errors, 0 warnings, 0 section mismatches -------------------------------------------------------------------------------- malta_qemu_32r6_defconfig (mips, gcc-10) — PASS, 0 errors, 0 warnings, 0 section mismatches -------------------------------------------------------------------------------- maltaaprp_defconfig (mips, gcc-10) — PASS, 0 errors, 0 warnings, 0 section mismatches -------------------------------------------------------------------------------- maltasmvp_defconfig (mips, gcc-10) — PASS, 0 errors, 0 warnings, 0 section mismatches -------------------------------------------------------------------------------- maltasmvp_eva_defconfig (mips, gcc-10) — PASS, 0 errors, 0 warnings, 0 section mismatches -------------------------------------------------------------------------------- maltaup_defconfig (mips, gcc-10) — PASS, 0 errors, 0 warnings, 0 section mismatches -------------------------------------------------------------------------------- maltaup_xpa_defconfig (mips, gcc-10) — PASS, 0 errors, 0 warnings, 0 section mismatches -------------------------------------------------------------------------------- markeins_defconfig (mips, gcc-10) — PASS, 0 errors, 0 warnings, 0 section mismatches -------------------------------------------------------------------------------- milbeaut_m10v_defconfig (arm, gcc-10) — PASS, 0 errors, 0 warnings, 0 section mismatches -------------------------------------------------------------------------------- mini2440_defconfig (arm, gcc-10) — PASS, 0 errors, 0 warnings, 0 section mismatches -------------------------------------------------------------------------------- mips_paravirt_defconfig (mips, gcc-10) — PASS, 0 errors, 0 warnings, 0 section mismatches -------------------------------------------------------------------------------- mmp2_defconfig (arm, gcc-10) — PASS, 0 errors, 0 warnings, 0 section mismatches -------------------------------------------------------------------------------- moxart_defconfig (arm, gcc-10) — PASS, 0 errors, 0 warnings, 0 section mismatches -------------------------------------------------------------------------------- mpc30x_defconfig (mips, gcc-10) — PASS, 0 errors, 0 warnings, 0 section mismatches -------------------------------------------------------------------------------- mps2_defconfig (arm, gcc-10) — PASS, 0 errors, 0 warnings, 0 section mismatches -------------------------------------------------------------------------------- msp71xx_defconfig (mips, gcc-10) — PASS, 0 errors, 0 warnings, 0 section mismatches -------------------------------------------------------------------------------- mtx1_defconfig (mips, gcc-10) — PASS, 0 errors, 3 warnings, 0 section mismatches Warnings: sound/pci/echoaudio/echoaudio_dsp.c:647:9: warning: iteration 1073741824 invokes undefined behavior [-Waggressive-loop-optimizations] sound/pci/echoaudio/echoaudio_dsp.c:658:9: warning: iteration 1073741824 invokes undefined behavior [-Waggressive-loop-optimizations] sound/pci/echoaudio/echoaudio_dsp.c:647:9: warning: iteration 1073741824 invokes undefined behavior [-Waggressive-loop-optimizations] -------------------------------------------------------------------------------- multi_v4t_defconfig (arm, gcc-10) — PASS, 0 errors, 0 warnings, 0 section mismatches -------------------------------------------------------------------------------- multi_v5_defconfig (arm, gcc-10) — PASS, 0 errors, 0 warnings, 0 section mismatches Section mismatches: WARNING: vmlinux.o(___ksymtab_gpl+vic_init_cascaded+0x0): Section mismatch in reference from the variable __ksymtab_vic_init_cascaded to the function .init.text:vic_init_cascaded() -------------------------------------------------------------------------------- multi_v7_defconfig (arm, gcc-10) — PASS, 0 errors, 0 warnings, 0 section mismatches -------------------------------------------------------------------------------- mvebu_v5_defconfig (arm, gcc-10) — PASS, 0 errors, 0 warnings, 0 section mismatches -------------------------------------------------------------------------------- mvebu_v7_defconfig (arm, gcc-10) — PASS, 0 errors, 0 warnings, 0 section mismatches -------------------------------------------------------------------------------- mxs_defconfig (arm, gcc-10) — PASS, 0 errors, 0 warnings, 0 section mismatches -------------------------------------------------------------------------------- neponset_defconfig (arm, gcc-10) — PASS, 0 errors, 1 warning, 0 section mismatches Warnings: drivers/video/fbdev/sa1100fb.c:975:21: warning: ‘sa1100fb_min_dma_period’ defined but not used [-Wunused-function] -------------------------------------------------------------------------------- netwinder_defconfig (arm, gcc-10) — PASS, 0 errors, 0 warnings, 0 section mismatches -------------------------------------------------------------------------------- nhk8815_defconfig (arm, gcc-10) — PASS, 0 errors, 0 warnings, 0 section mismatches Section mismatches: WARNING: vmlinux.o(___ksymtab_gpl+vic_init_cascaded+0x0): Section mismatch in reference from the variable __ksymtab_vic_init_cascaded to the function .init.text:vic_init_cascaded() -------------------------------------------------------------------------------- nlm_xlp_defconfig (mips, gcc-10) — PASS, 0 errors, 0 warnings, 0 section mismatches -------------------------------------------------------------------------------- nlm_xlr_defconfig (mips, gcc-10) — PASS, 0 errors, 0 warnings, 0 section mismatches -------------------------------------------------------------------------------- nsim_hs_defconfig (arc, gcc-10) — PASS, 0 errors, 0 warnings, 0 section mismatches -------------------------------------------------------------------------------- nsim_hs_smp_defconfig (arc, gcc-10) — PASS, 0 errors, 0 warnings, 0 section mismatches -------------------------------------------------------------------------------- nsimosci_hs_defconfig (arc, gcc-10) — PASS, 0 errors, 0 warnings, 0 section mismatches -------------------------------------------------------------------------------- nsimosci_hs_smp_defconfig (arc, gcc-10) — PASS, 0 errors, 0 warnings, 0 section mismatches -------------------------------------------------------------------------------- omap1_defconfig (arm, gcc-10) — PASS, 0 errors, 0 warnings, 0 section mismatches -------------------------------------------------------------------------------- omap2plus_defconfig (arm, gcc-10) — PASS, 0 errors, 0 warnings, 0 section mismatches -------------------------------------------------------------------------------- omega2p_defconfig (mips, gcc-10) — PASS, 0 errors, 0 warnings, 0 section mismatches -------------------------------------------------------------------------------- orion5x_defconfig (arm, gcc-10) — PASS, 0 errors, 0 warnings, 0 section mismatches -------------------------------------------------------------------------------- oxnas_v6_defconfig (arm, gcc-10) — PASS, 0 errors, 0 warnings, 0 section mismatches -------------------------------------------------------------------------------- palmz72_defconfig (arm, gcc-10) — PASS, 0 errors, 0 warnings, 0 section mismatches -------------------------------------------------------------------------------- pcm027_defconfig (arm, gcc-10) — PASS, 0 errors, 0 warnings, 0 section mismatches -------------------------------------------------------------------------------- pic32mzda_defconfig (mips, gcc-10) — PASS, 0 errors, 0 warnings, 0 section mismatches -------------------------------------------------------------------------------- pistachio_defconfig (mips, gcc-10) — PASS, 0 errors, 0 warnings, 0 section mismatches -------------------------------------------------------------------------------- pleb_defconfig (arm, gcc-10) — PASS, 0 errors, 0 warnings, 0 section mismatches -------------------------------------------------------------------------------- pnx8335_stb225_defconfig (mips, gcc-10) — PASS, 0 errors, 0 warnings, 0 section mismatches -------------------------------------------------------------------------------- prima2_defconfig (arm, gcc-10) — PASS, 0 errors, 0 warnings, 0 section mismatches -------------------------------------------------------------------------------- pxa168_defconfig (arm, gcc-10) — PASS, 0 errors, 0 warnings, 0 section mismatches -------------------------------------------------------------------------------- pxa255-idp_defconfig (arm, gcc-10) — PASS, 0 errors, 0 warnings, 0 section mismatches -------------------------------------------------------------------------------- pxa3xx_defconfig (arm, gcc-10) — PASS, 0 errors, 0 warnings, 0 section mismatches -------------------------------------------------------------------------------- pxa910_defconfig (arm, gcc-10) — PASS, 0 errors, 0 warnings, 0 section mismatches -------------------------------------------------------------------------------- pxa_defconfig (arm, gcc-10) — PASS, 0 errors, 0 warnings, 0 section mismatches -------------------------------------------------------------------------------- qcom_defconfig (arm, gcc-10) — PASS, 0 errors, 0 warnings, 0 section mismatches -------------------------------------------------------------------------------- qi_lb60_defconfig (mips, gcc-10) — PASS, 0 errors, 0 warnings, 0 section mismatches -------------------------------------------------------------------------------- rb532_defconfig (mips, gcc-10) — PASS, 0 errors, 0 warnings, 0 section mismatches -------------------------------------------------------------------------------- rbtx49xx_defconfig (mips, gcc-10) — PASS, 0 errors, 0 warnings, 0 section mismatches -------------------------------------------------------------------------------- realview_defconfig (arm, gcc-10) — PASS, 0 errors, 0 warnings, 0 section mismatches -------------------------------------------------------------------------------- rm200_defconfig (mips, gcc-10) — PASS, 0 errors, 0 warnings, 0 section mismatches -------------------------------------------------------------------------------- rt305x_defconfig (mips, gcc-10) — PASS, 0 errors, 0 warnings, 0 section mismatches -------------------------------------------------------------------------------- s3c2410_defconfig (arm, gcc-10) — PASS, 0 errors, 0 warnings, 0 section mismatches -------------------------------------------------------------------------------- s3c6400_defconfig (arm, gcc-10) — PASS, 0 errors, 0 warnings, 0 section mismatches Section mismatches: WARNING: vmlinux.o(___ksymtab_gpl+vic_init_cascaded+0x0): Section mismatch in reference from the variable __ksymtab_vic_init_cascaded to the function .init.text:vic_init_cascaded() -------------------------------------------------------------------------------- s5pv210_defconfig (arm, gcc-10) — PASS, 0 errors, 0 warnings, 0 section mismatches Section mismatches: WARNING: vmlinux.o(___ksymtab_gpl+vic_init_cascaded+0x0): Section mismatch in reference from the variable __ksymtab_vic_init_cascaded to the function .init.text:vic_init_cascaded() -------------------------------------------------------------------------------- sama5_defconfig (arm, gcc-10) — PASS, 0 errors, 0 warnings, 0 section mismatches -------------------------------------------------------------------------------- sb1250_swarm_defconfig (mips, gcc-10) — PASS, 0 errors, 0 warnings, 0 section mismatches -------------------------------------------------------------------------------- shannon_defconfig (arm, gcc-10) — PASS, 0 errors, 1 warning, 0 section mismatches Warnings: drivers/video/fbdev/sa1100fb.c:975:21: warning: ‘sa1100fb_min_dma_period’ defined but not used [-Wunused-function] -------------------------------------------------------------------------------- shmobile_defconfig (arm, gcc-10) — PASS, 0 errors, 0 warnings, 0 section mismatches -------------------------------------------------------------------------------- simpad_defconfig (arm, gcc-10) — PASS, 0 errors, 0 warnings, 0 section mismatches -------------------------------------------------------------------------------- socfpga_defconfig (arm, gcc-10) — PASS, 0 errors, 0 warnings, 0 section mismatches -------------------------------------------------------------------------------- spear13xx_defconfig (arm, gcc-10) — PASS, 0 errors, 0 warnings, 0 section mismatches -------------------------------------------------------------------------------- spear3xx_defconfig (arm, gcc-10) — PASS, 0 errors, 0 warnings, 0 section mismatches Section mismatches: WARNING: vmlinux.o(___ksymtab_gpl+vic_init_cascaded+0x0): Section mismatch in reference from the variable __ksymtab_vic_init_cascaded to the function .init.text:vic_init_cascaded() -------------------------------------------------------------------------------- spear6xx_defconfig (arm, gcc-10) — PASS, 0 errors, 0 warnings, 0 section mismatches Section mismatches: WARNING: vmlinux.o(___ksymtab_gpl+vic_init_cascaded+0x0): Section mismatch in reference from the variable __ksymtab_vic_init_cascaded to the function .init.text:vic_init_cascaded() -------------------------------------------------------------------------------- spitz_defconfig (arm, gcc-10) — PASS, 0 errors, 0 warnings, 0 section mismatches -------------------------------------------------------------------------------- stm32_defconfig (arm, gcc-10) — PASS, 0 errors, 0 warnings, 0 section mismatches -------------------------------------------------------------------------------- sunxi_defconfig (arm, gcc-10) — PASS, 0 errors, 0 warnings, 0 section mismatches -------------------------------------------------------------------------------- tango4_defconfig (arm, gcc-10) — PASS, 0 errors, 0 warnings, 0 section mismatches -------------------------------------------------------------------------------- tb0219_defconfig (mips, gcc-10) — PASS, 0 errors, 0 warnings, 0 section mismatches -------------------------------------------------------------------------------- tb0226_defconfig (mips, gcc-10) — PASS, 0 errors, 0 warnings, 0 section mismatches -------------------------------------------------------------------------------- tb0287_defconfig (mips, gcc-10) — PASS, 0 errors, 0 warnings, 0 section mismatches -------------------------------------------------------------------------------- tct_hammer_defconfig (arm, gcc-10) — PASS, 0 errors, 0 warnings, 0 section mismatches -------------------------------------------------------------------------------- tegra_defconfig (arm, gcc-10) — PASS, 0 errors, 0 warnings, 0 section mismatches -------------------------------------------------------------------------------- tinyconfig (x86_64, gcc-10) — PASS, 0 errors, 4 warnings, 0 section mismatches Warnings: arch/x86/entry/entry_64.S:1756: Warning: no instruction mnemonic suffix given and no register operands; using default for `sysret' arch/x86/entry/entry_64.o: warning: objtool: .entry.text+0x151: unsupported intra-function call ld: arch/x86/boot/compressed/head_64.o: warning: relocation in read-only section `.head.text' ld: warning: creating DT_TEXTREL in a PIE -------------------------------------------------------------------------------- tinyconfig (i386, gcc-10) — PASS, 0 errors, 2 warnings, 0 section mismatches Warnings: ld: arch/x86/boot/compressed/head_32.o: warning: relocation in read-only section `.head.text' ld: warning: creating DT_TEXTREL in a PIE -------------------------------------------------------------------------------- tinyconfig (arc, gcc-10) — PASS, 0 errors, 0 warnings, 0 section mismatches -------------------------------------------------------------------------------- trizeps4_defconfig (arm, gcc-10) — PASS, 0 errors, 0 warnings, 0 section mismatches -------------------------------------------------------------------------------- u300_defconfig (arm, gcc-10) — PASS, 0 errors, 0 warnings, 0 section mismatches Section mismatches: WARNING: vmlinux.o(___ksymtab_gpl+vic_init_cascaded+0x0): Section mismatch in reference from the variable __ksymtab_vic_init_cascaded to the function .init.text:vic_init_cascaded() -------------------------------------------------------------------------------- u8500_defconfig (arm, gcc-10) — PASS, 0 errors, 0 warnings, 0 section mismatches -------------------------------------------------------------------------------- vdk_hs38_defconfig (arc, gcc-10) — PASS, 0 errors, 0 warnings, 0 section mismatches -------------------------------------------------------------------------------- vdk_hs38_smp_defconfig (arc, gcc-10) — PASS, 0 errors, 0 warnings, 0 section mismatches -------------------------------------------------------------------------------- versatile_defconfig (arm, gcc-10) — PASS, 0 errors, 0 warnings, 0 section mismatches Section mismatches: WARNING: vmlinux.o(___ksymtab_gpl+vic_init_cascaded+0x0): Section mismatch in reference from the variable __ksymtab_vic_init_cascaded to the function .init.text:vic_init_cascaded() -------------------------------------------------------------------------------- vexpress_defconfig (arm, gcc-10) — PASS, 0 errors, 0 warnings, 0 section mismatches -------------------------------------------------------------------------------- vf610m4_defconfig (arm, gcc-10) — PASS, 0 errors, 0 warnings, 0 section mismatches -------------------------------------------------------------------------------- viper_defconfig (arm, gcc-10) — PASS, 0 errors, 0 warnings, 0 section mismatches -------------------------------------------------------------------------------- vocore2_defconfig (mips, gcc-10) — PASS, 0 errors, 0 warnings, 0 section mismatches -------------------------------------------------------------------------------- vt8500_v6_v7_defconfig (arm, gcc-10) — PASS, 0 errors, 0 warnings, 0 section mismatches -------------------------------------------------------------------------------- workpad_defconfig (mips, gcc-10) — PASS, 0 errors, 0 warnings, 0 section mismatches -------------------------------------------------------------------------------- x86_64_defconfig (x86_64, gcc-10) — PASS, 0 errors, 4 warnings, 0 section mismatches Warnings: arch/x86/entry/entry_64.o: warning: objtool: .entry.text+0x1c1: unsupported intra-function call arch/x86/entry/entry_64.o: warning: objtool: If this is a retpoline, please patch it in with alternatives and annotate it with ANNOTATE_NOSPEC_ALTERNATIVE. ld: arch/x86/boot/compressed/head_64.o: warning: relocation in read-only section `.head.text' ld: warning: creating DT_TEXTREL in a PIE -------------------------------------------------------------------------------- x86_64_defconfig+x86-chromebook (x86_64, gcc-10) — PASS, 0 errors, 4 warnings, 0 section mismatches Warnings: arch/x86/entry/entry_64.o: warning: objtool: .entry.text+0x1c1: unsupported intra-function call arch/x86/entry/entry_64.o: warning: objtool: If this is a retpoline, please patch it in with alternatives and annotate it with ANNOTATE_NOSPEC_ALTERNATIVE. ld: arch/x86/boot/compressed/head_64.o: warning: relocation in read-only section `.head.text' ld: warning: creating DT_TEXTREL in a PIE -------------------------------------------------------------------------------- xcep_defconfig (arm, gcc-10) — PASS, 0 errors, 0 warnings, 0 section mismatches -------------------------------------------------------------------------------- zeus_defconfig (arm, gcc-10) — PASS, 0 errors, 0 warnings, 0 section mismatches -------------------------------------------------------------------------------- zx_defconfig (arm, gcc-10) — PASS, 0 errors, 0 warnings, 0 section mismatches --- For more info write to <info(a)kernelci.org>
[View Less]
1 year, 9 months
1
0
0
0
stable-rc/linux-6.1.y baseline: 147 runs, 7 regressions (v6.1.29-413-g8482df0ff7e7)
by kernelci.org bot
stable-rc/linux-6.1.y baseline: 147 runs, 7 regressions (v6.1.29-413-g8482df0ff7e7) Regressions Summary ------------------- platform | arch | lab | compiler | defconfig | regressions -----------------------------+--------+---------------+----------+------------------------------+------------ asus-C436FA-Flip-hatch | x86_64 | lab-collabora | gcc-10 | x86_64_defcon...6-chromebook | 1 asus-CM1400CXA-dalboz | x86_64 | lab-
…
[View More]
collabora | gcc-10 | x86_64_defcon...6-chromebook | 1 asus-cx9400-volteer | x86_64 | lab-collabora | gcc-10 | x86_64_defcon...6-chromebook | 1 hp-x360-12b-c...4020-octopus | x86_64 | lab-collabora | gcc-10 | x86_64_defcon...6-chromebook | 1 hp-x360-14-G1-sona | x86_64 | lab-collabora | gcc-10 | x86_64_defcon...6-chromebook | 1 hp-x360-14a-cb0001xx-zork | x86_64 | lab-collabora | gcc-10 | x86_64_defcon...6-chromebook | 1 lenovo-TPad-C13-Yoga-zork | x86_64 | lab-collabora | gcc-10 | x86_64_defcon...6-chromebook | 1 Details:
https://kernelci.org/test/job/stable-rc/branch/linux-6.1.y/kernel/v6.1.29-4…
Test: baseline Tree: stable-rc Branch: linux-6.1.y Describe: v6.1.29-413-g8482df0ff7e7 URL:
https://git.kernel.org/pub/scm/linux/kernel/git/stable/linux-stable-rc.git
SHA: 8482df0ff7e727d4244b8bf8537cce39a474eefc Test Regressions ---------------- platform | arch | lab | compiler | defconfig | regressions -----------------------------+--------+---------------+----------+------------------------------+------------ asus-C436FA-Flip-hatch | x86_64 | lab-collabora | gcc-10 | x86_64_defcon...6-chromebook | 1 Details:
https://kernelci.org/test/plan/id/6473e6473cbba7ed5f2e8633
Results: 6 PASS, 1 FAIL, 0 SKIP Full config: x86_64_defconfig+x86-chromebook Compiler: gcc-10 (gcc (Debian 10.2.1-6) 10.2.1 20210110) Plain log:
https://storage.kernelci.org//stable-rc/linux-6.1.y/v6.1.29-413-g8482df0ff7…
HTML log:
https://storage.kernelci.org//stable-rc/linux-6.1.y/v6.1.29-413-g8482df0ff7…
Rootfs:
http://storage.kernelci.org/images/rootfs/buildroot/buildroot-baseline/2023…
* baseline.bootrr.deferred-probe-empty:
https://kernelci.org/test/case/id/6473e6473cbba7ed5f2e8638
failing since 59 days (last pass: v6.1.21, first fail: v6.1.22) 2023-05-28T23:39:28.571533 <8>[ 10.877194] <LAVA_SIGNAL_ENDRUN 0_dmesg 10500506_1.4.2.3.1> 2023-05-28T23:39:28.575043 + set +x 2023-05-28T23:39:28.676527 / # 2023-05-28T23:39:28.777426 # #export SHELL=/bin/sh 2023-05-28T23:39:28.777680 2023-05-28T23:39:28.878228 / # export SHELL=/bin/sh. /lava-10500506/environment 2023-05-28T23:39:28.878457 2023-05-28T23:39:28.978994 / # . /lava-10500506/environment/lava-10500506/bin/lava-test-runner /lava-10500506/1 2023-05-28T23:39:28.979306 2023-05-28T23:39:28.984962 / # /lava-10500506/bin/lava-test-runner /lava-10500506/1 ... (12 line(s) more) platform | arch | lab | compiler | defconfig | regressions -----------------------------+--------+---------------+----------+------------------------------+------------ asus-CM1400CXA-dalboz | x86_64 | lab-collabora | gcc-10 | x86_64_defcon...6-chromebook | 1 Details:
https://kernelci.org/test/plan/id/6473e5faf7892a05852e85e8
Results: 6 PASS, 1 FAIL, 0 SKIP Full config: x86_64_defconfig+x86-chromebook Compiler: gcc-10 (gcc (Debian 10.2.1-6) 10.2.1 20210110) Plain log:
https://storage.kernelci.org//stable-rc/linux-6.1.y/v6.1.29-413-g8482df0ff7…
HTML log:
https://storage.kernelci.org//stable-rc/linux-6.1.y/v6.1.29-413-g8482df0ff7…
Rootfs:
http://storage.kernelci.org/images/rootfs/buildroot/buildroot-baseline/2023…
* baseline.bootrr.deferred-probe-empty:
https://kernelci.org/test/case/id/6473e5faf7892a05852e85ed
failing since 59 days (last pass: v6.1.21, first fail: v6.1.22) 2023-05-28T23:38:18.521808 + set<8>[ 11.218401] <LAVA_SIGNAL_ENDRUN 0_dmesg 10500454_1.4.2.3.1> 2023-05-28T23:38:18.521952 +x 2023-05-28T23:38:18.626316 / # # 2023-05-28T23:38:18.726978 export SHELL=/bin/sh 2023-05-28T23:38:18.727192 # 2023-05-28T23:38:18.827840 / # export SHELL=/bin/sh. /lava-10500454/environment 2023-05-28T23:38:18.828067 2023-05-28T23:38:18.928635 / # . /lava-10500454/environment/lava-10500454/bin/lava-test-runner /lava-10500454/1 2023-05-28T23:38:18.928916 2023-05-28T23:38:18.933678 / # /lava-10500454/bin/lava-test-runner /lava-10500454/1 ... (12 line(s) more) platform | arch | lab | compiler | defconfig | regressions -----------------------------+--------+---------------+----------+------------------------------+------------ asus-cx9400-volteer | x86_64 | lab-collabora | gcc-10 | x86_64_defcon...6-chromebook | 1 Details:
https://kernelci.org/test/plan/id/6473e5f7db760efdb32e85e6
Results: 6 PASS, 1 FAIL, 0 SKIP Full config: x86_64_defconfig+x86-chromebook Compiler: gcc-10 (gcc (Debian 10.2.1-6) 10.2.1 20210110) Plain log:
https://storage.kernelci.org//stable-rc/linux-6.1.y/v6.1.29-413-g8482df0ff7…
HTML log:
https://storage.kernelci.org//stable-rc/linux-6.1.y/v6.1.29-413-g8482df0ff7…
Rootfs:
http://storage.kernelci.org/images/rootfs/buildroot/buildroot-baseline/2023…
* baseline.bootrr.deferred-probe-empty:
https://kernelci.org/test/case/id/6473e5f7db760efdb32e85eb
failing since 59 days (last pass: v6.1.21, first fail: v6.1.22) 2023-05-28T23:38:11.577961 <8>[ 10.149266] <LAVA_SIGNAL_ENDRUN 0_dmesg 10500518_1.4.2.3.1> 2023-05-28T23:38:11.581551 + set +x 2023-05-28T23:38:11.682876 2023-05-28T23:38:11.783408 / # #export SHELL=/bin/sh 2023-05-28T23:38:11.783575 2023-05-28T23:38:11.884050 / # export SHELL=/bin/sh. /lava-10500518/environment 2023-05-28T23:38:11.884216 2023-05-28T23:38:11.984688 / # . /lava-10500518/environment/lava-10500518/bin/lava-test-runner /lava-10500518/1 2023-05-28T23:38:11.984953 2023-05-28T23:38:11.990165 / # /lava-10500518/bin/lava-test-runner /lava-10500518/1 ... (12 line(s) more) platform | arch | lab | compiler | defconfig | regressions -----------------------------+--------+---------------+----------+------------------------------+------------ hp-x360-12b-c...4020-octopus | x86_64 | lab-collabora | gcc-10 | x86_64_defcon...6-chromebook | 1 Details:
https://kernelci.org/test/plan/id/6473e68725a05bce292e861d
Results: 6 PASS, 1 FAIL, 0 SKIP Full config: x86_64_defconfig+x86-chromebook Compiler: gcc-10 (gcc (Debian 10.2.1-6) 10.2.1 20210110) Plain log:
https://storage.kernelci.org//stable-rc/linux-6.1.y/v6.1.29-413-g8482df0ff7…
HTML log:
https://storage.kernelci.org//stable-rc/linux-6.1.y/v6.1.29-413-g8482df0ff7…
Rootfs:
http://storage.kernelci.org/images/rootfs/buildroot/buildroot-baseline/2023…
* baseline.bootrr.deferred-probe-empty:
https://kernelci.org/test/case/id/6473e68725a05bce292e8622
failing since 59 days (last pass: v6.1.21, first fail: v6.1.22) 2023-05-28T23:37:47.252150 + set +x 2023-05-28T23:37:47.258609 <8>[ 11.090362] <LAVA_SIGNAL_ENDRUN 0_dmesg 10500492_1.4.2.3.1> 2023-05-28T23:37:47.363141 / # # 2023-05-28T23:37:47.463697 export SHELL=/bin/sh 2023-05-28T23:37:47.463938 # 2023-05-28T23:37:47.564515 / # export SHELL=/bin/sh. /lava-10500492/environment 2023-05-28T23:37:47.564752 2023-05-28T23:37:47.665334 / # . /lava-10500492/environment/lava-10500492/bin/lava-test-runner /lava-10500492/1 2023-05-28T23:37:47.665722 2023-05-28T23:37:47.670602 / # /lava-10500492/bin/lava-test-runner /lava-10500492/1 ... (12 line(s) more) platform | arch | lab | compiler | defconfig | regressions -----------------------------+--------+---------------+----------+------------------------------+------------ hp-x360-14-G1-sona | x86_64 | lab-collabora | gcc-10 | x86_64_defcon...6-chromebook | 1 Details:
https://kernelci.org/test/plan/id/6473e5d0e0a21625912e8612
Results: 6 PASS, 1 FAIL, 0 SKIP Full config: x86_64_defconfig+x86-chromebook Compiler: gcc-10 (gcc (Debian 10.2.1-6) 10.2.1 20210110) Plain log:
https://storage.kernelci.org//stable-rc/linux-6.1.y/v6.1.29-413-g8482df0ff7…
HTML log:
https://storage.kernelci.org//stable-rc/linux-6.1.y/v6.1.29-413-g8482df0ff7…
Rootfs:
http://storage.kernelci.org/images/rootfs/buildroot/buildroot-baseline/2023…
* baseline.bootrr.deferred-probe-empty:
https://kernelci.org/test/case/id/6473e5d0e0a21625912e8617
failing since 59 days (last pass: v6.1.21, first fail: v6.1.22) 2023-05-28T23:37:40.158573 <8>[ 10.525475] <LAVA_SIGNAL_ENDRUN 0_dmesg 10500487_1.4.2.3.1> 2023-05-28T23:37:40.161724 + set +x 2023-05-28T23:37:40.262871 /# 2023-05-28T23:37:40.363824 # #export SHELL=/bin/sh 2023-05-28T23:37:40.364012 2023-05-28T23:37:40.464493 / # export SHELL=/bin/sh. /lava-10500487/environment 2023-05-28T23:37:40.464764 2023-05-28T23:37:40.565378 / # . /lava-10500487/environment/lava-10500487/bin/lava-test-runner /lava-10500487/1 2023-05-28T23:37:40.565822 2023-05-28T23:37:40.571164 / # /lava-10500487/bin/lava-test-runner /lava-10500487/1 ... (12 line(s) more) platform | arch | lab | compiler | defconfig | regressions -----------------------------+--------+---------------+----------+------------------------------+------------ hp-x360-14a-cb0001xx-zork | x86_64 | lab-collabora | gcc-10 | x86_64_defcon...6-chromebook | 1 Details:
https://kernelci.org/test/plan/id/6473e5e8f720d94df22e8625
Results: 6 PASS, 1 FAIL, 0 SKIP Full config: x86_64_defconfig+x86-chromebook Compiler: gcc-10 (gcc (Debian 10.2.1-6) 10.2.1 20210110) Plain log:
https://storage.kernelci.org//stable-rc/linux-6.1.y/v6.1.29-413-g8482df0ff7…
HTML log:
https://storage.kernelci.org//stable-rc/linux-6.1.y/v6.1.29-413-g8482df0ff7…
Rootfs:
http://storage.kernelci.org/images/rootfs/buildroot/buildroot-baseline/2023…
* baseline.bootrr.deferred-probe-empty:
https://kernelci.org/test/case/id/6473e5e8f720d94df22e862a
failing since 59 days (last pass: v6.1.21, first fail: v6.1.22) 2023-05-28T23:37:55.798673 + set<8>[ 10.920885] <LAVA_SIGNAL_ENDRUN 0_dmesg 10500484_1.4.2.3.1> 2023-05-28T23:37:55.798762 +x 2023-05-28T23:37:55.903792 / # # 2023-05-28T23:37:56.004402 export SHELL=/bin/sh 2023-05-28T23:37:56.004589 # 2023-05-28T23:37:56.105244 / # export SHELL=/bin/sh. /lava-10500484/environment 2023-05-28T23:37:56.105443 2023-05-28T23:37:56.206076 / # . /lava-10500484/environment/lava-10500484/bin/lava-test-runner /lava-10500484/1 2023-05-28T23:37:56.206363 2023-05-28T23:37:56.210954 / # /lava-10500484/bin/lava-test-runner /lava-10500484/1 ... (12 line(s) more) platform | arch | lab | compiler | defconfig | regressions -----------------------------+--------+---------------+----------+------------------------------+------------ lenovo-TPad-C13-Yoga-zork | x86_64 | lab-collabora | gcc-10 | x86_64_defcon...6-chromebook | 1 Details:
https://kernelci.org/test/plan/id/6473e68925a05bce292e8636
Results: 6 PASS, 1 FAIL, 0 SKIP Full config: x86_64_defconfig+x86-chromebook Compiler: gcc-10 (gcc (Debian 10.2.1-6) 10.2.1 20210110) Plain log:
https://storage.kernelci.org//stable-rc/linux-6.1.y/v6.1.29-413-g8482df0ff7…
HTML log:
https://storage.kernelci.org//stable-rc/linux-6.1.y/v6.1.29-413-g8482df0ff7…
Rootfs:
http://storage.kernelci.org/images/rootfs/buildroot/buildroot-baseline/2023…
* baseline.bootrr.deferred-probe-empty:
https://kernelci.org/test/case/id/6473e68925a05bce292e863b
failing since 59 days (last pass: v6.1.21, first fail: v6.1.22) 2023-05-28T23:37:46.919900 + set<8>[ 12.260528] <LAVA_SIGNAL_ENDRUN 0_dmesg 10500471_1.4.2.3.1> 2023-05-28T23:37:46.919983 +x 2023-05-28T23:37:47.024043 / # # 2023-05-28T23:37:47.124619 export SHELL=/bin/sh 2023-05-28T23:37:47.124768 # 2023-05-28T23:37:47.225254 / # export SHELL=/bin/sh. /lava-10500471/environment 2023-05-28T23:37:47.225421 2023-05-28T23:37:47.325938 / # . /lava-10500471/environment/lava-10500471/bin/lava-test-runner /lava-10500471/1 2023-05-28T23:37:47.326238 2023-05-28T23:37:47.330970 / # /lava-10500471/bin/lava-test-runner /lava-10500471/1 ... (12 line(s) more)
[View Less]
1 year, 9 months
1
0
0
0
stable-rc/linux-5.4.y baseline: 158 runs, 33 regressions (v5.4.243-162-g99ecfa2a4afc)
by kernelci.org bot
stable-rc/linux-5.4.y baseline: 158 runs, 33 regressions (v5.4.243-162-g99ecfa2a4afc) Regressions Summary ------------------- platform | arch | lab | compiler | defconfig | regressions -----------------------------+--------+---------------+----------+------------------------------+------------ beagle-xm | arm | lab-baylibre | gcc-10 | multi_v7_defconfig | 1 cubietruck | arm |
…
[View More]
lab-baylibre | gcc-10 | multi_v7_defconfig | 1 hifive-unleashed-a00 | riscv | lab-baylibre | gcc-10 | defconfig | 1 hp-x360-12b-c...4020-octopus | x86_64 | lab-collabora | gcc-10 | x86_64_defcon...6-chromebook | 1 hp-x360-14-G1-sona | x86_64 | lab-collabora | gcc-10 | x86_64_defcon...6-chromebook | 1 qemu_arm64-virt-gicv2 | arm64 | lab-baylibre | gcc-10 | defconfig+arm64-chromebook | 1 qemu_arm64-virt-gicv2 | arm64 | lab-baylibre | gcc-10 | defconfig | 1 qemu_arm64-virt-gicv2 | arm64 | lab-broonie | gcc-10 | defconfig+arm64-chromebook | 1 qemu_arm64-virt-gicv2 | arm64 | lab-broonie | gcc-10 | defconfig | 1 qemu_arm64-virt-gicv2 | arm64 | lab-collabora | gcc-10 | defconfig+arm64-chromebook | 1 qemu_arm64-virt-gicv2 | arm64 | lab-collabora | gcc-10 | defconfig | 1 qemu_arm64-virt-gicv2-uefi | arm64 | lab-baylibre | gcc-10 | defconfig+arm64-chromebook | 1 qemu_arm64-virt-gicv2-uefi | arm64 | lab-baylibre | gcc-10 | defconfig | 1 qemu_arm64-virt-gicv2-uefi | arm64 | lab-broonie | gcc-10 | defconfig+arm64-chromebook | 1 qemu_arm64-virt-gicv2-uefi | arm64 | lab-broonie | gcc-10 | defconfig | 1 qemu_arm64-virt-gicv2-uefi | arm64 | lab-collabora | gcc-10 | defconfig+arm64-chromebook | 1 qemu_arm64-virt-gicv2-uefi | arm64 | lab-collabora | gcc-10 | defconfig | 1 qemu_arm64-virt-gicv3 | arm64 | lab-baylibre | gcc-10 | defconfig+arm64-chromebook | 1 qemu_arm64-virt-gicv3 | arm64 | lab-baylibre | gcc-10 | defconfig | 1 qemu_arm64-virt-gicv3 | arm64 | lab-broonie | gcc-10 | defconfig+arm64-chromebook | 1 qemu_arm64-virt-gicv3 | arm64 | lab-broonie | gcc-10 | defconfig | 1 qemu_arm64-virt-gicv3 | arm64 | lab-collabora | gcc-10 | defconfig+arm64-chromebook | 1 qemu_arm64-virt-gicv3 | arm64 | lab-collabora | gcc-10 | defconfig | 1 qemu_arm64-virt-gicv3-uefi | arm64 | lab-baylibre | gcc-10 | defconfig+arm64-chromebook | 1 qemu_arm64-virt-gicv3-uefi | arm64 | lab-baylibre | gcc-10 | defconfig | 1 qemu_arm64-virt-gicv3-uefi | arm64 | lab-broonie | gcc-10 | defconfig+arm64-chromebook | 1 qemu_arm64-virt-gicv3-uefi | arm64 | lab-broonie | gcc-10 | defconfig | 1 qemu_arm64-virt-gicv3-uefi | arm64 | lab-collabora | gcc-10 | defconfig+arm64-chromebook | 1 qemu_arm64-virt-gicv3-uefi | arm64 | lab-collabora | gcc-10 | defconfig | 1 rk3399-gru-kevin | arm64 | lab-collabora | gcc-10 | defconfig+arm64-chromebook | 2 sun8i-h3-libretech-all-h3-cc | arm | lab-baylibre | gcc-10 | multi_v7_defconfig | 1 sun8i-h3-libretech-all-h3-cc | arm | lab-baylibre | gcc-10 | sunxi_defconfig | 1 Details:
https://kernelci.org/test/job/stable-rc/branch/linux-5.4.y/kernel/v5.4.243-…
Test: baseline Tree: stable-rc Branch: linux-5.4.y Describe: v5.4.243-162-g99ecfa2a4afc URL:
https://git.kernel.org/pub/scm/linux/kernel/git/stable/linux-stable-rc.git
SHA: 99ecfa2a4afcb3256e9102eb5cc0525d97aec466 Test Regressions ---------------- platform | arch | lab | compiler | defconfig | regressions -----------------------------+--------+---------------+----------+------------------------------+------------ beagle-xm | arm | lab-baylibre | gcc-10 | multi_v7_defconfig | 1 Details:
https://kernelci.org/test/plan/id/6473d9b4c6531c77282e866e
Results: 5 PASS, 1 FAIL, 1 SKIP Full config: multi_v7_defconfig Compiler: gcc-10 (arm-linux-gnueabihf-gcc (Debian 10.2.1-6) 10.2.1 20210110) Plain log:
https://storage.kernelci.org//stable-rc/linux-5.4.y/v5.4.243-162-g99ecfa2a4…
HTML log:
https://storage.kernelci.org//stable-rc/linux-5.4.y/v5.4.243-162-g99ecfa2a4…
Rootfs:
http://storage.kernelci.org/images/rootfs/buildroot/buildroot-baseline/2023…
* baseline.bootrr.deferred-probe-empty:
https://kernelci.org/test/case/id/6473d9b4c6531c77282e8673
failing since 131 days (last pass: v5.4.226, first fail: v5.4.228-659-gb3b34c474ec7) 2023-05-28T22:45:55.002701 <8>[ 23.669708] <LAVA_SIGNAL_ENDRUN 0_dmesg 3628464_1.5.2.4.1> 2023-05-28T22:45:55.113246 / # # 2023-05-28T22:45:55.217040 export SHELL=/bin/sh 2023-05-28T22:45:55.218364 # 2023-05-28T22:45:55.321613 / # export SHELL=/bin/sh. /lava-3628464/environment 2023-05-28T22:45:55.322991 2023-05-28T22:45:55.425601 / # . /lava-3628464/environment/lava-3628464/bin/lava-test-runner /lava-3628464/1 2023-05-28T22:45:55.427217 2023-05-28T22:45:55.432126 / # /lava-3628464/bin/lava-test-runner /lava-3628464/1 2023-05-28T22:45:55.522814 + export 'TESTRUN_ID=1_bootrr' ... (11 line(s) more) platform | arch | lab | compiler | defconfig | regressions -----------------------------+--------+---------------+----------+------------------------------+------------ cubietruck | arm | lab-baylibre | gcc-10 | multi_v7_defconfig | 1 Details:
https://kernelci.org/test/plan/id/6473d9b2c6531c77282e8638
Results: 5 PASS, 1 FAIL, 1 SKIP Full config: multi_v7_defconfig Compiler: gcc-10 (arm-linux-gnueabihf-gcc (Debian 10.2.1-6) 10.2.1 20210110) Plain log:
https://storage.kernelci.org//stable-rc/linux-5.4.y/v5.4.243-162-g99ecfa2a4…
HTML log:
https://storage.kernelci.org//stable-rc/linux-5.4.y/v5.4.243-162-g99ecfa2a4…
Rootfs:
http://storage.kernelci.org/images/rootfs/buildroot/buildroot-baseline/2023…
* baseline.bootrr.deferred-probe-empty:
https://kernelci.org/test/case/id/6473d9b2c6531c77282e863d
failing since 131 days (last pass: v5.4.226-68-g8c05f5e0777d, first fail: v5.4.228-659-gb3b34c474ec7) 2023-05-28T22:45:57.476169 <8>[ 9.850069] <LAVA_SIGNAL_ENDRUN 0_dmesg 3628458_1.5.2.4.1> 2023-05-28T22:45:57.583060 / # # 2023-05-28T22:45:57.685346 export SHELL=/bin/sh 2023-05-28T22:45:57.685717 # 2023-05-28T22:45:57.787226 / # export SHELL=/bin/sh. /lava-3628458/environment 2023-05-28T22:45:57.787969 2023-05-28T22:45:57.890027 / # . /lava-3628458/environment/lava-3628458/bin/lava-test-runner /lava-3628458/1 2023-05-28T22:45:57.891627 2023-05-28T22:45:57.896746 / # /lava-3628458/bin/lava-test-runner /lava-3628458/1 2023-05-28T22:45:57.983859 + export 'TESTRUN_ID=1_bootrr' ... (11 line(s) more) platform | arch | lab | compiler | defconfig | regressions -----------------------------+--------+---------------+----------+------------------------------+------------ hifive-unleashed-a00 | riscv | lab-baylibre | gcc-10 | defconfig | 1 Details:
https://kernelci.org/test/plan/id/6473d8b81dfb2218e52e85f2
Results: 3 PASS, 2 FAIL, 2 SKIP Full config: defconfig Compiler: gcc-10 (riscv64-linux-gnu-gcc (Debian 10.2.1-6) 10.2.1 20210110) Plain log:
https://storage.kernelci.org//stable-rc/linux-5.4.y/v5.4.243-162-g99ecfa2a4…
HTML log:
https://storage.kernelci.org//stable-rc/linux-5.4.y/v5.4.243-162-g99ecfa2a4…
Rootfs:
http://storage.kernelci.org/images/rootfs/buildroot/buildroot-baseline/2023…
* baseline.dmesg.crit:
https://kernelci.org/test/case/id/6473d8b81dfb2218e52e85fb
failing since 221 days (last pass: v5.4.219, first fail: v5.4.219-267-g4a976f825745) 3 lines 2023-05-28T22:41:38.900446 / # 2023-05-28T22:41:38.901091 2023-05-28T22:41:40.963929 / # # 2023-05-28T22:41:40.964882 # 2023-05-28T22:41:42.974202 / # export SHELL=/bin/sh 2023-05-28T22:41:42.977075 export SHELL=/bin/sh 2023-05-28T22:41:44.990076 / # . /lava-3628434/environment 2023-05-28T22:41:44.990524 . /lava-3628434/environment 2023-05-28T22:41:47.005201 / # /lava-3628434/bin/lava-test-runner /lava-3628434/0 2023-05-28T22:41:47.006844 /lava-3628434/bin/lava-test-runner /lava-3628434/0 ... (10 line(s) more) platform | arch | lab | compiler | defconfig | regressions -----------------------------+--------+---------------+----------+------------------------------+------------ hp-x360-12b-c...4020-octopus | x86_64 | lab-collabora | gcc-10 | x86_64_defcon...6-chromebook | 1 Details:
https://kernelci.org/test/plan/id/6473da0735d250e3c12e85ec
Results: 5 PASS, 1 FAIL, 1 SKIP Full config: x86_64_defconfig+x86-chromebook Compiler: gcc-10 (gcc (Debian 10.2.1-6) 10.2.1 20210110) Plain log:
https://storage.kernelci.org//stable-rc/linux-5.4.y/v5.4.243-162-g99ecfa2a4…
HTML log:
https://storage.kernelci.org//stable-rc/linux-5.4.y/v5.4.243-162-g99ecfa2a4…
Rootfs:
http://storage.kernelci.org/images/rootfs/buildroot/buildroot-baseline/2023…
* baseline.bootrr.deferred-probe-empty:
https://kernelci.org/test/case/id/6473da0735d250e3c12e85f1
failing since 59 days (last pass: v5.4.238, first fail: v5.4.238) 2023-05-28T22:47:17.921449 + set<8>[ 10.829731] <LAVA_SIGNAL_ENDRUN 0_dmesg 10500027_1.4.2.3.1> 2023-05-28T22:47:17.921549 +x 2023-05-28T22:47:18.023272 2023-05-28T22:47:18.123846 / # #export SHELL=/bin/sh 2023-05-28T22:47:18.123992 2023-05-28T22:47:18.224534 / # export SHELL=/bin/sh. /lava-10500027/environment 2023-05-28T22:47:18.224796 2023-05-28T22:47:18.325383 / # . /lava-10500027/environment/lava-10500027/bin/lava-test-runner /lava-10500027/1 2023-05-28T22:47:18.325752 2023-05-28T22:47:18.330539 / # /lava-10500027/bin/lava-test-runner /lava-10500027/1 ... (12 line(s) more) platform | arch | lab | compiler | defconfig | regressions -----------------------------+--------+---------------+----------+------------------------------+------------ hp-x360-14-G1-sona | x86_64 | lab-collabora | gcc-10 | x86_64_defcon...6-chromebook | 1 Details:
https://kernelci.org/test/plan/id/6473d99d16f0b9a9d52e85e7
Results: 5 PASS, 1 FAIL, 1 SKIP Full config: x86_64_defconfig+x86-chromebook Compiler: gcc-10 (gcc (Debian 10.2.1-6) 10.2.1 20210110) Plain log:
https://storage.kernelci.org//stable-rc/linux-5.4.y/v5.4.243-162-g99ecfa2a4…
HTML log:
https://storage.kernelci.org//stable-rc/linux-5.4.y/v5.4.243-162-g99ecfa2a4…
Rootfs:
http://storage.kernelci.org/images/rootfs/buildroot/buildroot-baseline/2023…
* baseline.bootrr.deferred-probe-empty:
https://kernelci.org/test/case/id/6473d99d16f0b9a9d52e85ec
failing since 59 days (last pass: v5.4.238, first fail: v5.4.238) 2023-05-28T22:45:34.836379 + set +x 2023-05-28T22:45:34.842912 <8>[ 12.868806] <LAVA_SIGNAL_ENDRUN 0_dmesg 10499981_1.4.2.3.1> 2023-05-28T22:45:34.947124 / # # 2023-05-28T22:45:35.047748 export SHELL=/bin/sh 2023-05-28T22:45:35.047903 # 2023-05-28T22:45:35.148390 / # export SHELL=/bin/sh. /lava-10499981/environment 2023-05-28T22:45:35.148570 2023-05-28T22:45:35.249073 / # . /lava-10499981/environment/lava-10499981/bin/lava-test-runner /lava-10499981/1 2023-05-28T22:45:35.249304 2023-05-28T22:45:35.254788 / # /lava-10499981/bin/lava-test-runner /lava-10499981/1 ... (12 line(s) more) platform | arch | lab | compiler | defconfig | regressions -----------------------------+--------+---------------+----------+------------------------------+------------ qemu_arm64-virt-gicv2 | arm64 | lab-baylibre | gcc-10 | defconfig+arm64-chromebook | 1 Details:
https://kernelci.org/test/plan/id/6473db21458315ebbe2e8686
Results: 0 PASS, 1 FAIL, 0 SKIP Full config: defconfig+arm64-chromebook Compiler: gcc-10 (aarch64-linux-gnu-gcc (Debian 10.2.1-6) 10.2.1 20210110) Plain log:
https://storage.kernelci.org//stable-rc/linux-5.4.y/v5.4.243-162-g99ecfa2a4…
HTML log:
https://storage.kernelci.org//stable-rc/linux-5.4.y/v5.4.243-162-g99ecfa2a4…
Rootfs:
http://storage.kernelci.org/images/rootfs/buildroot/buildroot-baseline/2023…
* baseline.login:
https://kernelci.org/test/case/id/6473db21458315ebbe2e8687
failing since 298 days (last pass: v5.4.180-59-g4f62141869c8, first fail: v5.4.209) platform | arch | lab | compiler | defconfig | regressions -----------------------------+--------+---------------+----------+------------------------------+------------ qemu_arm64-virt-gicv2 | arm64 | lab-baylibre | gcc-10 | defconfig | 1 Details:
https://kernelci.org/test/plan/id/6473dcaf8d6b8fcefb2e85f7
Results: 0 PASS, 1 FAIL, 0 SKIP Full config: defconfig Compiler: gcc-10 (aarch64-linux-gnu-gcc (Debian 10.2.1-6) 10.2.1 20210110) Plain log:
https://storage.kernelci.org//stable-rc/linux-5.4.y/v5.4.243-162-g99ecfa2a4…
HTML log:
https://storage.kernelci.org//stable-rc/linux-5.4.y/v5.4.243-162-g99ecfa2a4…
Rootfs:
http://storage.kernelci.org/images/rootfs/buildroot/buildroot-baseline/2023…
* baseline.login:
https://kernelci.org/test/case/id/6473dcaf8d6b8fcefb2e85f8
failing since 278 days (last pass: v5.4.180-59-g4f62141869c8, first fail: v5.4.210-390-g1cece69eaa88) platform | arch | lab | compiler | defconfig | regressions -----------------------------+--------+---------------+----------+------------------------------+------------ qemu_arm64-virt-gicv2 | arm64 | lab-broonie | gcc-10 | defconfig+arm64-chromebook | 1 Details:
https://kernelci.org/test/plan/id/6473db42d363729d592e85ec
Results: 0 PASS, 1 FAIL, 0 SKIP Full config: defconfig+arm64-chromebook Compiler: gcc-10 (aarch64-linux-gnu-gcc (Debian 10.2.1-6) 10.2.1 20210110) Plain log:
https://storage.kernelci.org//stable-rc/linux-5.4.y/v5.4.243-162-g99ecfa2a4…
HTML log:
https://storage.kernelci.org//stable-rc/linux-5.4.y/v5.4.243-162-g99ecfa2a4…
Rootfs:
http://storage.kernelci.org/images/rootfs/buildroot/buildroot-baseline/2023…
* baseline.login:
https://kernelci.org/test/case/id/6473db42d363729d592e85ed
failing since 298 days (last pass: v5.4.180-59-g4f62141869c8, first fail: v5.4.209) platform | arch | lab | compiler | defconfig | regressions -----------------------------+--------+---------------+----------+------------------------------+------------ qemu_arm64-virt-gicv2 | arm64 | lab-broonie | gcc-10 | defconfig | 1 Details:
https://kernelci.org/test/plan/id/6473dde967fd8217f12e8617
Results: 0 PASS, 1 FAIL, 0 SKIP Full config: defconfig Compiler: gcc-10 (aarch64-linux-gnu-gcc (Debian 10.2.1-6) 10.2.1 20210110) Plain log:
https://storage.kernelci.org//stable-rc/linux-5.4.y/v5.4.243-162-g99ecfa2a4…
HTML log:
https://storage.kernelci.org//stable-rc/linux-5.4.y/v5.4.243-162-g99ecfa2a4…
Rootfs:
http://storage.kernelci.org/images/rootfs/buildroot/buildroot-baseline/2023…
* baseline.login:
https://kernelci.org/test/case/id/6473dde967fd8217f12e8618
failing since 278 days (last pass: v5.4.180-59-g4f62141869c8, first fail: v5.4.210-390-g1cece69eaa88) platform | arch | lab | compiler | defconfig | regressions -----------------------------+--------+---------------+----------+------------------------------+------------ qemu_arm64-virt-gicv2 | arm64 | lab-collabora | gcc-10 | defconfig+arm64-chromebook | 1 Details:
https://kernelci.org/test/plan/id/6473db0ac5288c66822e85eb
Results: 0 PASS, 1 FAIL, 0 SKIP Full config: defconfig+arm64-chromebook Compiler: gcc-10 (aarch64-linux-gnu-gcc (Debian 10.2.1-6) 10.2.1 20210110) Plain log:
https://storage.kernelci.org//stable-rc/linux-5.4.y/v5.4.243-162-g99ecfa2a4…
HTML log:
https://storage.kernelci.org//stable-rc/linux-5.4.y/v5.4.243-162-g99ecfa2a4…
Rootfs:
http://storage.kernelci.org/images/rootfs/buildroot/buildroot-baseline/2023…
* baseline.login:
https://kernelci.org/test/case/id/6473db0ac5288c66822e85ec
failing since 298 days (last pass: v5.4.180-59-g4f62141869c8, first fail: v5.4.209) platform | arch | lab | compiler | defconfig | regressions -----------------------------+--------+---------------+----------+------------------------------+------------ qemu_arm64-virt-gicv2 | arm64 | lab-collabora | gcc-10 | defconfig | 1 Details:
https://kernelci.org/test/plan/id/6473dc8e34c0a60e312e85ed
Results: 0 PASS, 1 FAIL, 0 SKIP Full config: defconfig Compiler: gcc-10 (aarch64-linux-gnu-gcc (Debian 10.2.1-6) 10.2.1 20210110) Plain log:
https://storage.kernelci.org//stable-rc/linux-5.4.y/v5.4.243-162-g99ecfa2a4…
HTML log:
https://storage.kernelci.org//stable-rc/linux-5.4.y/v5.4.243-162-g99ecfa2a4…
Rootfs:
http://storage.kernelci.org/images/rootfs/buildroot/buildroot-baseline/2023…
* baseline.login:
https://kernelci.org/test/case/id/6473dc8e34c0a60e312e85ee
failing since 278 days (last pass: v5.4.180-59-g4f62141869c8, first fail: v5.4.210-390-g1cece69eaa88) platform | arch | lab | compiler | defconfig | regressions -----------------------------+--------+---------------+----------+------------------------------+------------ qemu_arm64-virt-gicv2-uefi | arm64 | lab-baylibre | gcc-10 | defconfig+arm64-chromebook | 1 Details:
https://kernelci.org/test/plan/id/6473db20458315ebbe2e8683
Results: 0 PASS, 1 FAIL, 0 SKIP Full config: defconfig+arm64-chromebook Compiler: gcc-10 (aarch64-linux-gnu-gcc (Debian 10.2.1-6) 10.2.1 20210110) Plain log:
https://storage.kernelci.org//stable-rc/linux-5.4.y/v5.4.243-162-g99ecfa2a4…
HTML log:
https://storage.kernelci.org//stable-rc/linux-5.4.y/v5.4.243-162-g99ecfa2a4…
Rootfs:
http://storage.kernelci.org/images/rootfs/buildroot/buildroot-baseline/2023…
* baseline.login:
https://kernelci.org/test/case/id/6473db20458315ebbe2e8684
failing since 300 days (last pass: v5.4.180-59-g4f62141869c8, first fail: v5.4.207-123-gb48a8f43dce6) platform | arch | lab | compiler | defconfig | regressions -----------------------------+--------+---------------+----------+------------------------------+------------ qemu_arm64-virt-gicv2-uefi | arm64 | lab-baylibre | gcc-10 | defconfig | 1 Details:
https://kernelci.org/test/plan/id/6473dcb0c10ec28c732e8602
Results: 0 PASS, 1 FAIL, 0 SKIP Full config: defconfig Compiler: gcc-10 (aarch64-linux-gnu-gcc (Debian 10.2.1-6) 10.2.1 20210110) Plain log:
https://storage.kernelci.org//stable-rc/linux-5.4.y/v5.4.243-162-g99ecfa2a4…
HTML log:
https://storage.kernelci.org//stable-rc/linux-5.4.y/v5.4.243-162-g99ecfa2a4…
Rootfs:
http://storage.kernelci.org/images/rootfs/buildroot/buildroot-baseline/2023…
* baseline.login:
https://kernelci.org/test/case/id/6473dcb0c10ec28c732e8603
failing since 300 days (last pass: v5.4.180-59-g4f62141869c8, first fail: v5.4.207-123-gb48a8f43dce6) platform | arch | lab | compiler | defconfig | regressions -----------------------------+--------+---------------+----------+------------------------------+------------ qemu_arm64-virt-gicv2-uefi | arm64 | lab-broonie | gcc-10 | defconfig+arm64-chromebook | 1 Details:
https://kernelci.org/test/plan/id/6473db2f7a20ab7b322e85f6
Results: 0 PASS, 1 FAIL, 0 SKIP Full config: defconfig+arm64-chromebook Compiler: gcc-10 (aarch64-linux-gnu-gcc (Debian 10.2.1-6) 10.2.1 20210110) Plain log:
https://storage.kernelci.org//stable-rc/linux-5.4.y/v5.4.243-162-g99ecfa2a4…
HTML log:
https://storage.kernelci.org//stable-rc/linux-5.4.y/v5.4.243-162-g99ecfa2a4…
Rootfs:
http://storage.kernelci.org/images/rootfs/buildroot/buildroot-baseline/2023…
* baseline.login:
https://kernelci.org/test/case/id/6473db2f7a20ab7b322e85f7
failing since 300 days (last pass: v5.4.180-59-g4f62141869c8, first fail: v5.4.207-123-gb48a8f43dce6) platform | arch | lab | compiler | defconfig | regressions -----------------------------+--------+---------------+----------+------------------------------+------------ qemu_arm64-virt-gicv2-uefi | arm64 | lab-broonie | gcc-10 | defconfig | 1 Details:
https://kernelci.org/test/plan/id/6473ddfeee9634a96b2e8638
Results: 0 PASS, 1 FAIL, 0 SKIP Full config: defconfig Compiler: gcc-10 (aarch64-linux-gnu-gcc (Debian 10.2.1-6) 10.2.1 20210110) Plain log:
https://storage.kernelci.org//stable-rc/linux-5.4.y/v5.4.243-162-g99ecfa2a4…
HTML log:
https://storage.kernelci.org//stable-rc/linux-5.4.y/v5.4.243-162-g99ecfa2a4…
Rootfs:
http://storage.kernelci.org/images/rootfs/buildroot/buildroot-baseline/2023…
* baseline.login:
https://kernelci.org/test/case/id/6473ddfeee9634a96b2e8639
failing since 300 days (last pass: v5.4.180-59-g4f62141869c8, first fail: v5.4.207-123-gb48a8f43dce6) platform | arch | lab | compiler | defconfig | regressions -----------------------------+--------+---------------+----------+------------------------------+------------ qemu_arm64-virt-gicv2-uefi | arm64 | lab-collabora | gcc-10 | defconfig+arm64-chromebook | 1 Details:
https://kernelci.org/test/plan/id/6473db09c5288c66822e85e6
Results: 0 PASS, 1 FAIL, 0 SKIP Full config: defconfig+arm64-chromebook Compiler: gcc-10 (aarch64-linux-gnu-gcc (Debian 10.2.1-6) 10.2.1 20210110) Plain log:
https://storage.kernelci.org//stable-rc/linux-5.4.y/v5.4.243-162-g99ecfa2a4…
HTML log:
https://storage.kernelci.org//stable-rc/linux-5.4.y/v5.4.243-162-g99ecfa2a4…
Rootfs:
http://storage.kernelci.org/images/rootfs/buildroot/buildroot-baseline/2023…
* baseline.login:
https://kernelci.org/test/case/id/6473db09c5288c66822e85e7
failing since 300 days (last pass: v5.4.180-59-g4f62141869c8, first fail: v5.4.207-123-gb48a8f43dce6) platform | arch | lab | compiler | defconfig | regressions -----------------------------+--------+---------------+----------+------------------------------+------------ qemu_arm64-virt-gicv2-uefi | arm64 | lab-collabora | gcc-10 | defconfig | 1 Details:
https://kernelci.org/test/plan/id/6473dc8f34c0a60e312e85f2
Results: 0 PASS, 1 FAIL, 0 SKIP Full config: defconfig Compiler: gcc-10 (aarch64-linux-gnu-gcc (Debian 10.2.1-6) 10.2.1 20210110) Plain log:
https://storage.kernelci.org//stable-rc/linux-5.4.y/v5.4.243-162-g99ecfa2a4…
HTML log:
https://storage.kernelci.org//stable-rc/linux-5.4.y/v5.4.243-162-g99ecfa2a4…
Rootfs:
http://storage.kernelci.org/images/rootfs/buildroot/buildroot-baseline/2023…
* baseline.login:
https://kernelci.org/test/case/id/6473dc8f34c0a60e312e85f3
failing since 300 days (last pass: v5.4.180-59-g4f62141869c8, first fail: v5.4.207-123-gb48a8f43dce6) platform | arch | lab | compiler | defconfig | regressions -----------------------------+--------+---------------+----------+------------------------------+------------ qemu_arm64-virt-gicv3 | arm64 | lab-baylibre | gcc-10 | defconfig+arm64-chromebook | 1 Details:
https://kernelci.org/test/plan/id/6473db1e458315ebbe2e867d
Results: 0 PASS, 1 FAIL, 0 SKIP Full config: defconfig+arm64-chromebook Compiler: gcc-10 (aarch64-linux-gnu-gcc (Debian 10.2.1-6) 10.2.1 20210110) Plain log:
https://storage.kernelci.org//stable-rc/linux-5.4.y/v5.4.243-162-g99ecfa2a4…
HTML log:
https://storage.kernelci.org//stable-rc/linux-5.4.y/v5.4.243-162-g99ecfa2a4…
Rootfs:
http://storage.kernelci.org/images/rootfs/buildroot/buildroot-baseline/2023…
* baseline.login:
https://kernelci.org/test/case/id/6473db1e458315ebbe2e867e
failing since 298 days (last pass: v5.4.180-59-g4f62141869c8, first fail: v5.4.209) platform | arch | lab | compiler | defconfig | regressions -----------------------------+--------+---------------+----------+------------------------------+------------ qemu_arm64-virt-gicv3 | arm64 | lab-baylibre | gcc-10 | defconfig | 1 Details:
https://kernelci.org/test/plan/id/6473dcb18d6b8fcefb2e85fd
Results: 0 PASS, 1 FAIL, 0 SKIP Full config: defconfig Compiler: gcc-10 (aarch64-linux-gnu-gcc (Debian 10.2.1-6) 10.2.1 20210110) Plain log:
https://storage.kernelci.org//stable-rc/linux-5.4.y/v5.4.243-162-g99ecfa2a4…
HTML log:
https://storage.kernelci.org//stable-rc/linux-5.4.y/v5.4.243-162-g99ecfa2a4…
Rootfs:
http://storage.kernelci.org/images/rootfs/buildroot/buildroot-baseline/2023…
* baseline.login:
https://kernelci.org/test/case/id/6473dcb18d6b8fcefb2e85fe
failing since 384 days (last pass: v5.4.191-85-ga4a4cbb41380, first fail: v5.4.191-118-g7dae5fe9ddc0) platform | arch | lab | compiler | defconfig | regressions -----------------------------+--------+---------------+----------+------------------------------+------------ qemu_arm64-virt-gicv3 | arm64 | lab-broonie | gcc-10 | defconfig+arm64-chromebook | 1 Details:
https://kernelci.org/test/plan/id/6473db19458315ebbe2e866c
Results: 0 PASS, 1 FAIL, 0 SKIP Full config: defconfig+arm64-chromebook Compiler: gcc-10 (aarch64-linux-gnu-gcc (Debian 10.2.1-6) 10.2.1 20210110) Plain log:
https://storage.kernelci.org//stable-rc/linux-5.4.y/v5.4.243-162-g99ecfa2a4…
HTML log:
https://storage.kernelci.org//stable-rc/linux-5.4.y/v5.4.243-162-g99ecfa2a4…
Rootfs:
http://storage.kernelci.org/images/rootfs/buildroot/buildroot-baseline/2023…
* baseline.login:
https://kernelci.org/test/case/id/6473db19458315ebbe2e866d
failing since 298 days (last pass: v5.4.180-59-g4f62141869c8, first fail: v5.4.209) platform | arch | lab | compiler | defconfig | regressions -----------------------------+--------+---------------+----------+------------------------------+------------ qemu_arm64-virt-gicv3 | arm64 | lab-broonie | gcc-10 | defconfig | 1 Details:
https://kernelci.org/test/plan/id/6473ddff869ffa77b92e85eb
Results: 0 PASS, 1 FAIL, 0 SKIP Full config: defconfig Compiler: gcc-10 (aarch64-linux-gnu-gcc (Debian 10.2.1-6) 10.2.1 20210110) Plain log:
https://storage.kernelci.org//stable-rc/linux-5.4.y/v5.4.243-162-g99ecfa2a4…
HTML log:
https://storage.kernelci.org//stable-rc/linux-5.4.y/v5.4.243-162-g99ecfa2a4…
Rootfs:
http://storage.kernelci.org/images/rootfs/buildroot/buildroot-baseline/2023…
* baseline.login:
https://kernelci.org/test/case/id/6473ddff869ffa77b92e85ec
failing since 384 days (last pass: v5.4.191-85-ga4a4cbb41380, first fail: v5.4.191-118-g7dae5fe9ddc0) platform | arch | lab | compiler | defconfig | regressions -----------------------------+--------+---------------+----------+------------------------------+------------ qemu_arm64-virt-gicv3 | arm64 | lab-collabora | gcc-10 | defconfig+arm64-chromebook | 1 Details:
https://kernelci.org/test/plan/id/6473db11458315ebbe2e8663
Results: 0 PASS, 1 FAIL, 0 SKIP Full config: defconfig+arm64-chromebook Compiler: gcc-10 (aarch64-linux-gnu-gcc (Debian 10.2.1-6) 10.2.1 20210110) Plain log:
https://storage.kernelci.org//stable-rc/linux-5.4.y/v5.4.243-162-g99ecfa2a4…
HTML log:
https://storage.kernelci.org//stable-rc/linux-5.4.y/v5.4.243-162-g99ecfa2a4…
Rootfs:
http://storage.kernelci.org/images/rootfs/buildroot/buildroot-baseline/2023…
* baseline.login:
https://kernelci.org/test/case/id/6473db11458315ebbe2e8664
failing since 298 days (last pass: v5.4.180-59-g4f62141869c8, first fail: v5.4.209) platform | arch | lab | compiler | defconfig | regressions -----------------------------+--------+---------------+----------+------------------------------+------------ qemu_arm64-virt-gicv3 | arm64 | lab-collabora | gcc-10 | defconfig | 1 Details:
https://kernelci.org/test/plan/id/6473dd2ee03dc382872e85e6
Results: 0 PASS, 1 FAIL, 0 SKIP Full config: defconfig Compiler: gcc-10 (aarch64-linux-gnu-gcc (Debian 10.2.1-6) 10.2.1 20210110) Plain log:
https://storage.kernelci.org//stable-rc/linux-5.4.y/v5.4.243-162-g99ecfa2a4…
HTML log:
https://storage.kernelci.org//stable-rc/linux-5.4.y/v5.4.243-162-g99ecfa2a4…
Rootfs:
http://storage.kernelci.org/images/rootfs/buildroot/buildroot-baseline/2023…
* baseline.login:
https://kernelci.org/test/case/id/6473dd2ee03dc382872e85e7
failing since 384 days (last pass: v5.4.191-85-ga4a4cbb41380, first fail: v5.4.191-118-g7dae5fe9ddc0) platform | arch | lab | compiler | defconfig | regressions -----------------------------+--------+---------------+----------+------------------------------+------------ qemu_arm64-virt-gicv3-uefi | arm64 | lab-baylibre | gcc-10 | defconfig+arm64-chromebook | 1 Details:
https://kernelci.org/test/plan/id/6473db1f458315ebbe2e8680
Results: 0 PASS, 1 FAIL, 0 SKIP Full config: defconfig+arm64-chromebook Compiler: gcc-10 (aarch64-linux-gnu-gcc (Debian 10.2.1-6) 10.2.1 20210110) Plain log:
https://storage.kernelci.org//stable-rc/linux-5.4.y/v5.4.243-162-g99ecfa2a4…
HTML log:
https://storage.kernelci.org//stable-rc/linux-5.4.y/v5.4.243-162-g99ecfa2a4…
Rootfs:
http://storage.kernelci.org/images/rootfs/buildroot/buildroot-baseline/2023…
* baseline.login:
https://kernelci.org/test/case/id/6473db1f458315ebbe2e8681
failing since 286 days (last pass: v5.4.180-59-g4f62141869c8, first fail: v5.4.210-258-ge86027f8111f5) platform | arch | lab | compiler | defconfig | regressions -----------------------------+--------+---------------+----------+------------------------------+------------ qemu_arm64-virt-gicv3-uefi | arm64 | lab-baylibre | gcc-10 | defconfig | 1 Details:
https://kernelci.org/test/plan/id/6473dcae34c0a60e312e85fe
Results: 0 PASS, 1 FAIL, 0 SKIP Full config: defconfig Compiler: gcc-10 (aarch64-linux-gnu-gcc (Debian 10.2.1-6) 10.2.1 20210110) Plain log:
https://storage.kernelci.org//stable-rc/linux-5.4.y/v5.4.243-162-g99ecfa2a4…
HTML log:
https://storage.kernelci.org//stable-rc/linux-5.4.y/v5.4.243-162-g99ecfa2a4…
Rootfs:
http://storage.kernelci.org/images/rootfs/buildroot/buildroot-baseline/2023…
* baseline.login:
https://kernelci.org/test/case/id/6473dcae34c0a60e312e85ff
failing since 278 days (last pass: v5.4.180-59-g4f62141869c8, first fail: v5.4.210-390-g1cece69eaa88) platform | arch | lab | compiler | defconfig | regressions -----------------------------+--------+---------------+----------+------------------------------+------------ qemu_arm64-virt-gicv3-uefi | arm64 | lab-broonie | gcc-10 | defconfig+arm64-chromebook | 1 Details:
https://kernelci.org/test/plan/id/6473db2dd075ba7a0f2e8620
Results: 0 PASS, 1 FAIL, 0 SKIP Full config: defconfig+arm64-chromebook Compiler: gcc-10 (aarch64-linux-gnu-gcc (Debian 10.2.1-6) 10.2.1 20210110) Plain log:
https://storage.kernelci.org//stable-rc/linux-5.4.y/v5.4.243-162-g99ecfa2a4…
HTML log:
https://storage.kernelci.org//stable-rc/linux-5.4.y/v5.4.243-162-g99ecfa2a4…
Rootfs:
http://storage.kernelci.org/images/rootfs/buildroot/buildroot-baseline/2023…
* baseline.login:
https://kernelci.org/test/case/id/6473db2dd075ba7a0f2e8621
failing since 286 days (last pass: v5.4.180-59-g4f62141869c8, first fail: v5.4.210-258-ge86027f8111f5) platform | arch | lab | compiler | defconfig | regressions -----------------------------+--------+---------------+----------+------------------------------+------------ qemu_arm64-virt-gicv3-uefi | arm64 | lab-broonie | gcc-10 | defconfig | 1 Details:
https://kernelci.org/test/plan/id/6473dcaaf61d3574232e861f
Results: 0 PASS, 1 FAIL, 0 SKIP Full config: defconfig Compiler: gcc-10 (aarch64-linux-gnu-gcc (Debian 10.2.1-6) 10.2.1 20210110) Plain log:
https://storage.kernelci.org//stable-rc/linux-5.4.y/v5.4.243-162-g99ecfa2a4…
HTML log:
https://storage.kernelci.org//stable-rc/linux-5.4.y/v5.4.243-162-g99ecfa2a4…
Rootfs:
http://storage.kernelci.org/images/rootfs/buildroot/buildroot-baseline/2023…
* baseline.login:
https://kernelci.org/test/case/id/6473dcaaf61d3574232e8620
failing since 278 days (last pass: v5.4.180-59-g4f62141869c8, first fail: v5.4.210-390-g1cece69eaa88) platform | arch | lab | compiler | defconfig | regressions -----------------------------+--------+---------------+----------+------------------------------+------------ qemu_arm64-virt-gicv3-uefi | arm64 | lab-collabora | gcc-10 | defconfig+arm64-chromebook | 1 Details:
https://kernelci.org/test/plan/id/6473db13458315ebbe2e8666
Results: 0 PASS, 1 FAIL, 0 SKIP Full config: defconfig+arm64-chromebook Compiler: gcc-10 (aarch64-linux-gnu-gcc (Debian 10.2.1-6) 10.2.1 20210110) Plain log:
https://storage.kernelci.org//stable-rc/linux-5.4.y/v5.4.243-162-g99ecfa2a4…
HTML log:
https://storage.kernelci.org//stable-rc/linux-5.4.y/v5.4.243-162-g99ecfa2a4…
Rootfs:
http://storage.kernelci.org/images/rootfs/buildroot/buildroot-baseline/2023…
* baseline.login:
https://kernelci.org/test/case/id/6473db13458315ebbe2e8667
failing since 286 days (last pass: v5.4.180-59-g4f62141869c8, first fail: v5.4.210-258-ge86027f8111f5) platform | arch | lab | compiler | defconfig | regressions -----------------------------+--------+---------------+----------+------------------------------+------------ qemu_arm64-virt-gicv3-uefi | arm64 | lab-collabora | gcc-10 | defconfig | 1 Details:
https://kernelci.org/test/plan/id/6473dc85f61d3574232e85ec
Results: 0 PASS, 1 FAIL, 0 SKIP Full config: defconfig Compiler: gcc-10 (aarch64-linux-gnu-gcc (Debian 10.2.1-6) 10.2.1 20210110) Plain log:
https://storage.kernelci.org//stable-rc/linux-5.4.y/v5.4.243-162-g99ecfa2a4…
HTML log:
https://storage.kernelci.org//stable-rc/linux-5.4.y/v5.4.243-162-g99ecfa2a4…
Rootfs:
http://storage.kernelci.org/images/rootfs/buildroot/buildroot-baseline/2023…
* baseline.login:
https://kernelci.org/test/case/id/6473dc85f61d3574232e85ed
failing since 278 days (last pass: v5.4.180-59-g4f62141869c8, first fail: v5.4.210-390-g1cece69eaa88) platform | arch | lab | compiler | defconfig | regressions -----------------------------+--------+---------------+----------+------------------------------+------------ rk3399-gru-kevin | arm64 | lab-collabora | gcc-10 | defconfig+arm64-chromebook | 2 Details:
https://kernelci.org/test/plan/id/6473da513e9d44abde2e85f4
Results: 82 PASS, 2 FAIL, 1 SKIP Full config: defconfig+arm64-chromebook Compiler: gcc-10 (aarch64-linux-gnu-gcc (Debian 10.2.1-6) 10.2.1 20210110) Plain log:
https://storage.kernelci.org//stable-rc/linux-5.4.y/v5.4.243-162-g99ecfa2a4…
HTML log:
https://storage.kernelci.org//stable-rc/linux-5.4.y/v5.4.243-162-g99ecfa2a4…
Rootfs:
http://storage.kernelci.org/images/rootfs/buildroot/buildroot-baseline/2023…
* baseline.bootrr.rockchip-usb2phy1-probed:
https://kernelci.org/test/case/id/6473da513e9d44abde2e85fa
failing since 75 days (last pass: v5.4.235, first fail: v5.4.235-4-gb829e8b6e1a7) 2023-05-28T22:48:35.176011 <8>[ 32.801766] <LAVA_SIGNAL_TESTCASE TEST_CASE_ID=rockchip-usb2phy0-probed RESULT=fail> 2023-05-28T22:48:36.188711 /lava-10500071/1/../bin/lava-test-case 2023-05-28T22:48:36.197453 <8>[ 33.824270] <LAVA_SIGNAL_TESTCASE TEST_CASE_ID=rockchip-usb2phy1-probed RESULT=fail> * baseline.bootrr.rockchip-usb2phy0-probed:
https://kernelci.org/test/case/id/6473da513e9d44abde2e85fb
failing since 75 days (last pass: v5.4.235, first fail: v5.4.235-4-gb829e8b6e1a7) 2023-05-28T22:48:34.153196 <8>[ 31.778760] <LAVA_SIGNAL_TESTCASE TEST_CASE_ID=rockchip-usb2phy-driver-present RESULT=pass> 2023-05-28T22:48:35.167009 /lava-10500071/1/../bin/lava-test-case platform | arch | lab | compiler | defconfig | regressions -----------------------------+--------+---------------+----------+------------------------------+------------ sun8i-h3-libretech-all-h3-cc | arm | lab-baylibre | gcc-10 | multi_v7_defconfig | 1 Details:
https://kernelci.org/test/plan/id/6473d9a3ab9de7ce152e8621
Results: 5 PASS, 1 FAIL, 1 SKIP Full config: multi_v7_defconfig Compiler: gcc-10 (arm-linux-gnueabihf-gcc (Debian 10.2.1-6) 10.2.1 20210110) Plain log:
https://storage.kernelci.org//stable-rc/linux-5.4.y/v5.4.243-162-g99ecfa2a4…
HTML log:
https://storage.kernelci.org//stable-rc/linux-5.4.y/v5.4.243-162-g99ecfa2a4…
Rootfs:
http://storage.kernelci.org/images/rootfs/buildroot/buildroot-baseline/2023…
* baseline.bootrr.deferred-probe-empty:
https://kernelci.org/test/case/id/6473d9a3ab9de7ce152e8626
failing since 131 days (last pass: v5.4.227, first fail: v5.4.228-659-gb3b34c474ec7) 2023-05-28T22:45:33.367433 / # # 2023-05-28T22:45:33.469692 export SHELL=/bin/sh 2023-05-28T22:45:33.470194 # 2023-05-28T22:45:33.571729 / # export SHELL=/bin/sh. /lava-3628461/environment 2023-05-28T22:45:33.572209 2023-05-28T22:45:33.673784 / # . /lava-3628461/environment/lava-3628461/bin/lava-test-runner /lava-3628461/1 2023-05-28T22:45:33.674448 2023-05-28T22:45:33.693107 / # /lava-3628461/bin/lava-test-runner /lava-3628461/1 2023-05-28T22:45:33.741124 + export 'TESTRUN_ID=1_bootrr' 2023-05-28T22:45:33.779999 + cd /lava-3628461/1/tests/1_bootrr ... (10 line(s) more) platform | arch | lab | compiler | defconfig | regressions -----------------------------+--------+---------------+----------+------------------------------+------------ sun8i-h3-libretech-all-h3-cc | arm | lab-baylibre | gcc-10 | sunxi_defconfig | 1 Details:
https://kernelci.org/test/plan/id/6473d630287fe1c45f2e85ee
Results: 5 PASS, 1 FAIL, 1 SKIP Full config: sunxi_defconfig Compiler: gcc-10 (arm-linux-gnueabihf-gcc (Debian 10.2.1-6) 10.2.1 20210110) Plain log:
https://storage.kernelci.org//stable-rc/linux-5.4.y/v5.4.243-162-g99ecfa2a4…
HTML log:
https://storage.kernelci.org//stable-rc/linux-5.4.y/v5.4.243-162-g99ecfa2a4…
Rootfs:
http://storage.kernelci.org/images/rootfs/buildroot/buildroot-baseline/2023…
* baseline.bootrr.deferred-probe-empty:
https://kernelci.org/test/case/id/6473d631287fe1c45f2e85f3
failing since 131 days (last pass: v5.4.227, first fail: v5.4.228-659-gb3b34c474ec7) 2023-05-28T22:31:02.764652 / # # 2023-05-28T22:31:02.866554 export SHELL=/bin/sh 2023-05-28T22:31:02.867035 # 2023-05-28T22:31:02.968370 / # export SHELL=/bin/sh. /lava-3628420/environment 2023-05-28T22:31:02.968752 2023-05-28T22:31:03.070111 / # . /lava-3628420/environment/lava-3628420/bin/lava-test-runner /lava-3628420/1 2023-05-28T22:31:03.070743 2023-05-28T22:31:03.076954 / # /lava-3628420/bin/lava-test-runner /lava-3628420/1 2023-05-28T22:31:03.154852 + export 'TESTRUN_ID=1_bootrr' 2023-05-28T22:31:03.155120 + cd /lava-3628420/1/tests/1_bootrr ... (10 line(s) more)
[View Less]
1 year, 9 months
1
0
0
0
stable-rc/linux-4.19.y baseline: 145 runs, 32 regressions (v4.19.283-133-gca80c4a612a7)
by kernelci.org bot
stable-rc/linux-4.19.y baseline: 145 runs, 32 regressions (v4.19.283-133-gca80c4a612a7) Regressions Summary ------------------- platform | arch | lab | compiler | defconfig | regressions ---------------------------+-------+---------------+----------+----------------------------+------------ at91sam9g20ek | arm | lab-broonie | gcc-10 | multi_v5_defconfig | 1 beaglebone-black | arm | lab-broonie |
…
[View More]
gcc-10 | omap2plus_defconfig | 1 beaglebone-black | arm | lab-cip | gcc-10 | omap2plus_defconfig | 1 cubietruck | arm | lab-baylibre | gcc-10 | multi_v7_defconfig | 1 meson-gxbb-p200 | arm64 | lab-baylibre | gcc-10 | defconfig | 1 qemu_arm64-virt-gicv2 | arm64 | lab-baylibre | gcc-10 | defconfig | 1 qemu_arm64-virt-gicv2 | arm64 | lab-baylibre | gcc-10 | defconfig+arm64-chromebook | 1 qemu_arm64-virt-gicv2 | arm64 | lab-broonie | gcc-10 | defconfig | 1 qemu_arm64-virt-gicv2 | arm64 | lab-broonie | gcc-10 | defconfig+arm64-chromebook | 1 qemu_arm64-virt-gicv2 | arm64 | lab-collabora | gcc-10 | defconfig | 1 qemu_arm64-virt-gicv2 | arm64 | lab-collabora | gcc-10 | defconfig+arm64-chromebook | 1 qemu_arm64-virt-gicv2-uefi | arm64 | lab-baylibre | gcc-10 | defconfig | 1 qemu_arm64-virt-gicv2-uefi | arm64 | lab-baylibre | gcc-10 | defconfig+arm64-chromebook | 1 qemu_arm64-virt-gicv2-uefi | arm64 | lab-broonie | gcc-10 | defconfig | 1 qemu_arm64-virt-gicv2-uefi | arm64 | lab-broonie | gcc-10 | defconfig+arm64-chromebook | 1 qemu_arm64-virt-gicv2-uefi | arm64 | lab-collabora | gcc-10 | defconfig | 1 qemu_arm64-virt-gicv2-uefi | arm64 | lab-collabora | gcc-10 | defconfig+arm64-chromebook | 1 qemu_arm64-virt-gicv3 | arm64 | lab-baylibre | gcc-10 | defconfig | 1 qemu_arm64-virt-gicv3 | arm64 | lab-baylibre | gcc-10 | defconfig+arm64-chromebook | 1 qemu_arm64-virt-gicv3 | arm64 | lab-broonie | gcc-10 | defconfig | 1 qemu_arm64-virt-gicv3 | arm64 | lab-broonie | gcc-10 | defconfig+arm64-chromebook | 1 qemu_arm64-virt-gicv3 | arm64 | lab-collabora | gcc-10 | defconfig | 1 qemu_arm64-virt-gicv3 | arm64 | lab-collabora | gcc-10 | defconfig+arm64-chromebook | 1 qemu_arm64-virt-gicv3-uefi | arm64 | lab-baylibre | gcc-10 | defconfig | 1 qemu_arm64-virt-gicv3-uefi | arm64 | lab-baylibre | gcc-10 | defconfig+arm64-chromebook | 1 qemu_arm64-virt-gicv3-uefi | arm64 | lab-broonie | gcc-10 | defconfig | 1 qemu_arm64-virt-gicv3-uefi | arm64 | lab-broonie | gcc-10 | defconfig+arm64-chromebook | 1 qemu_arm64-virt-gicv3-uefi | arm64 | lab-collabora | gcc-10 | defconfig | 1 qemu_arm64-virt-gicv3-uefi | arm64 | lab-collabora | gcc-10 | defconfig+arm64-chromebook | 1 r8a7743-iwg20d-q7 | arm | lab-cip | gcc-10 | shmobile_defconfig | 1 rk3399-gru-kevin | arm64 | lab-collabora | gcc-10 | defconfig+arm64-chromebook | 2 Details:
https://kernelci.org/test/job/stable-rc/branch/linux-4.19.y/kernel/v4.19.28…
Test: baseline Tree: stable-rc Branch: linux-4.19.y Describe: v4.19.283-133-gca80c4a612a7 URL:
https://git.kernel.org/pub/scm/linux/kernel/git/stable/linux-stable-rc.git
SHA: ca80c4a612a7abd1d97f2ff63111a46f321975af Test Regressions ---------------- platform | arch | lab | compiler | defconfig | regressions ---------------------------+-------+---------------+----------+----------------------------+------------ at91sam9g20ek | arm | lab-broonie | gcc-10 | multi_v5_defconfig | 1 Details:
https://kernelci.org/test/plan/id/6473d4782ccbf958bc2e861a
Results: 42 PASS, 9 FAIL, 1 SKIP Full config: multi_v5_defconfig Compiler: gcc-10 (arm-linux-gnueabihf-gcc (Debian 10.2.1-6) 10.2.1 20210110) Plain log:
https://storage.kernelci.org//stable-rc/linux-4.19.y/v4.19.283-133-gca80c4a…
HTML log:
https://storage.kernelci.org//stable-rc/linux-4.19.y/v4.19.283-133-gca80c4a…
Rootfs:
http://storage.kernelci.org/images/rootfs/buildroot/buildroot-baseline/2023…
* baseline.bootrr.deferred-probe-empty:
https://kernelci.org/test/case/id/6473d4782ccbf958bc2e864c
failing since 0 day (last pass: v4.19.283-86-ga9cd82d5b16f4, first fail: v4.19.283-133-g8bf710fb2437) 2023-05-28T22:23:10.385524 + set +x 2023-05-28T22:23:10.390778 <8><LAVA_SIGNAL_ENDRUN 0_dmesg 528056_1.5.2.4.1> 2023-05-28T22:23:10.503828 / # # 2023-05-28T22:23:10.606709 export SHELL=/bin/sh 2023-05-28T22:23:10.607516 # 2023-05-28T22:23:10.709587 / # export SHELL=/bin/sh. /lava-528056/environment 2023-05-28T22:23:10.710370 2023-05-28T22:23:10.812371 / # . /lava-528056/environment/lava-528056/bin/lava-test-runner /lava-528056/1 2023-05-28T22:23:10.813642 2023-05-28T22:23:10.820097 / # /lava-528056/bin/lava-test-runner /lava-528056/1 ... (12 line(s) more) platform | arch | lab | compiler | defconfig | regressions ---------------------------+-------+---------------+----------+----------------------------+------------ beaglebone-black | arm | lab-broonie | gcc-10 | omap2plus_defconfig | 1 Details:
https://kernelci.org/test/plan/id/6473d310c09469d1d42e85f3
Results: 41 PASS, 10 FAIL, 1 SKIP Full config: omap2plus_defconfig Compiler: gcc-10 (arm-linux-gnueabihf-gcc (Debian 10.2.1-6) 10.2.1 20210110) Plain log:
https://storage.kernelci.org//stable-rc/linux-4.19.y/v4.19.283-133-gca80c4a…
HTML log:
https://storage.kernelci.org//stable-rc/linux-4.19.y/v4.19.283-133-gca80c4a…
Rootfs:
http://storage.kernelci.org/images/rootfs/buildroot/buildroot-baseline/2023…
* baseline.bootrr.deferred-probe-empty:
https://kernelci.org/test/case/id/6473d310c09469d1d42e8623
failing since 6 days (last pass: v4.19.283, first fail: v4.19.283-76-gc8cd52d7cab7a) 2023-05-28T22:17:29.059535 + set +x<8>[ 15.459653] <LAVA_SIGNAL_ENDRUN 0_dmesg 528049_1.5.2.4.1> 2023-05-28T22:17:29.060120 2023-05-28T22:17:29.172730 / # # 2023-05-28T22:17:29.275789 export SHELL=/bin/sh 2023-05-28T22:17:29.276695 # 2023-05-28T22:17:29.378823 / # export SHELL=/bin/sh. /lava-528049/environment 2023-05-28T22:17:29.379740 2023-05-28T22:17:29.481901 / # . /lava-528049/environment/lava-528049/bin/lava-test-runner /lava-528049/1 2023-05-28T22:17:29.483320 2023-05-28T22:17:29.488070 / # /lava-528049/bin/lava-test-runner /lava-528049/1 ... (12 line(s) more) platform | arch | lab | compiler | defconfig | regressions ---------------------------+-------+---------------+----------+----------------------------+------------ beaglebone-black | arm | lab-cip | gcc-10 | omap2plus_defconfig | 1 Details:
https://kernelci.org/test/plan/id/6473d81abbff7921952e8613
Results: 41 PASS, 10 FAIL, 1 SKIP Full config: omap2plus_defconfig Compiler: gcc-10 (arm-linux-gnueabihf-gcc (Debian 10.2.1-6) 10.2.1 20210110) Plain log:
https://storage.kernelci.org//stable-rc/linux-4.19.y/v4.19.283-133-gca80c4a…
HTML log:
https://storage.kernelci.org//stable-rc/linux-4.19.y/v4.19.283-133-gca80c4a…
Rootfs:
http://storage.kernelci.org/images/rootfs/buildroot/buildroot-baseline/2023…
* baseline.bootrr.deferred-probe-empty:
https://kernelci.org/test/case/id/6473d81abbff7921952e8616
failing since 6 days (last pass: v4.19.283, first fail: v4.19.283-76-gc8cd52d7cab7a) 2023-05-28T22:38:50.601021 / # # 2023-05-28T22:38:50.704361 export SHELL=/bin/sh 2023-05-28T22:38:50.705782 # 2023-05-28T22:38:50.807996 / # export SHELL=/bin. /lava-945807/environment 2023-05-28T22:38:50.808990 /sh 2023-05-28T22:38:50.911267 / # . /lava-945807/environment/lava-945807/bin/lava-test-runner /lava-945807/1 2023-05-28T22:38:50.912597 2023-05-28T22:38:50.953607 / # /lava-945807/bin/lava-test-runner /lava-945807/1 2023-05-28T22:38:51.135126 + export 'TESTRUN_ID=1_bootrr' 2023-05-28T22:38:51.135355 + cd /lava-945807/1/tests/1_bootrr ... (10 line(s) more) platform | arch | lab | compiler | defconfig | regressions ---------------------------+-------+---------------+----------+----------------------------+------------ cubietruck | arm | lab-baylibre | gcc-10 | multi_v7_defconfig | 1 Details:
https://kernelci.org/test/plan/id/6473d4b2fd1bf148d52e8641
Results: 5 PASS, 1 FAIL, 1 SKIP Full config: multi_v7_defconfig Compiler: gcc-10 (arm-linux-gnueabihf-gcc (Debian 10.2.1-6) 10.2.1 20210110) Plain log:
https://storage.kernelci.org//stable-rc/linux-4.19.y/v4.19.283-133-gca80c4a…
HTML log:
https://storage.kernelci.org//stable-rc/linux-4.19.y/v4.19.283-133-gca80c4a…
Rootfs:
http://storage.kernelci.org/images/rootfs/buildroot/buildroot-baseline/2023…
* baseline.bootrr.deferred-probe-empty:
https://kernelci.org/test/case/id/6473d4b2fd1bf148d52e8646
failing since 131 days (last pass: v4.19.268-50-gbf741d1d7e6d, first fail: v4.19.269-522-gc75d2b5524ab) 2023-05-28T22:24:27.058031 <8>[ 7.354729] <LAVA_SIGNAL_ENDRUN 0_dmesg 3628404_1.5.2.4.1> 2023-05-28T22:24:27.168265 / # # 2023-05-28T22:24:27.272092 export SHELL=/bin/sh 2023-05-28T22:24:27.273375 # 2023-05-28T22:24:27.376107 / # export SHELL=/bin/sh. /lava-3628404/environment 2023-05-28T22:24:27.377386 2023-05-28T22:24:27.480124 / # . /lava-3628404/environment/lava-3628404/bin/lava-test-runner /lava-3628404/1 2023-05-28T22:24:27.482128 2023-05-28T22:24:27.486738 / # /lava-3628404/bin/lava-test-runner /lava-3628404/1 2023-05-28T22:24:27.571475 + export 'TESTRUN_ID=1_bootrr' ... (11 line(s) more) platform | arch | lab | compiler | defconfig | regressions ---------------------------+-------+---------------+----------+----------------------------+------------ meson-gxbb-p200 | arm64 | lab-baylibre | gcc-10 | defconfig | 1 Details:
https://kernelci.org/test/plan/id/6473d20d7877b1df322e861a
Results: 5 PASS, 1 FAIL, 1 SKIP Full config: defconfig Compiler: gcc-10 (aarch64-linux-gnu-gcc (Debian 10.2.1-6) 10.2.1 20210110) Plain log:
https://storage.kernelci.org//stable-rc/linux-4.19.y/v4.19.283-133-gca80c4a…
HTML log:
https://storage.kernelci.org//stable-rc/linux-4.19.y/v4.19.283-133-gca80c4a…
Rootfs:
http://storage.kernelci.org/images/rootfs/buildroot/buildroot-baseline/2023…
* baseline.bootrr.deferred-probe-empty:
https://kernelci.org/test/case/id/6473d20d7877b1df322e861f
new failure (last pass: v4.19.283-133-g8bf710fb2437) 2023-05-28T22:13:13.078041 / # 2023-05-28T22:13:13.184375 # #export SHELL=/bin/sh 2023-05-28T22:13:13.185962 2023-05-28T22:13:13.289521 / # export SHELL=/bin/sh. /lava-3628358/environment 2023-05-28T22:13:13.291064 2023-05-28T22:13:13.395191 / # . /lava-3628358/environment/lava-3628358/bin/lava-test-runner /lava-3628358/1 2023-05-28T22:13:13.398336 2023-05-28T22:13:13.416272 / # /lava-3628358/bin/lava-test-runner /lava-3628358/1 2023-05-28T22:13:13.463161 + export 'TESTRUN_ID=1_bootrr' 2023-05-28T22:13:13.464800 + cd /lava-3628358/1/tests/1_bootrr ... (16 line(s) more) platform | arch | lab | compiler | defconfig | regressions ---------------------------+-------+---------------+----------+----------------------------+------------ qemu_arm64-virt-gicv2 | arm64 | lab-baylibre | gcc-10 | defconfig | 1 Details:
https://kernelci.org/test/plan/id/6473d2b1e7f91cc6982e85fe
Results: 0 PASS, 1 FAIL, 0 SKIP Full config: defconfig Compiler: gcc-10 (aarch64-linux-gnu-gcc (Debian 10.2.1-6) 10.2.1 20210110) Plain log:
https://storage.kernelci.org//stable-rc/linux-4.19.y/v4.19.283-133-gca80c4a…
HTML log:
https://storage.kernelci.org//stable-rc/linux-4.19.y/v4.19.283-133-gca80c4a…
Rootfs:
http://storage.kernelci.org/images/rootfs/buildroot/buildroot-baseline/2023…
* baseline.login:
https://kernelci.org/test/case/id/6473d2b1e7f91cc6982e85ff
failing since 286 days (last pass: v4.19.230-41-g73351b9c55d9, first fail: v4.19.255-191-gab9c8d4442969) platform | arch | lab | compiler | defconfig | regressions ---------------------------+-------+---------------+----------+----------------------------+------------ qemu_arm64-virt-gicv2 | arm64 | lab-baylibre | gcc-10 | defconfig+arm64-chromebook | 1 Details:
https://kernelci.org/test/plan/id/6473dbacf1147df9f02e85f8
Results: 0 PASS, 1 FAIL, 0 SKIP Full config: defconfig+arm64-chromebook Compiler: gcc-10 (aarch64-linux-gnu-gcc (Debian 10.2.1-6) 10.2.1 20210110) Plain log:
https://storage.kernelci.org//stable-rc/linux-4.19.y/v4.19.283-133-gca80c4a…
HTML log:
https://storage.kernelci.org//stable-rc/linux-4.19.y/v4.19.283-133-gca80c4a…
Rootfs:
http://storage.kernelci.org/images/rootfs/buildroot/buildroot-baseline/2023…
* baseline.login:
https://kernelci.org/test/case/id/6473dbacf1147df9f02e85f9
failing since 384 days (last pass: v4.19.241-59-g7070c1b6eeed, first fail: v4.19.241-79-ge28b1117a7ab) platform | arch | lab | compiler | defconfig | regressions ---------------------------+-------+---------------+----------+----------------------------+------------ qemu_arm64-virt-gicv2 | arm64 | lab-broonie | gcc-10 | defconfig | 1 Details:
https://kernelci.org/test/plan/id/6473d320c09469d1d42e8686
Results: 0 PASS, 1 FAIL, 0 SKIP Full config: defconfig Compiler: gcc-10 (aarch64-linux-gnu-gcc (Debian 10.2.1-6) 10.2.1 20210110) Plain log:
https://storage.kernelci.org//stable-rc/linux-4.19.y/v4.19.283-133-gca80c4a…
HTML log:
https://storage.kernelci.org//stable-rc/linux-4.19.y/v4.19.283-133-gca80c4a…
Rootfs:
http://storage.kernelci.org/images/rootfs/buildroot/buildroot-baseline/2023…
* baseline.login:
https://kernelci.org/test/case/id/6473d320c09469d1d42e8687
failing since 286 days (last pass: v4.19.230-41-g73351b9c55d9, first fail: v4.19.255-191-gab9c8d4442969) platform | arch | lab | compiler | defconfig | regressions ---------------------------+-------+---------------+----------+----------------------------+------------ qemu_arm64-virt-gicv2 | arm64 | lab-broonie | gcc-10 | defconfig+arm64-chromebook | 1 Details:
https://kernelci.org/test/plan/id/6473dc98f61d3574232e8613
Results: 0 PASS, 1 FAIL, 0 SKIP Full config: defconfig+arm64-chromebook Compiler: gcc-10 (aarch64-linux-gnu-gcc (Debian 10.2.1-6) 10.2.1 20210110) Plain log:
https://storage.kernelci.org//stable-rc/linux-4.19.y/v4.19.283-133-gca80c4a…
HTML log:
https://storage.kernelci.org//stable-rc/linux-4.19.y/v4.19.283-133-gca80c4a…
Rootfs:
http://storage.kernelci.org/images/rootfs/buildroot/buildroot-baseline/2023…
* baseline.login:
https://kernelci.org/test/case/id/6473dc98f61d3574232e8614
failing since 384 days (last pass: v4.19.241-59-g7070c1b6eeed, first fail: v4.19.241-79-ge28b1117a7ab) platform | arch | lab | compiler | defconfig | regressions ---------------------------+-------+---------------+----------+----------------------------+------------ qemu_arm64-virt-gicv2 | arm64 | lab-collabora | gcc-10 | defconfig | 1 Details:
https://kernelci.org/test/plan/id/6473d298e7f91cc6982e85e6
Results: 0 PASS, 1 FAIL, 0 SKIP Full config: defconfig Compiler: gcc-10 (aarch64-linux-gnu-gcc (Debian 10.2.1-6) 10.2.1 20210110) Plain log:
https://storage.kernelci.org//stable-rc/linux-4.19.y/v4.19.283-133-gca80c4a…
HTML log:
https://storage.kernelci.org//stable-rc/linux-4.19.y/v4.19.283-133-gca80c4a…
Rootfs:
http://storage.kernelci.org/images/rootfs/buildroot/buildroot-baseline/2023…
* baseline.login:
https://kernelci.org/test/case/id/6473d298e7f91cc6982e85e7
failing since 286 days (last pass: v4.19.230-41-g73351b9c55d9, first fail: v4.19.255-191-gab9c8d4442969) platform | arch | lab | compiler | defconfig | regressions ---------------------------+-------+---------------+----------+----------------------------+------------ qemu_arm64-virt-gicv2 | arm64 | lab-collabora | gcc-10 | defconfig+arm64-chromebook | 1 Details:
https://kernelci.org/test/plan/id/6473dc027d479ba3f62e862d
Results: 0 PASS, 1 FAIL, 0 SKIP Full config: defconfig+arm64-chromebook Compiler: gcc-10 (aarch64-linux-gnu-gcc (Debian 10.2.1-6) 10.2.1 20210110) Plain log:
https://storage.kernelci.org//stable-rc/linux-4.19.y/v4.19.283-133-gca80c4a…
HTML log:
https://storage.kernelci.org//stable-rc/linux-4.19.y/v4.19.283-133-gca80c4a…
Rootfs:
http://storage.kernelci.org/images/rootfs/buildroot/buildroot-baseline/2023…
* baseline.login:
https://kernelci.org/test/case/id/6473dc027d479ba3f62e862e
failing since 384 days (last pass: v4.19.241-59-g7070c1b6eeed, first fail: v4.19.241-79-ge28b1117a7ab) platform | arch | lab | compiler | defconfig | regressions ---------------------------+-------+---------------+----------+----------------------------+------------ qemu_arm64-virt-gicv2-uefi | arm64 | lab-baylibre | gcc-10 | defconfig | 1 Details:
https://kernelci.org/test/plan/id/6473d2afe7f91cc6982e85f6
Results: 0 PASS, 1 FAIL, 0 SKIP Full config: defconfig Compiler: gcc-10 (aarch64-linux-gnu-gcc (Debian 10.2.1-6) 10.2.1 20210110) Plain log:
https://storage.kernelci.org//stable-rc/linux-4.19.y/v4.19.283-133-gca80c4a…
HTML log:
https://storage.kernelci.org//stable-rc/linux-4.19.y/v4.19.283-133-gca80c4a…
Rootfs:
http://storage.kernelci.org/images/rootfs/buildroot/buildroot-baseline/2023…
* baseline.login:
https://kernelci.org/test/case/id/6473d2afe7f91cc6982e85f7
failing since 272 days (last pass: v4.19.230-41-g73351b9c55d9, first fail: v4.19.256-37-g34c3cf0160a8) platform | arch | lab | compiler | defconfig | regressions ---------------------------+-------+---------------+----------+----------------------------+------------ qemu_arm64-virt-gicv2-uefi | arm64 | lab-baylibre | gcc-10 | defconfig+arm64-chromebook | 1 Details:
https://kernelci.org/test/plan/id/6473db9783b2e0a24c2e85e6
Results: 0 PASS, 1 FAIL, 0 SKIP Full config: defconfig+arm64-chromebook Compiler: gcc-10 (aarch64-linux-gnu-gcc (Debian 10.2.1-6) 10.2.1 20210110) Plain log:
https://storage.kernelci.org//stable-rc/linux-4.19.y/v4.19.283-133-gca80c4a…
HTML log:
https://storage.kernelci.org//stable-rc/linux-4.19.y/v4.19.283-133-gca80c4a…
Rootfs:
http://storage.kernelci.org/images/rootfs/buildroot/buildroot-baseline/2023…
* baseline.login:
https://kernelci.org/test/case/id/6473db9783b2e0a24c2e85e7
failing since 384 days (last pass: v4.19.241-59-g7070c1b6eeed, first fail: v4.19.241-79-ge28b1117a7ab) platform | arch | lab | compiler | defconfig | regressions ---------------------------+-------+---------------+----------+----------------------------+------------ qemu_arm64-virt-gicv2-uefi | arm64 | lab-broonie | gcc-10 | defconfig | 1 Details:
https://kernelci.org/test/plan/id/6473d2bce7f91cc6982e8605
Results: 0 PASS, 1 FAIL, 0 SKIP Full config: defconfig Compiler: gcc-10 (aarch64-linux-gnu-gcc (Debian 10.2.1-6) 10.2.1 20210110) Plain log:
https://storage.kernelci.org//stable-rc/linux-4.19.y/v4.19.283-133-gca80c4a…
HTML log:
https://storage.kernelci.org//stable-rc/linux-4.19.y/v4.19.283-133-gca80c4a…
Rootfs:
http://storage.kernelci.org/images/rootfs/buildroot/buildroot-baseline/2023…
* baseline.login:
https://kernelci.org/test/case/id/6473d2bce7f91cc6982e8606
failing since 272 days (last pass: v4.19.230-41-g73351b9c55d9, first fail: v4.19.256-37-g34c3cf0160a8) platform | arch | lab | compiler | defconfig | regressions ---------------------------+-------+---------------+----------+----------------------------+------------ qemu_arm64-virt-gicv2-uefi | arm64 | lab-broonie | gcc-10 | defconfig+arm64-chromebook | 1 Details:
https://kernelci.org/test/plan/id/6473dc96f61d3574232e8610
Results: 0 PASS, 1 FAIL, 0 SKIP Full config: defconfig+arm64-chromebook Compiler: gcc-10 (aarch64-linux-gnu-gcc (Debian 10.2.1-6) 10.2.1 20210110) Plain log:
https://storage.kernelci.org//stable-rc/linux-4.19.y/v4.19.283-133-gca80c4a…
HTML log:
https://storage.kernelci.org//stable-rc/linux-4.19.y/v4.19.283-133-gca80c4a…
Rootfs:
http://storage.kernelci.org/images/rootfs/buildroot/buildroot-baseline/2023…
* baseline.login:
https://kernelci.org/test/case/id/6473dc96f61d3574232e8611
failing since 384 days (last pass: v4.19.241-59-g7070c1b6eeed, first fail: v4.19.241-79-ge28b1117a7ab) platform | arch | lab | compiler | defconfig | regressions ---------------------------+-------+---------------+----------+----------------------------+------------ qemu_arm64-virt-gicv2-uefi | arm64 | lab-collabora | gcc-10 | defconfig | 1 Details:
https://kernelci.org/test/plan/id/6473d2a0e7f91cc6982e85ea
Results: 0 PASS, 1 FAIL, 0 SKIP Full config: defconfig Compiler: gcc-10 (aarch64-linux-gnu-gcc (Debian 10.2.1-6) 10.2.1 20210110) Plain log:
https://storage.kernelci.org//stable-rc/linux-4.19.y/v4.19.283-133-gca80c4a…
HTML log:
https://storage.kernelci.org//stable-rc/linux-4.19.y/v4.19.283-133-gca80c4a…
Rootfs:
http://storage.kernelci.org/images/rootfs/buildroot/buildroot-baseline/2023…
* baseline.login:
https://kernelci.org/test/case/id/6473d2a0e7f91cc6982e85eb
failing since 272 days (last pass: v4.19.230-41-g73351b9c55d9, first fail: v4.19.256-37-g34c3cf0160a8) platform | arch | lab | compiler | defconfig | regressions ---------------------------+-------+---------------+----------+----------------------------+------------ qemu_arm64-virt-gicv2-uefi | arm64 | lab-collabora | gcc-10 | defconfig+arm64-chromebook | 1 Details:
https://kernelci.org/test/plan/id/6473dbf97cbece50df2e85e6
Results: 0 PASS, 1 FAIL, 0 SKIP Full config: defconfig+arm64-chromebook Compiler: gcc-10 (aarch64-linux-gnu-gcc (Debian 10.2.1-6) 10.2.1 20210110) Plain log:
https://storage.kernelci.org//stable-rc/linux-4.19.y/v4.19.283-133-gca80c4a…
HTML log:
https://storage.kernelci.org//stable-rc/linux-4.19.y/v4.19.283-133-gca80c4a…
Rootfs:
http://storage.kernelci.org/images/rootfs/buildroot/buildroot-baseline/2023…
* baseline.login:
https://kernelci.org/test/case/id/6473dbf97cbece50df2e85e7
failing since 384 days (last pass: v4.19.241-59-g7070c1b6eeed, first fail: v4.19.241-79-ge28b1117a7ab) platform | arch | lab | compiler | defconfig | regressions ---------------------------+-------+---------------+----------+----------------------------+------------ qemu_arm64-virt-gicv3 | arm64 | lab-baylibre | gcc-10 | defconfig | 1 Details:
https://kernelci.org/test/plan/id/6473d2b0f8d763bcc42e861f
Results: 0 PASS, 1 FAIL, 0 SKIP Full config: defconfig Compiler: gcc-10 (aarch64-linux-gnu-gcc (Debian 10.2.1-6) 10.2.1 20210110) Plain log:
https://storage.kernelci.org//stable-rc/linux-4.19.y/v4.19.283-133-gca80c4a…
HTML log:
https://storage.kernelci.org//stable-rc/linux-4.19.y/v4.19.283-133-gca80c4a…
Rootfs:
http://storage.kernelci.org/images/rootfs/buildroot/buildroot-baseline/2023…
* baseline.login:
https://kernelci.org/test/case/id/6473d2b0f8d763bcc42e8620
failing since 298 days (last pass: v4.19.230-41-g73351b9c55d9, first fail: v4.19.254) platform | arch | lab | compiler | defconfig | regressions ---------------------------+-------+---------------+----------+----------------------------+------------ qemu_arm64-virt-gicv3 | arm64 | lab-baylibre | gcc-10 | defconfig+arm64-chromebook | 1 Details:
https://kernelci.org/test/plan/id/6473dbaaf1147df9f02e85e6
Results: 0 PASS, 1 FAIL, 0 SKIP Full config: defconfig+arm64-chromebook Compiler: gcc-10 (aarch64-linux-gnu-gcc (Debian 10.2.1-6) 10.2.1 20210110) Plain log:
https://storage.kernelci.org//stable-rc/linux-4.19.y/v4.19.283-133-gca80c4a…
HTML log:
https://storage.kernelci.org//stable-rc/linux-4.19.y/v4.19.283-133-gca80c4a…
Rootfs:
http://storage.kernelci.org/images/rootfs/buildroot/buildroot-baseline/2023…
* baseline.login:
https://kernelci.org/test/case/id/6473dbaaf1147df9f02e85e7
failing since 384 days (last pass: v4.19.241-59-g7070c1b6eeed, first fail: v4.19.241-79-ge28b1117a7ab) platform | arch | lab | compiler | defconfig | regressions ---------------------------+-------+---------------+----------+----------------------------+------------ qemu_arm64-virt-gicv3 | arm64 | lab-broonie | gcc-10 | defconfig | 1 Details:
https://kernelci.org/test/plan/id/6473d30cc09469d1d42e85e7
Results: 0 PASS, 1 FAIL, 0 SKIP Full config: defconfig Compiler: gcc-10 (aarch64-linux-gnu-gcc (Debian 10.2.1-6) 10.2.1 20210110) Plain log:
https://storage.kernelci.org//stable-rc/linux-4.19.y/v4.19.283-133-gca80c4a…
HTML log:
https://storage.kernelci.org//stable-rc/linux-4.19.y/v4.19.283-133-gca80c4a…
Rootfs:
http://storage.kernelci.org/images/rootfs/buildroot/buildroot-baseline/2023…
* baseline.login:
https://kernelci.org/test/case/id/6473d30cc09469d1d42e85e8
failing since 298 days (last pass: v4.19.230-41-g73351b9c55d9, first fail: v4.19.254) platform | arch | lab | compiler | defconfig | regressions ---------------------------+-------+---------------+----------+----------------------------+------------ qemu_arm64-virt-gicv3 | arm64 | lab-broonie | gcc-10 | defconfig+arm64-chromebook | 1 Details:
https://kernelci.org/test/plan/id/6473dc810569ff831f2e867c
Results: 0 PASS, 1 FAIL, 0 SKIP Full config: defconfig+arm64-chromebook Compiler: gcc-10 (aarch64-linux-gnu-gcc (Debian 10.2.1-6) 10.2.1 20210110) Plain log:
https://storage.kernelci.org//stable-rc/linux-4.19.y/v4.19.283-133-gca80c4a…
HTML log:
https://storage.kernelci.org//stable-rc/linux-4.19.y/v4.19.283-133-gca80c4a…
Rootfs:
http://storage.kernelci.org/images/rootfs/buildroot/buildroot-baseline/2023…
* baseline.login:
https://kernelci.org/test/case/id/6473dc810569ff831f2e867d
failing since 384 days (last pass: v4.19.241-59-g7070c1b6eeed, first fail: v4.19.241-79-ge28b1117a7ab) platform | arch | lab | compiler | defconfig | regressions ---------------------------+-------+---------------+----------+----------------------------+------------ qemu_arm64-virt-gicv3 | arm64 | lab-collabora | gcc-10 | defconfig | 1 Details:
https://kernelci.org/test/plan/id/6473d2a1f8d763bcc42e85fe
Results: 0 PASS, 1 FAIL, 0 SKIP Full config: defconfig Compiler: gcc-10 (aarch64-linux-gnu-gcc (Debian 10.2.1-6) 10.2.1 20210110) Plain log:
https://storage.kernelci.org//stable-rc/linux-4.19.y/v4.19.283-133-gca80c4a…
HTML log:
https://storage.kernelci.org//stable-rc/linux-4.19.y/v4.19.283-133-gca80c4a…
Rootfs:
http://storage.kernelci.org/images/rootfs/buildroot/buildroot-baseline/2023…
* baseline.login:
https://kernelci.org/test/case/id/6473d2a1f8d763bcc42e85ff
failing since 298 days (last pass: v4.19.230-41-g73351b9c55d9, first fail: v4.19.254) platform | arch | lab | compiler | defconfig | regressions ---------------------------+-------+---------------+----------+----------------------------+------------ qemu_arm64-virt-gicv3 | arm64 | lab-collabora | gcc-10 | defconfig+arm64-chromebook | 1 Details:
https://kernelci.org/test/plan/id/6473dbdac0b3bc8f902e85eb
Results: 0 PASS, 1 FAIL, 0 SKIP Full config: defconfig+arm64-chromebook Compiler: gcc-10 (aarch64-linux-gnu-gcc (Debian 10.2.1-6) 10.2.1 20210110) Plain log:
https://storage.kernelci.org//stable-rc/linux-4.19.y/v4.19.283-133-gca80c4a…
HTML log:
https://storage.kernelci.org//stable-rc/linux-4.19.y/v4.19.283-133-gca80c4a…
Rootfs:
http://storage.kernelci.org/images/rootfs/buildroot/buildroot-baseline/2023…
* baseline.login:
https://kernelci.org/test/case/id/6473dbdac0b3bc8f902e85ec
failing since 384 days (last pass: v4.19.241-59-g7070c1b6eeed, first fail: v4.19.241-79-ge28b1117a7ab) platform | arch | lab | compiler | defconfig | regressions ---------------------------+-------+---------------+----------+----------------------------+------------ qemu_arm64-virt-gicv3-uefi | arm64 | lab-baylibre | gcc-10 | defconfig | 1 Details:
https://kernelci.org/test/plan/id/6473d2adac305759992e860a
Results: 0 PASS, 1 FAIL, 0 SKIP Full config: defconfig Compiler: gcc-10 (aarch64-linux-gnu-gcc (Debian 10.2.1-6) 10.2.1 20210110) Plain log:
https://storage.kernelci.org//stable-rc/linux-4.19.y/v4.19.283-133-gca80c4a…
HTML log:
https://storage.kernelci.org//stable-rc/linux-4.19.y/v4.19.283-133-gca80c4a…
Rootfs:
http://storage.kernelci.org/images/rootfs/buildroot/buildroot-baseline/2023…
* baseline.login:
https://kernelci.org/test/case/id/6473d2adac305759992e860b
failing since 284 days (last pass: v4.19.230-41-g73351b9c55d9, first fail: v4.19.255) platform | arch | lab | compiler | defconfig | regressions ---------------------------+-------+---------------+----------+----------------------------+------------ qemu_arm64-virt-gicv3-uefi | arm64 | lab-baylibre | gcc-10 | defconfig+arm64-chromebook | 1 Details:
https://kernelci.org/test/plan/id/6473dbaef1147df9f02e8646
Results: 0 PASS, 1 FAIL, 0 SKIP Full config: defconfig+arm64-chromebook Compiler: gcc-10 (aarch64-linux-gnu-gcc (Debian 10.2.1-6) 10.2.1 20210110) Plain log:
https://storage.kernelci.org//stable-rc/linux-4.19.y/v4.19.283-133-gca80c4a…
HTML log:
https://storage.kernelci.org//stable-rc/linux-4.19.y/v4.19.283-133-gca80c4a…
Rootfs:
http://storage.kernelci.org/images/rootfs/buildroot/buildroot-baseline/2023…
* baseline.login:
https://kernelci.org/test/case/id/6473dbaef1147df9f02e8647
failing since 384 days (last pass: v4.19.241-59-g7070c1b6eeed, first fail: v4.19.241-79-ge28b1117a7ab) platform | arch | lab | compiler | defconfig | regressions ---------------------------+-------+---------------+----------+----------------------------+------------ qemu_arm64-virt-gicv3-uefi | arm64 | lab-broonie | gcc-10 | defconfig | 1 Details:
https://kernelci.org/test/plan/id/6473d2a8f8d763bcc42e8606
Results: 0 PASS, 1 FAIL, 0 SKIP Full config: defconfig Compiler: gcc-10 (aarch64-linux-gnu-gcc (Debian 10.2.1-6) 10.2.1 20210110) Plain log:
https://storage.kernelci.org//stable-rc/linux-4.19.y/v4.19.283-133-gca80c4a…
HTML log:
https://storage.kernelci.org//stable-rc/linux-4.19.y/v4.19.283-133-gca80c4a…
Rootfs:
http://storage.kernelci.org/images/rootfs/buildroot/buildroot-baseline/2023…
* baseline.login:
https://kernelci.org/test/case/id/6473d2a8f8d763bcc42e8607
failing since 284 days (last pass: v4.19.230-41-g73351b9c55d9, first fail: v4.19.255) platform | arch | lab | compiler | defconfig | regressions ---------------------------+-------+---------------+----------+----------------------------+------------ qemu_arm64-virt-gicv3-uefi | arm64 | lab-broonie | gcc-10 | defconfig+arm64-chromebook | 1 Details:
https://kernelci.org/test/plan/id/6473dc99f61d3574232e8616
Results: 0 PASS, 1 FAIL, 0 SKIP Full config: defconfig+arm64-chromebook Compiler: gcc-10 (aarch64-linux-gnu-gcc (Debian 10.2.1-6) 10.2.1 20210110) Plain log:
https://storage.kernelci.org//stable-rc/linux-4.19.y/v4.19.283-133-gca80c4a…
HTML log:
https://storage.kernelci.org//stable-rc/linux-4.19.y/v4.19.283-133-gca80c4a…
Rootfs:
http://storage.kernelci.org/images/rootfs/buildroot/buildroot-baseline/2023…
* baseline.login:
https://kernelci.org/test/case/id/6473dc99f61d3574232e8617
failing since 384 days (last pass: v4.19.241-59-g7070c1b6eeed, first fail: v4.19.241-79-ge28b1117a7ab) platform | arch | lab | compiler | defconfig | regressions ---------------------------+-------+---------------+----------+----------------------------+------------ qemu_arm64-virt-gicv3-uefi | arm64 | lab-collabora | gcc-10 | defconfig | 1 Details:
https://kernelci.org/test/plan/id/6473d2979c84702db62e8635
Results: 0 PASS, 1 FAIL, 0 SKIP Full config: defconfig Compiler: gcc-10 (aarch64-linux-gnu-gcc (Debian 10.2.1-6) 10.2.1 20210110) Plain log:
https://storage.kernelci.org//stable-rc/linux-4.19.y/v4.19.283-133-gca80c4a…
HTML log:
https://storage.kernelci.org//stable-rc/linux-4.19.y/v4.19.283-133-gca80c4a…
Rootfs:
http://storage.kernelci.org/images/rootfs/buildroot/buildroot-baseline/2023…
* baseline.login:
https://kernelci.org/test/case/id/6473d2979c84702db62e8636
failing since 284 days (last pass: v4.19.230-41-g73351b9c55d9, first fail: v4.19.255) platform | arch | lab | compiler | defconfig | regressions ---------------------------+-------+---------------+----------+----------------------------+------------ qemu_arm64-virt-gicv3-uefi | arm64 | lab-collabora | gcc-10 | defconfig+arm64-chromebook | 1 Details:
https://kernelci.org/test/plan/id/6473dc167d479ba3f62e8695
Results: 0 PASS, 1 FAIL, 0 SKIP Full config: defconfig+arm64-chromebook Compiler: gcc-10 (aarch64-linux-gnu-gcc (Debian 10.2.1-6) 10.2.1 20210110) Plain log:
https://storage.kernelci.org//stable-rc/linux-4.19.y/v4.19.283-133-gca80c4a…
HTML log:
https://storage.kernelci.org//stable-rc/linux-4.19.y/v4.19.283-133-gca80c4a…
Rootfs:
http://storage.kernelci.org/images/rootfs/buildroot/buildroot-baseline/2023…
* baseline.login:
https://kernelci.org/test/case/id/6473dc167d479ba3f62e8696
failing since 384 days (last pass: v4.19.241-59-g7070c1b6eeed, first fail: v4.19.241-79-ge28b1117a7ab) platform | arch | lab | compiler | defconfig | regressions ---------------------------+-------+---------------+----------+----------------------------+------------ r8a7743-iwg20d-q7 | arm | lab-cip | gcc-10 | shmobile_defconfig | 1 Details:
https://kernelci.org/test/plan/id/6473d477a29153f39a2e8609
Results: 0 PASS, 1 FAIL, 0 SKIP Full config: shmobile_defconfig Compiler: gcc-10 (arm-linux-gnueabihf-gcc (Debian 10.2.1-6) 10.2.1 20210110) Plain log:
https://storage.kernelci.org//stable-rc/linux-4.19.y/v4.19.283-133-gca80c4a…
HTML log:
https://storage.kernelci.org//stable-rc/linux-4.19.y/v4.19.283-133-gca80c4a…
Rootfs:
http://storage.kernelci.org/images/rootfs/buildroot/buildroot-baseline/2023…
* baseline.login:
https://kernelci.org/test/case/id/6473d477a29153f39a2e860a
new failure (last pass: v4.19.283-133-g8bf710fb2437) platform | arch | lab | compiler | defconfig | regressions ---------------------------+-------+---------------+----------+----------------------------+------------ rk3399-gru-kevin | arm64 | lab-collabora | gcc-10 | defconfig+arm64-chromebook | 2 Details:
https://kernelci.org/test/plan/id/6473daaff30d73b07c2e85e8
Results: 77 PASS, 5 FAIL, 1 SKIP Full config: defconfig+arm64-chromebook Compiler: gcc-10 (aarch64-linux-gnu-gcc (Debian 10.2.1-6) 10.2.1 20210110) Plain log:
https://storage.kernelci.org//stable-rc/linux-4.19.y/v4.19.283-133-gca80c4a…
HTML log:
https://storage.kernelci.org//stable-rc/linux-4.19.y/v4.19.283-133-gca80c4a…
Rootfs:
http://storage.kernelci.org/images/rootfs/buildroot/buildroot-baseline/2023…
* baseline.bootrr.rockchip-usb2phy1-probed:
https://kernelci.org/test/case/id/6473daaff30d73b07c2e85ee
failing since 75 days (last pass: v4.19.276, first fail: v4.19.276-4-g4f95ee925a2b) * baseline.bootrr.rockchip-usb2phy0-probed:
https://kernelci.org/test/case/id/6473daaff30d73b07c2e85ef
failing since 75 days (last pass: v4.19.276, first fail: v4.19.276-4-g4f95ee925a2b) 2023-05-28T22:50:02.382565 /lava-10500086/1/../bin/lava-test-case 2023-05-28T22:50:02.390827 <8>[ 36.487333] <LAVA_SIGNAL_TESTCASE TEST_CASE_ID=rockchip-usb2phy0-probed RESULT=fail>
[View Less]
1 year, 9 months
1
0
0
0
stable-rc/linux-5.10.y baseline: 168 runs, 4 regressions (v5.10.180-212-g80ae453d08c19)
by kernelci.org bot
stable-rc/linux-5.10.y baseline: 168 runs, 4 regressions (v5.10.180-212-g80ae453d08c19) Regressions Summary ------------------- platform | arch | lab | compiler | defconfig | regressions -----------------------------+--------+---------------+----------+------------------------------+------------ cubietruck | arm | lab-baylibre | gcc-10 | multi_v7_defconfig | 1 hp-x360-12b-c...4020-octopus | x86_64 |
…
[View More]
lab-collabora | gcc-10 | x86_64_defcon...6-chromebook | 1 hp-x360-14-G1-sona | x86_64 | lab-collabora | gcc-10 | x86_64_defcon...6-chromebook | 1 r8a7743-iwg20d-q7 | arm | lab-cip | gcc-10 | shmobile_defconfig | 1 Details:
https://kernelci.org/test/job/stable-rc/branch/linux-5.10.y/kernel/v5.10.18…
Test: baseline Tree: stable-rc Branch: linux-5.10.y Describe: v5.10.180-212-g80ae453d08c19 URL:
https://git.kernel.org/pub/scm/linux/kernel/git/stable/linux-stable-rc.git
SHA: 80ae453d08c191989cbf98440279674059eca336 Test Regressions ---------------- platform | arch | lab | compiler | defconfig | regressions -----------------------------+--------+---------------+----------+------------------------------+------------ cubietruck | arm | lab-baylibre | gcc-10 | multi_v7_defconfig | 1 Details:
https://kernelci.org/test/plan/id/6473d066da6983defd2e8625
Results: 5 PASS, 1 FAIL, 1 SKIP Full config: multi_v7_defconfig Compiler: gcc-10 (arm-linux-gnueabihf-gcc (Debian 10.2.1-6) 10.2.1 20210110) Plain log:
https://storage.kernelci.org//stable-rc/linux-5.10.y/v5.10.180-212-g80ae453…
HTML log:
https://storage.kernelci.org//stable-rc/linux-5.10.y/v5.10.180-212-g80ae453…
Rootfs:
http://storage.kernelci.org/images/rootfs/buildroot/buildroot-baseline/2023…
* baseline.bootrr.deferred-probe-empty:
https://kernelci.org/test/case/id/6473d066da6983defd2e862a
failing since 130 days (last pass: v5.10.158-107-gd2432186ff47, first fail: v5.10.162-852-geeaac3cf2eb3) 2023-05-28T22:06:19.753418 <8>[ 11.077906] <LAVA_SIGNAL_ENDRUN 0_dmesg 3628317_1.5.2.4.1> 2023-05-28T22:06:19.865519 / # # 2023-05-28T22:06:19.969205 export SHELL=/bin/sh 2023-05-28T22:06:19.970255 # 2023-05-28T22:06:20.072737 / # export SHELL=/bin/sh. /lava-3628317/environment 2023-05-28T22:06:20.073888 2023-05-28T22:06:20.176176 / # . /lava-3628317/environment/lava-3628317/bin/lava-test-runner /lava-3628317/1 2023-05-28T22:06:20.177444 2023-05-28T22:06:20.182167 / # /lava-3628317/bin/lava-test-runner /lava-3628317/1 2023-05-28T22:06:20.268327 + export 'TESTRUN_ID=1_bootrr' ... (11 line(s) more) platform | arch | lab | compiler | defconfig | regressions -----------------------------+--------+---------------+----------+------------------------------+------------ hp-x360-12b-c...4020-octopus | x86_64 | lab-collabora | gcc-10 | x86_64_defcon...6-chromebook | 1 Details:
https://kernelci.org/test/plan/id/6473d1f97877b1df322e85e7
Results: 6 PASS, 1 FAIL, 0 SKIP Full config: x86_64_defconfig+x86-chromebook Compiler: gcc-10 (gcc (Debian 10.2.1-6) 10.2.1 20210110) Plain log:
https://storage.kernelci.org//stable-rc/linux-5.10.y/v5.10.180-212-g80ae453…
HTML log:
https://storage.kernelci.org//stable-rc/linux-5.10.y/v5.10.180-212-g80ae453…
Rootfs:
http://storage.kernelci.org/images/rootfs/buildroot/buildroot-baseline/2023…
* baseline.bootrr.deferred-probe-empty:
https://kernelci.org/test/case/id/6473d1f97877b1df322e85ec
failing since 61 days (last pass: v5.10.176, first fail: v5.10.176-105-g18265b240021) 2023-05-28T22:12:56.584516 + set +x 2023-05-28T22:12:56.590411 <8>[ 10.213770] <LAVA_SIGNAL_ENDRUN 0_dmesg 10499681_1.4.2.3.1> 2023-05-28T22:12:56.695515 / # # 2023-05-28T22:12:56.797099 export SHELL=/bin/sh 2023-05-28T22:12:56.797912 # 2023-05-28T22:12:56.899252 / # export SHELL=/bin/sh. /lava-10499681/environment 2023-05-28T22:12:56.900037 2023-05-28T22:12:57.001418 / # . /lava-10499681/environment/lava-10499681/bin/lava-test-runner /lava-10499681/1 2023-05-28T22:12:57.002663 2023-05-28T22:12:57.007834 / # /lava-10499681/bin/lava-test-runner /lava-10499681/1 ... (12 line(s) more) platform | arch | lab | compiler | defconfig | regressions -----------------------------+--------+---------------+----------+------------------------------+------------ hp-x360-14-G1-sona | x86_64 | lab-collabora | gcc-10 | x86_64_defcon...6-chromebook | 1 Details:
https://kernelci.org/test/plan/id/6473d1ce6460e3ded32e862f
Results: 6 PASS, 1 FAIL, 0 SKIP Full config: x86_64_defconfig+x86-chromebook Compiler: gcc-10 (gcc (Debian 10.2.1-6) 10.2.1 20210110) Plain log:
https://storage.kernelci.org//stable-rc/linux-5.10.y/v5.10.180-212-g80ae453…
HTML log:
https://storage.kernelci.org//stable-rc/linux-5.10.y/v5.10.180-212-g80ae453…
Rootfs:
http://storage.kernelci.org/images/rootfs/buildroot/buildroot-baseline/2023…
* baseline.bootrr.deferred-probe-empty:
https://kernelci.org/test/case/id/6473d1ce6460e3ded32e8634
failing since 61 days (last pass: v5.10.176, first fail: v5.10.176-105-g18265b240021) 2023-05-28T22:12:08.476620 <8>[ 13.657546] <LAVA_SIGNAL_ENDRUN 0_dmesg 10499654_1.4.2.3.1> 2023-05-28T22:12:08.480112 + set +x 2023-05-28T22:12:08.584164 / # # 2023-05-28T22:12:08.684717 export SHELL=/bin/sh 2023-05-28T22:12:08.684903 # 2023-05-28T22:12:08.785380 / # export SHELL=/bin/sh. /lava-10499654/environment 2023-05-28T22:12:08.785648 2023-05-28T22:12:08.886227 / # . /lava-10499654/environment/lava-10499654/bin/lava-test-runner /lava-10499654/1 2023-05-28T22:12:08.886513 2023-05-28T22:12:08.891315 / # /lava-10499654/bin/lava-test-runner /lava-10499654/1 ... (12 line(s) more) platform | arch | lab | compiler | defconfig | regressions -----------------------------+--------+---------------+----------+------------------------------+------------ r8a7743-iwg20d-q7 | arm | lab-cip | gcc-10 | shmobile_defconfig | 1 Details:
https://kernelci.org/test/plan/id/6473d08feb7c29be922e8618
Results: 0 PASS, 1 FAIL, 0 SKIP Full config: shmobile_defconfig Compiler: gcc-10 (arm-linux-gnueabihf-gcc (Debian 10.2.1-6) 10.2.1 20210110) Plain log:
https://storage.kernelci.org//stable-rc/linux-5.10.y/v5.10.180-212-g80ae453…
HTML log:
https://storage.kernelci.org//stable-rc/linux-5.10.y/v5.10.180-212-g80ae453…
Rootfs:
http://storage.kernelci.org/images/rootfs/buildroot/buildroot-baseline/2023…
* baseline.login:
https://kernelci.org/test/case/id/6473d08feb7c29be922e8619
failing since 0 day (last pass: v5.10.180-154-gfd59dd82642d, first fail: v5.10.180-212-g5bb979836617c)
[View Less]
1 year, 9 months
1
0
0
0
stable-rc/linux-5.15.y baseline: 165 runs, 13 regressions (v5.15.112-274-gcd3aaa9c7395)
by kernelci.org bot
stable-rc/linux-5.15.y baseline: 165 runs, 13 regressions (v5.15.112-274-gcd3aaa9c7395) Regressions Summary ------------------- platform | arch | lab | compiler | defconfig | regressions -----------------------------+--------+---------------+----------+------------------------------+------------ asus-C436FA-Flip-hatch | x86_64 | lab-collabora | gcc-10 | x86_64_defcon...6-chromebook | 1 asus-CM1400CXA-dalboz | x86_64 |
…
[View More]
lab-collabora | gcc-10 | x86_64_defcon...6-chromebook | 1 asus-cx9400-volteer | x86_64 | lab-collabora | gcc-10 | x86_64_defcon...6-chromebook | 1 beagle-xm | arm | lab-baylibre | gcc-10 | omap2plus_defconfig | 1 cubietruck | arm | lab-baylibre | gcc-10 | multi_v7_defconfig | 1 hp-x360-12b-c...4020-octopus | x86_64 | lab-collabora | gcc-10 | x86_64_defcon...6-chromebook | 1 hp-x360-14-G1-sona | x86_64 | lab-collabora | gcc-10 | x86_64_defcon...6-chromebook | 1 hp-x360-14a-cb0001xx-zork | x86_64 | lab-collabora | gcc-10 | x86_64_defcon...6-chromebook | 1 lenovo-TPad-C13-Yoga-zork | x86_64 | lab-collabora | gcc-10 | x86_64_defcon...6-chromebook | 1 mt8183-kukui-...uniper-sku16 | arm64 | lab-collabora | gcc-10 | defconfig+arm64-chromebook | 4 Details:
https://kernelci.org/test/job/stable-rc/branch/linux-5.15.y/kernel/v5.15.11…
Test: baseline Tree: stable-rc Branch: linux-5.15.y Describe: v5.15.112-274-gcd3aaa9c7395 URL:
https://git.kernel.org/pub/scm/linux/kernel/git/stable/linux-stable-rc.git
SHA: cd3aaa9c7395cb221c57a5d6e5ca7d342669d553 Test Regressions ---------------- platform | arch | lab | compiler | defconfig | regressions -----------------------------+--------+---------------+----------+------------------------------+------------ asus-C436FA-Flip-hatch | x86_64 | lab-collabora | gcc-10 | x86_64_defcon...6-chromebook | 1 Details:
https://kernelci.org/test/plan/id/6473cf9508f8b0f9582e85f2
Results: 6 PASS, 1 FAIL, 0 SKIP Full config: x86_64_defconfig+x86-chromebook Compiler: gcc-10 (gcc (Debian 10.2.1-6) 10.2.1 20210110) Plain log:
https://storage.kernelci.org//stable-rc/linux-5.15.y/v5.15.112-274-gcd3aaa9…
HTML log:
https://storage.kernelci.org//stable-rc/linux-5.15.y/v5.15.112-274-gcd3aaa9…
Rootfs:
http://storage.kernelci.org/images/rootfs/buildroot/buildroot-baseline/2023…
* baseline.bootrr.deferred-probe-empty:
https://kernelci.org/test/case/id/6473cf9508f8b0f9582e85f7
failing since 61 days (last pass: v5.15.104, first fail: v5.15.104-147-gea115396267e) 2023-05-28T22:02:45.568706 + set +x 2023-05-28T22:02:45.574472 <8>[ 11.149816] <LAVA_SIGNAL_ENDRUN 0_dmesg 10499475_1.4.2.3.1> 2023-05-28T22:02:45.682581 / # # 2023-05-28T22:02:45.784906 export SHELL=/bin/sh 2023-05-28T22:02:45.785624 # 2023-05-28T22:02:45.887063 / # export SHELL=/bin/sh. /lava-10499475/environment 2023-05-28T22:02:45.887835 2023-05-28T22:02:45.989312 / # . /lava-10499475/environment/lava-10499475/bin/lava-test-runner /lava-10499475/1 2023-05-28T22:02:45.990555 2023-05-28T22:02:45.996295 / # /lava-10499475/bin/lava-test-runner /lava-10499475/1 ... (12 line(s) more) platform | arch | lab | compiler | defconfig | regressions -----------------------------+--------+---------------+----------+------------------------------+------------ asus-CM1400CXA-dalboz | x86_64 | lab-collabora | gcc-10 | x86_64_defcon...6-chromebook | 1 Details:
https://kernelci.org/test/plan/id/6473cf9b0b4d9dd1922e85fa
Results: 6 PASS, 1 FAIL, 0 SKIP Full config: x86_64_defconfig+x86-chromebook Compiler: gcc-10 (gcc (Debian 10.2.1-6) 10.2.1 20210110) Plain log:
https://storage.kernelci.org//stable-rc/linux-5.15.y/v5.15.112-274-gcd3aaa9…
HTML log:
https://storage.kernelci.org//stable-rc/linux-5.15.y/v5.15.112-274-gcd3aaa9…
Rootfs:
http://storage.kernelci.org/images/rootfs/buildroot/buildroot-baseline/2023…
* baseline.bootrr.deferred-probe-empty:
https://kernelci.org/test/case/id/6473cf9b0b4d9dd1922e85ff
failing since 61 days (last pass: v5.15.104, first fail: v5.15.104-147-gea115396267e) 2023-05-28T22:02:45.587295 + set<8>[ 10.195868] <LAVA_SIGNAL_ENDRUN 0_dmesg 10499496_1.4.2.3.1> 2023-05-28T22:02:45.587410 +x 2023-05-28T22:02:45.692154 / # # 2023-05-28T22:02:45.792846 export SHELL=/bin/sh 2023-05-28T22:02:45.793104 # 2023-05-28T22:02:45.893680 / # export SHELL=/bin/sh. /lava-10499496/environment 2023-05-28T22:02:45.893900 2023-05-28T22:02:45.994415 / # . /lava-10499496/environment/lava-10499496/bin/lava-test-runner /lava-10499496/1 2023-05-28T22:02:45.994772 2023-05-28T22:02:45.998882 / # /lava-10499496/bin/lava-test-runner /lava-10499496/1 ... (12 line(s) more) platform | arch | lab | compiler | defconfig | regressions -----------------------------+--------+---------------+----------+------------------------------+------------ asus-cx9400-volteer | x86_64 | lab-collabora | gcc-10 | x86_64_defcon...6-chromebook | 1 Details:
https://kernelci.org/test/plan/id/6473cfa4e2a0e362562e8616
Results: 6 PASS, 1 FAIL, 0 SKIP Full config: x86_64_defconfig+x86-chromebook Compiler: gcc-10 (gcc (Debian 10.2.1-6) 10.2.1 20210110) Plain log:
https://storage.kernelci.org//stable-rc/linux-5.15.y/v5.15.112-274-gcd3aaa9…
HTML log:
https://storage.kernelci.org//stable-rc/linux-5.15.y/v5.15.112-274-gcd3aaa9…
Rootfs:
http://storage.kernelci.org/images/rootfs/buildroot/buildroot-baseline/2023…
* baseline.bootrr.deferred-probe-empty:
https://kernelci.org/test/case/id/6473cfa4e2a0e362562e861b
failing since 61 days (last pass: v5.15.104, first fail: v5.15.104-147-gea115396267e) 2023-05-28T22:02:55.326324 <8>[ 16.903381] <LAVA_SIGNAL_ENDRUN 0_dmesg 10499531_1.4.2.3.1> 2023-05-28T22:02:55.329290 + set +x 2023-05-28T22:02:55.430916 2023-05-28T22:02:55.531561 / # #export SHELL=/bin/sh 2023-05-28T22:02:55.531776 2023-05-28T22:02:55.632313 / # export SHELL=/bin/sh. /lava-10499531/environment 2023-05-28T22:02:55.632519 2023-05-28T22:02:55.733040 / # . /lava-10499531/environment/lava-10499531/bin/lava-test-runner /lava-10499531/1 2023-05-28T22:02:55.733340 2023-05-28T22:02:55.738295 / # /lava-10499531/bin/lava-test-runner /lava-10499531/1 ... (12 line(s) more) platform | arch | lab | compiler | defconfig | regressions -----------------------------+--------+---------------+----------+------------------------------+------------ beagle-xm | arm | lab-baylibre | gcc-10 | omap2plus_defconfig | 1 Details:
https://kernelci.org/test/plan/id/6473ced6c6a64524f72e8624
Results: 0 PASS, 1 FAIL, 0 SKIP Full config: omap2plus_defconfig Compiler: gcc-10 (arm-linux-gnueabihf-gcc (Debian 10.2.1-6) 10.2.1 20210110) Plain log:
https://storage.kernelci.org//stable-rc/linux-5.15.y/v5.15.112-274-gcd3aaa9…
HTML log:
https://storage.kernelci.org//stable-rc/linux-5.15.y/v5.15.112-274-gcd3aaa9…
Rootfs:
http://storage.kernelci.org/images/rootfs/buildroot/buildroot-baseline/2023…
* baseline.login:
https://kernelci.org/test/case/id/6473ced6c6a64524f72e8625
failing since 381 days (last pass: v5.15.37-259-gab77581473a3, first fail: v5.15.39) platform | arch | lab | compiler | defconfig | regressions -----------------------------+--------+---------------+----------+------------------------------+------------ cubietruck | arm | lab-baylibre | gcc-10 | multi_v7_defconfig | 1 Details:
https://kernelci.org/test/plan/id/6473cf26b9ffd1cc562e86ba
Results: 5 PASS, 1 FAIL, 1 SKIP Full config: multi_v7_defconfig Compiler: gcc-10 (arm-linux-gnueabihf-gcc (Debian 10.2.1-6) 10.2.1 20210110) Plain log:
https://storage.kernelci.org//stable-rc/linux-5.15.y/v5.15.112-274-gcd3aaa9…
HTML log:
https://storage.kernelci.org//stable-rc/linux-5.15.y/v5.15.112-274-gcd3aaa9…
Rootfs:
http://storage.kernelci.org/images/rootfs/buildroot/buildroot-baseline/2023…
* baseline.bootrr.deferred-probe-empty:
https://kernelci.org/test/case/id/6473cf26b9ffd1cc562e86bf
failing since 131 days (last pass: v5.15.82-124-gd731c63c25d1, first fail: v5.15.87-101-g5bcc318cb4cd) 2023-05-28T22:00:58.242009 <8>[ 9.991599] <LAVA_SIGNAL_ENDRUN 0_dmesg 3628289_1.5.2.4.1> 2023-05-28T22:00:58.352176 / # # 2023-05-28T22:00:58.455570 export SHELL=/bin/sh 2023-05-28T22:00:58.456670 # 2023-05-28T22:00:58.559206 / # export SHELL=/bin/sh. /lava-3628289/environment 2023-05-28T22:00:58.560467 2023-05-28T22:00:58.561076 / # <3>[ 10.273248] Bluetooth: hci0: command 0xfc18 tx timeout 2023-05-28T22:00:58.663666 . /lava-3628289/environment/lava-3628289/bin/lava-test-runner /lava-3628289/1 2023-05-28T22:00:58.665554 2023-05-28T22:00:58.669844 / # /lava-3628289/bin/lava-test-runner /lava-3628289/1 ... (12 line(s) more) platform | arch | lab | compiler | defconfig | regressions -----------------------------+--------+---------------+----------+------------------------------+------------ hp-x360-12b-c...4020-octopus | x86_64 | lab-collabora | gcc-10 | x86_64_defcon...6-chromebook | 1 Details:
https://kernelci.org/test/plan/id/6473cf8dbc65554a5b2e85f8
Results: 6 PASS, 1 FAIL, 0 SKIP Full config: x86_64_defconfig+x86-chromebook Compiler: gcc-10 (gcc (Debian 10.2.1-6) 10.2.1 20210110) Plain log:
https://storage.kernelci.org//stable-rc/linux-5.15.y/v5.15.112-274-gcd3aaa9…
HTML log:
https://storage.kernelci.org//stable-rc/linux-5.15.y/v5.15.112-274-gcd3aaa9…
Rootfs:
http://storage.kernelci.org/images/rootfs/buildroot/buildroot-baseline/2023…
* baseline.bootrr.deferred-probe-empty:
https://kernelci.org/test/case/id/6473cf8dbc65554a5b2e85fd
failing since 61 days (last pass: v5.15.104, first fail: v5.15.104-147-gea115396267e) 2023-05-28T22:02:42.734657 + set +x 2023-05-28T22:02:42.741310 <8>[ 11.506894] <LAVA_SIGNAL_ENDRUN 0_dmesg 10499515_1.4.2.3.1> 2023-05-28T22:02:42.845618 / # # 2023-05-28T22:02:42.946325 export SHELL=/bin/sh 2023-05-28T22:02:42.946524 # 2023-05-28T22:02:43.047009 / # export SHELL=/bin/sh. /lava-10499515/environment 2023-05-28T22:02:43.047228 2023-05-28T22:02:43.147736 / # . /lava-10499515/environment/lava-10499515/bin/lava-test-runner /lava-10499515/1 2023-05-28T22:02:43.148092 2023-05-28T22:02:43.152903 / # /lava-10499515/bin/lava-test-runner /lava-10499515/1 ... (12 line(s) more) platform | arch | lab | compiler | defconfig | regressions -----------------------------+--------+---------------+----------+------------------------------+------------ hp-x360-14-G1-sona | x86_64 | lab-collabora | gcc-10 | x86_64_defcon...6-chromebook | 1 Details:
https://kernelci.org/test/plan/id/6473cf891cdbc76e252e865c
Results: 6 PASS, 1 FAIL, 0 SKIP Full config: x86_64_defconfig+x86-chromebook Compiler: gcc-10 (gcc (Debian 10.2.1-6) 10.2.1 20210110) Plain log:
https://storage.kernelci.org//stable-rc/linux-5.15.y/v5.15.112-274-gcd3aaa9…
HTML log:
https://storage.kernelci.org//stable-rc/linux-5.15.y/v5.15.112-274-gcd3aaa9…
Rootfs:
http://storage.kernelci.org/images/rootfs/buildroot/buildroot-baseline/2023…
* baseline.bootrr.deferred-probe-empty:
https://kernelci.org/test/case/id/6473cf891cdbc76e252e8661
failing since 61 days (last pass: v5.15.104, first fail: v5.15.104-147-gea115396267e) 2023-05-28T22:02:34.595367 <8>[ 10.686318] <LAVA_SIGNAL_ENDRUN 0_dmesg 10499547_1.4.2.3.1> 2023-05-28T22:02:34.598590 + set +x 2023-05-28T22:02:34.703544 / # # 2023-05-28T22:02:34.804205 export SHELL=/bin/sh 2023-05-28T22:02:34.804398 # 2023-05-28T22:02:34.904931 / # export SHELL=/bin/sh. /lava-10499547/environment 2023-05-28T22:02:34.905156 2023-05-28T22:02:35.005737 / # . /lava-10499547/environment/lava-10499547/bin/lava-test-runner /lava-10499547/1 2023-05-28T22:02:35.006019 2023-05-28T22:02:35.010595 / # /lava-10499547/bin/lava-test-runner /lava-10499547/1 ... (12 line(s) more) platform | arch | lab | compiler | defconfig | regressions -----------------------------+--------+---------------+----------+------------------------------+------------ hp-x360-14a-cb0001xx-zork | x86_64 | lab-collabora | gcc-10 | x86_64_defcon...6-chromebook | 1 Details:
https://kernelci.org/test/plan/id/6473cfa4e2a0e362562e860b
Results: 6 PASS, 1 FAIL, 0 SKIP Full config: x86_64_defconfig+x86-chromebook Compiler: gcc-10 (gcc (Debian 10.2.1-6) 10.2.1 20210110) Plain log:
https://storage.kernelci.org//stable-rc/linux-5.15.y/v5.15.112-274-gcd3aaa9…
HTML log:
https://storage.kernelci.org//stable-rc/linux-5.15.y/v5.15.112-274-gcd3aaa9…
Rootfs:
http://storage.kernelci.org/images/rootfs/buildroot/buildroot-baseline/2023…
* baseline.bootrr.deferred-probe-empty:
https://kernelci.org/test/case/id/6473cfa4e2a0e362562e8610
failing since 61 days (last pass: v5.15.104, first fail: v5.15.104-147-gea115396267e) 2023-05-28T22:02:49.330822 + set<8>[ 11.306308] <LAVA_SIGNAL_ENDRUN 0_dmesg 10499503_1.4.2.3.1> 2023-05-28T22:02:49.330906 +x 2023-05-28T22:02:49.434971 / # # 2023-05-28T22:02:49.535615 export SHELL=/bin/sh 2023-05-28T22:02:49.535801 # 2023-05-28T22:02:49.636310 / # export SHELL=/bin/sh. /lava-10499503/environment 2023-05-28T22:02:49.636527 2023-05-28T22:02:49.737067 / # . /lava-10499503/environment/lava-10499503/bin/lava-test-runner /lava-10499503/1 2023-05-28T22:02:49.737402 2023-05-28T22:02:49.742399 / # /lava-10499503/bin/lava-test-runner /lava-10499503/1 ... (12 line(s) more) platform | arch | lab | compiler | defconfig | regressions -----------------------------+--------+---------------+----------+------------------------------+------------ lenovo-TPad-C13-Yoga-zork | x86_64 | lab-collabora | gcc-10 | x86_64_defcon...6-chromebook | 1 Details:
https://kernelci.org/test/plan/id/6473cf73a99f6a50442e8663
Results: 6 PASS, 1 FAIL, 0 SKIP Full config: x86_64_defconfig+x86-chromebook Compiler: gcc-10 (gcc (Debian 10.2.1-6) 10.2.1 20210110) Plain log:
https://storage.kernelci.org//stable-rc/linux-5.15.y/v5.15.112-274-gcd3aaa9…
HTML log:
https://storage.kernelci.org//stable-rc/linux-5.15.y/v5.15.112-274-gcd3aaa9…
Rootfs:
http://storage.kernelci.org/images/rootfs/buildroot/buildroot-baseline/2023…
* baseline.bootrr.deferred-probe-empty:
https://kernelci.org/test/case/id/6473cf73a99f6a50442e8668
failing since 61 days (last pass: v5.15.104, first fail: v5.15.104-147-gea115396267e) 2023-05-28T22:02:12.625336 <8>[ 11.545507] <LAVA_SIGNAL_ENDRUN 0_dmesg 10499472_1.4.2.3.1> 2023-05-28T22:02:12.729743 / # # 2023-05-28T22:02:12.830376 export SHELL=/bin/sh 2023-05-28T22:02:12.830585 # 2023-05-28T22:02:12.931113 / # export SHELL=/bin/sh. /lava-10499472/environment 2023-05-28T22:02:12.931294 2023-05-28T22:02:13.031867 / # . /lava-10499472/environment/lava-10499472/bin/lava-test-runner /lava-10499472/1 2023-05-28T22:02:13.032217 2023-05-28T22:02:13.037161 / # /lava-10499472/bin/lava-test-runner /lava-10499472/1 2023-05-28T22:02:13.042460 + export 'TESTRUN_ID=1_bootrr' ... (11 line(s) more) platform | arch | lab | compiler | defconfig | regressions -----------------------------+--------+---------------+----------+------------------------------+------------ mt8183-kukui-...uniper-sku16 | arm64 | lab-collabora | gcc-10 | defconfig+arm64-chromebook | 4 Details:
https://kernelci.org/test/plan/id/6473ce47d69c32833f2e8690
Results: 153 PASS, 14 FAIL, 0 SKIP Full config: defconfig+arm64-chromebook Compiler: gcc-10 (aarch64-linux-gnu-gcc (Debian 10.2.1-6) 10.2.1 20210110) Plain log:
https://storage.kernelci.org//stable-rc/linux-5.15.y/v5.15.112-274-gcd3aaa9…
HTML log:
https://storage.kernelci.org//stable-rc/linux-5.15.y/v5.15.112-274-gcd3aaa9…
Rootfs:
http://storage.kernelci.org/images/rootfs/buildroot/buildroot-baseline/2023…
* baseline.bootrr.generic-adc-thermal-probed:
https://kernelci.org/test/case/id/6473ce47d69c32833f2e86aa
failing since 13 days (last pass: v5.15.110, first fail: v5.15.111-130-g93ae50a86a5dd) 2023-05-28T21:57:08.883578 /lava-10499387/1/../bin/lava-test-case 2023-05-28T21:57:08.889862 <8>[ 61.630241] <LAVA_SIGNAL_TESTCASE TEST_CASE_ID=generic-adc-thermal-probed RESULT=fail> * baseline.bootrr.generic-adc-thermal-probed:
https://kernelci.org/test/case/id/6473ce47d69c32833f2e86aa
failing since 13 days (last pass: v5.15.110, first fail: v5.15.111-130-g93ae50a86a5dd) 2023-05-28T21:57:08.883578 /lava-10499387/1/../bin/lava-test-case 2023-05-28T21:57:08.889862 <8>[ 61.630241] <LAVA_SIGNAL_TESTCASE TEST_CASE_ID=generic-adc-thermal-probed RESULT=fail> * baseline.bootrr.mt6577-auxadc-probed:
https://kernelci.org/test/case/id/6473ce47d69c32833f2e86ac
failing since 13 days (last pass: v5.15.110, first fail: v5.15.111-130-g93ae50a86a5dd) 2023-05-28T21:57:07.843152 /lava-10499387/1/../bin/lava-test-case 2023-05-28T21:57:07.849299 <8>[ 60.589758] <LAVA_SIGNAL_TESTCASE TEST_CASE_ID=mt6577-auxadc-probed RESULT=fail> * baseline.bootrr.deferred-probe-empty:
https://kernelci.org/test/case/id/6473ce48d69c32833f2e8734
failing since 13 days (last pass: v5.15.110, first fail: v5.15.111-130-g93ae50a86a5dd) 2023-05-28T21:56:53.665898 + set +x 2023-05-28T21:56:53.671896 <8>[ 46.412064] <LAVA_SIGNAL_ENDRUN 0_dmesg 10499387_1.5.2.3.1> 2023-05-28T21:56:53.780855 / # # 2023-05-28T21:56:53.883244 export SHELL=/bin/sh 2023-05-28T21:56:53.884098 # 2023-05-28T21:56:53.985617 / # export SHELL=/bin/sh. /lava-10499387/environment 2023-05-28T21:56:53.986622 2023-05-28T21:56:54.088657 / # . /lava-10499387/environment/lava-10499387/bin/lava-test-runner /lava-10499387/1 2023-05-28T21:56:54.089912 2023-05-28T21:56:54.095591 / # /lava-10499387/bin/lava-test-runner /lava-10499387/1 ... (13 line(s) more)
[View Less]
1 year, 9 months
1
0
0
0
stable-rc/linux-4.14.y baseline: 131 runs, 28 regressions (v4.14.315-87-g102232d7564c)
by kernelci.org bot
stable-rc/linux-4.14.y baseline: 131 runs, 28 regressions (v4.14.315-87-g102232d7564c) Regressions Summary ------------------- platform | arch | lab | compiler | defconfig | regressions ---------------------------+-------+---------------+----------+----------------------------+------------ meson-gxl-s905x-khadas-vim | arm64 | lab-baylibre | gcc-10 | defconfig | 1 meson8b-odroidc1 | arm | lab-baylibre |
…
[View More]
gcc-10 | multi_v7_defconfig | 1 qemu_arm64-virt-gicv2 | arm64 | lab-baylibre | gcc-10 | defconfig | 1 qemu_arm64-virt-gicv2 | arm64 | lab-baylibre | gcc-10 | defconfig+arm64-chromebook | 1 qemu_arm64-virt-gicv2 | arm64 | lab-broonie | gcc-10 | defconfig | 1 qemu_arm64-virt-gicv2 | arm64 | lab-broonie | gcc-10 | defconfig+arm64-chromebook | 1 qemu_arm64-virt-gicv2 | arm64 | lab-collabora | gcc-10 | defconfig | 1 qemu_arm64-virt-gicv2 | arm64 | lab-collabora | gcc-10 | defconfig+arm64-chromebook | 1 qemu_arm64-virt-gicv2-uefi | arm64 | lab-baylibre | gcc-10 | defconfig | 1 qemu_arm64-virt-gicv2-uefi | arm64 | lab-baylibre | gcc-10 | defconfig+arm64-chromebook | 1 qemu_arm64-virt-gicv2-uefi | arm64 | lab-broonie | gcc-10 | defconfig | 1 qemu_arm64-virt-gicv2-uefi | arm64 | lab-broonie | gcc-10 | defconfig+arm64-chromebook | 1 qemu_arm64-virt-gicv2-uefi | arm64 | lab-collabora | gcc-10 | defconfig | 1 qemu_arm64-virt-gicv2-uefi | arm64 | lab-collabora | gcc-10 | defconfig+arm64-chromebook | 1 qemu_arm64-virt-gicv3 | arm64 | lab-baylibre | gcc-10 | defconfig | 1 qemu_arm64-virt-gicv3 | arm64 | lab-baylibre | gcc-10 | defconfig+arm64-chromebook | 1 qemu_arm64-virt-gicv3 | arm64 | lab-broonie | gcc-10 | defconfig | 1 qemu_arm64-virt-gicv3 | arm64 | lab-broonie | gcc-10 | defconfig+arm64-chromebook | 1 qemu_arm64-virt-gicv3 | arm64 | lab-collabora | gcc-10 | defconfig | 1 qemu_arm64-virt-gicv3 | arm64 | lab-collabora | gcc-10 | defconfig+arm64-chromebook | 1 qemu_arm64-virt-gicv3-uefi | arm64 | lab-baylibre | gcc-10 | defconfig | 1 qemu_arm64-virt-gicv3-uefi | arm64 | lab-baylibre | gcc-10 | defconfig+arm64-chromebook | 1 qemu_arm64-virt-gicv3-uefi | arm64 | lab-broonie | gcc-10 | defconfig | 1 qemu_arm64-virt-gicv3-uefi | arm64 | lab-broonie | gcc-10 | defconfig+arm64-chromebook | 1 qemu_arm64-virt-gicv3-uefi | arm64 | lab-collabora | gcc-10 | defconfig | 1 qemu_arm64-virt-gicv3-uefi | arm64 | lab-collabora | gcc-10 | defconfig+arm64-chromebook | 1 rk3399-gru-kevin | arm64 | lab-collabora | gcc-10 | defconfig+arm64-chromebook | 2 Details:
https://kernelci.org/test/job/stable-rc/branch/linux-4.14.y/kernel/v4.14.31…
Test: baseline Tree: stable-rc Branch: linux-4.14.y Describe: v4.14.315-87-g102232d7564c URL:
https://git.kernel.org/pub/scm/linux/kernel/git/stable/linux-stable-rc.git
SHA: 102232d7564c0309a3860a21180d09bb04978f5f Test Regressions ---------------- platform | arch | lab | compiler | defconfig | regressions ---------------------------+-------+---------------+----------+----------------------------+------------ meson-gxl-s905x-khadas-vim | arm64 | lab-baylibre | gcc-10 | defconfig | 1 Details:
https://kernelci.org/test/plan/id/6473c78386372b25462e8600
Results: 0 PASS, 1 FAIL, 0 SKIP Full config: defconfig Compiler: gcc-10 (aarch64-linux-gnu-gcc (Debian 10.2.1-6) 10.2.1 20210110) Plain log:
https://storage.kernelci.org//stable-rc/linux-4.14.y/v4.14.315-87-g102232d7…
HTML log:
https://storage.kernelci.org//stable-rc/linux-4.14.y/v4.14.315-87-g102232d7…
Rootfs:
http://storage.kernelci.org/images/rootfs/buildroot/buildroot-baseline/2023…
* baseline.login:
https://kernelci.org/test/case/id/6473c78386372b25462e8601
failing since 327 days (last pass: v4.14.285, first fail: v4.14.286) platform | arch | lab | compiler | defconfig | regressions ---------------------------+-------+---------------+----------+----------------------------+------------ meson8b-odroidc1 | arm | lab-baylibre | gcc-10 | multi_v7_defconfig | 1 Details:
https://kernelci.org/test/plan/id/6473c99bdebaf63f1a2e85f4
Results: 0 PASS, 1 FAIL, 0 SKIP Full config: multi_v7_defconfig Compiler: gcc-10 (arm-linux-gnueabihf-gcc (Debian 10.2.1-6) 10.2.1 20210110) Plain log:
https://storage.kernelci.org//stable-rc/linux-4.14.y/v4.14.315-87-g102232d7…
HTML log:
https://storage.kernelci.org//stable-rc/linux-4.14.y/v4.14.315-87-g102232d7…
Rootfs:
http://storage.kernelci.org/images/rootfs/buildroot/buildroot-baseline/2023…
* baseline.login:
https://kernelci.org/test/case/id/6473c99bdebaf63f1a2e85f5
failing since 468 days (last pass: v4.14.266, first fail: v4.14.266-45-gce409501ca5f) platform | arch | lab | compiler | defconfig | regressions ---------------------------+-------+---------------+----------+----------------------------+------------ qemu_arm64-virt-gicv2 | arm64 | lab-baylibre | gcc-10 | defconfig | 1 Details:
https://kernelci.org/test/plan/id/6473c793ffbaa9dd4a2e85f6
Results: 0 PASS, 1 FAIL, 0 SKIP Full config: defconfig Compiler: gcc-10 (aarch64-linux-gnu-gcc (Debian 10.2.1-6) 10.2.1 20210110) Plain log:
https://storage.kernelci.org//stable-rc/linux-4.14.y/v4.14.315-87-g102232d7…
HTML log:
https://storage.kernelci.org//stable-rc/linux-4.14.y/v4.14.315-87-g102232d7…
Rootfs:
http://storage.kernelci.org/images/rootfs/buildroot/buildroot-baseline/2023…
* baseline.login:
https://kernelci.org/test/case/id/6473c793ffbaa9dd4a2e85f7
failing since 383 days (last pass: v4.14.277-55-gfb8b8dfe0168, first fail: v4.14.277-79-ga6b67a30bbcc) platform | arch | lab | compiler | defconfig | regressions ---------------------------+-------+---------------+----------+----------------------------+------------ qemu_arm64-virt-gicv2 | arm64 | lab-baylibre | gcc-10 | defconfig+arm64-chromebook | 1 Details:
https://kernelci.org/test/plan/id/6473c8600b3a95df892e8624
Results: 0 PASS, 1 FAIL, 0 SKIP Full config: defconfig+arm64-chromebook Compiler: gcc-10 (aarch64-linux-gnu-gcc (Debian 10.2.1-6) 10.2.1 20210110) Plain log:
https://storage.kernelci.org//stable-rc/linux-4.14.y/v4.14.315-87-g102232d7…
HTML log:
https://storage.kernelci.org//stable-rc/linux-4.14.y/v4.14.315-87-g102232d7…
Rootfs:
http://storage.kernelci.org/images/rootfs/buildroot/buildroot-baseline/2023…
* baseline.login:
https://kernelci.org/test/case/id/6473c8600b3a95df892e8625
failing since 384 days (last pass: v4.14.277-55-gfb8b8dfe0168, first fail: v4.14.277-71-geacdf1a71409) platform | arch | lab | compiler | defconfig | regressions ---------------------------+-------+---------------+----------+----------------------------+------------ qemu_arm64-virt-gicv2 | arm64 | lab-broonie | gcc-10 | defconfig | 1 Details:
https://kernelci.org/test/plan/id/6473ca72eea98f3d262e8609
Results: 0 PASS, 1 FAIL, 0 SKIP Full config: defconfig Compiler: gcc-10 (aarch64-linux-gnu-gcc (Debian 10.2.1-6) 10.2.1 20210110) Plain log:
https://storage.kernelci.org//stable-rc/linux-4.14.y/v4.14.315-87-g102232d7…
HTML log:
https://storage.kernelci.org//stable-rc/linux-4.14.y/v4.14.315-87-g102232d7…
Rootfs:
http://storage.kernelci.org/images/rootfs/buildroot/buildroot-baseline/2023…
* baseline.login:
https://kernelci.org/test/case/id/6473ca72eea98f3d262e860a
failing since 383 days (last pass: v4.14.277-55-gfb8b8dfe0168, first fail: v4.14.277-79-ga6b67a30bbcc) platform | arch | lab | compiler | defconfig | regressions ---------------------------+-------+---------------+----------+----------------------------+------------ qemu_arm64-virt-gicv2 | arm64 | lab-broonie | gcc-10 | defconfig+arm64-chromebook | 1 Details:
https://kernelci.org/test/plan/id/6473ccdfe5147ea78a2e8605
Results: 0 PASS, 1 FAIL, 0 SKIP Full config: defconfig+arm64-chromebook Compiler: gcc-10 (aarch64-linux-gnu-gcc (Debian 10.2.1-6) 10.2.1 20210110) Plain log:
https://storage.kernelci.org//stable-rc/linux-4.14.y/v4.14.315-87-g102232d7…
HTML log:
https://storage.kernelci.org//stable-rc/linux-4.14.y/v4.14.315-87-g102232d7…
Rootfs:
http://storage.kernelci.org/images/rootfs/buildroot/buildroot-baseline/2023…
* baseline.login:
https://kernelci.org/test/case/id/6473ccdfe5147ea78a2e8606
failing since 384 days (last pass: v4.14.277-55-gfb8b8dfe0168, first fail: v4.14.277-71-geacdf1a71409) platform | arch | lab | compiler | defconfig | regressions ---------------------------+-------+---------------+----------+----------------------------+------------ qemu_arm64-virt-gicv2 | arm64 | lab-collabora | gcc-10 | defconfig | 1 Details:
https://kernelci.org/test/plan/id/6473c7c25b3bcfbb1d2e85ed
Results: 0 PASS, 1 FAIL, 0 SKIP Full config: defconfig Compiler: gcc-10 (aarch64-linux-gnu-gcc (Debian 10.2.1-6) 10.2.1 20210110) Plain log:
https://storage.kernelci.org//stable-rc/linux-4.14.y/v4.14.315-87-g102232d7…
HTML log:
https://storage.kernelci.org//stable-rc/linux-4.14.y/v4.14.315-87-g102232d7…
Rootfs:
http://storage.kernelci.org/images/rootfs/buildroot/buildroot-baseline/2023…
* baseline.login:
https://kernelci.org/test/case/id/6473c7c25b3bcfbb1d2e85ee
failing since 383 days (last pass: v4.14.277-55-gfb8b8dfe0168, first fail: v4.14.277-79-ga6b67a30bbcc) platform | arch | lab | compiler | defconfig | regressions ---------------------------+-------+---------------+----------+----------------------------+------------ qemu_arm64-virt-gicv2 | arm64 | lab-collabora | gcc-10 | defconfig+arm64-chromebook | 1 Details:
https://kernelci.org/test/plan/id/6473c8aaf55a5c945f2e8656
Results: 0 PASS, 1 FAIL, 0 SKIP Full config: defconfig+arm64-chromebook Compiler: gcc-10 (aarch64-linux-gnu-gcc (Debian 10.2.1-6) 10.2.1 20210110) Plain log:
https://storage.kernelci.org//stable-rc/linux-4.14.y/v4.14.315-87-g102232d7…
HTML log:
https://storage.kernelci.org//stable-rc/linux-4.14.y/v4.14.315-87-g102232d7…
Rootfs:
http://storage.kernelci.org/images/rootfs/buildroot/buildroot-baseline/2023…
* baseline.login:
https://kernelci.org/test/case/id/6473c8aaf55a5c945f2e8657
failing since 384 days (last pass: v4.14.277-55-gfb8b8dfe0168, first fail: v4.14.277-71-geacdf1a71409) platform | arch | lab | compiler | defconfig | regressions ---------------------------+-------+---------------+----------+----------------------------+------------ qemu_arm64-virt-gicv2-uefi | arm64 | lab-baylibre | gcc-10 | defconfig | 1 Details:
https://kernelci.org/test/plan/id/6473c7966a4118ab6a2e85e9
Results: 0 PASS, 1 FAIL, 0 SKIP Full config: defconfig Compiler: gcc-10 (aarch64-linux-gnu-gcc (Debian 10.2.1-6) 10.2.1 20210110) Plain log:
https://storage.kernelci.org//stable-rc/linux-4.14.y/v4.14.315-87-g102232d7…
HTML log:
https://storage.kernelci.org//stable-rc/linux-4.14.y/v4.14.315-87-g102232d7…
Rootfs:
http://storage.kernelci.org/images/rootfs/buildroot/buildroot-baseline/2023…
* baseline.login:
https://kernelci.org/test/case/id/6473c7966a4118ab6a2e85ea
failing since 383 days (last pass: v4.14.277-55-gfb8b8dfe0168, first fail: v4.14.277-79-ga6b67a30bbcc) platform | arch | lab | compiler | defconfig | regressions ---------------------------+-------+---------------+----------+----------------------------+------------ qemu_arm64-virt-gicv2-uefi | arm64 | lab-baylibre | gcc-10 | defconfig+arm64-chromebook | 1 Details:
https://kernelci.org/test/plan/id/6473c85e0b3a95df892e8621
Results: 0 PASS, 1 FAIL, 0 SKIP Full config: defconfig+arm64-chromebook Compiler: gcc-10 (aarch64-linux-gnu-gcc (Debian 10.2.1-6) 10.2.1 20210110) Plain log:
https://storage.kernelci.org//stable-rc/linux-4.14.y/v4.14.315-87-g102232d7…
HTML log:
https://storage.kernelci.org//stable-rc/linux-4.14.y/v4.14.315-87-g102232d7…
Rootfs:
http://storage.kernelci.org/images/rootfs/buildroot/buildroot-baseline/2023…
* baseline.login:
https://kernelci.org/test/case/id/6473c85e0b3a95df892e8622
failing since 384 days (last pass: v4.14.277-55-gfb8b8dfe0168, first fail: v4.14.277-71-geacdf1a71409) platform | arch | lab | compiler | defconfig | regressions ---------------------------+-------+---------------+----------+----------------------------+------------ qemu_arm64-virt-gicv2-uefi | arm64 | lab-broonie | gcc-10 | defconfig | 1 Details:
https://kernelci.org/test/plan/id/6473cbb37887c34de72e85f4
Results: 0 PASS, 1 FAIL, 0 SKIP Full config: defconfig Compiler: gcc-10 (aarch64-linux-gnu-gcc (Debian 10.2.1-6) 10.2.1 20210110) Plain log:
https://storage.kernelci.org//stable-rc/linux-4.14.y/v4.14.315-87-g102232d7…
HTML log:
https://storage.kernelci.org//stable-rc/linux-4.14.y/v4.14.315-87-g102232d7…
Rootfs:
http://storage.kernelci.org/images/rootfs/buildroot/buildroot-baseline/2023…
* baseline.login:
https://kernelci.org/test/case/id/6473cbb37887c34de72e85f5
failing since 383 days (last pass: v4.14.277-55-gfb8b8dfe0168, first fail: v4.14.277-79-ga6b67a30bbcc) platform | arch | lab | compiler | defconfig | regressions ---------------------------+-------+---------------+----------+----------------------------+------------ qemu_arm64-virt-gicv2-uefi | arm64 | lab-broonie | gcc-10 | defconfig+arm64-chromebook | 1 Details:
https://kernelci.org/test/plan/id/6473cc534ba8da698d2e85ec
Results: 0 PASS, 1 FAIL, 0 SKIP Full config: defconfig+arm64-chromebook Compiler: gcc-10 (aarch64-linux-gnu-gcc (Debian 10.2.1-6) 10.2.1 20210110) Plain log:
https://storage.kernelci.org//stable-rc/linux-4.14.y/v4.14.315-87-g102232d7…
HTML log:
https://storage.kernelci.org//stable-rc/linux-4.14.y/v4.14.315-87-g102232d7…
Rootfs:
http://storage.kernelci.org/images/rootfs/buildroot/buildroot-baseline/2023…
* baseline.login:
https://kernelci.org/test/case/id/6473cc534ba8da698d2e85ed
failing since 384 days (last pass: v4.14.277-55-gfb8b8dfe0168, first fail: v4.14.277-71-geacdf1a71409) platform | arch | lab | compiler | defconfig | regressions ---------------------------+-------+---------------+----------+----------------------------+------------ qemu_arm64-virt-gicv2-uefi | arm64 | lab-collabora | gcc-10 | defconfig | 1 Details:
https://kernelci.org/test/plan/id/6473c8311c5bdc60aa2e85e6
Results: 0 PASS, 1 FAIL, 0 SKIP Full config: defconfig Compiler: gcc-10 (aarch64-linux-gnu-gcc (Debian 10.2.1-6) 10.2.1 20210110) Plain log:
https://storage.kernelci.org//stable-rc/linux-4.14.y/v4.14.315-87-g102232d7…
HTML log:
https://storage.kernelci.org//stable-rc/linux-4.14.y/v4.14.315-87-g102232d7…
Rootfs:
http://storage.kernelci.org/images/rootfs/buildroot/buildroot-baseline/2023…
* baseline.login:
https://kernelci.org/test/case/id/6473c8311c5bdc60aa2e85e7
failing since 383 days (last pass: v4.14.277-55-gfb8b8dfe0168, first fail: v4.14.277-79-ga6b67a30bbcc) platform | arch | lab | compiler | defconfig | regressions ---------------------------+-------+---------------+----------+----------------------------+------------ qemu_arm64-virt-gicv2-uefi | arm64 | lab-collabora | gcc-10 | defconfig+arm64-chromebook | 1 Details:
https://kernelci.org/test/plan/id/6473c8a9ee07180b5c2e8639
Results: 0 PASS, 1 FAIL, 0 SKIP Full config: defconfig+arm64-chromebook Compiler: gcc-10 (aarch64-linux-gnu-gcc (Debian 10.2.1-6) 10.2.1 20210110) Plain log:
https://storage.kernelci.org//stable-rc/linux-4.14.y/v4.14.315-87-g102232d7…
HTML log:
https://storage.kernelci.org//stable-rc/linux-4.14.y/v4.14.315-87-g102232d7…
Rootfs:
http://storage.kernelci.org/images/rootfs/buildroot/buildroot-baseline/2023…
* baseline.login:
https://kernelci.org/test/case/id/6473c8a9ee07180b5c2e863a
failing since 384 days (last pass: v4.14.277-55-gfb8b8dfe0168, first fail: v4.14.277-71-geacdf1a71409) platform | arch | lab | compiler | defconfig | regressions ---------------------------+-------+---------------+----------+----------------------------+------------ qemu_arm64-virt-gicv3 | arm64 | lab-baylibre | gcc-10 | defconfig | 1 Details:
https://kernelci.org/test/plan/id/6473c7955f0808a2662e85e7
Results: 0 PASS, 1 FAIL, 0 SKIP Full config: defconfig Compiler: gcc-10 (aarch64-linux-gnu-gcc (Debian 10.2.1-6) 10.2.1 20210110) Plain log:
https://storage.kernelci.org//stable-rc/linux-4.14.y/v4.14.315-87-g102232d7…
HTML log:
https://storage.kernelci.org//stable-rc/linux-4.14.y/v4.14.315-87-g102232d7…
Rootfs:
http://storage.kernelci.org/images/rootfs/buildroot/buildroot-baseline/2023…
* baseline.login:
https://kernelci.org/test/case/id/6473c7955f0808a2662e85e8
failing since 383 days (last pass: v4.14.277-55-gfb8b8dfe0168, first fail: v4.14.277-79-ga6b67a30bbcc) platform | arch | lab | compiler | defconfig | regressions ---------------------------+-------+---------------+----------+----------------------------+------------ qemu_arm64-virt-gicv3 | arm64 | lab-baylibre | gcc-10 | defconfig+arm64-chromebook | 1 Details:
https://kernelci.org/test/plan/id/6473c847e78ea8d0a72e85f4
Results: 0 PASS, 1 FAIL, 0 SKIP Full config: defconfig+arm64-chromebook Compiler: gcc-10 (aarch64-linux-gnu-gcc (Debian 10.2.1-6) 10.2.1 20210110) Plain log:
https://storage.kernelci.org//stable-rc/linux-4.14.y/v4.14.315-87-g102232d7…
HTML log:
https://storage.kernelci.org//stable-rc/linux-4.14.y/v4.14.315-87-g102232d7…
Rootfs:
http://storage.kernelci.org/images/rootfs/buildroot/buildroot-baseline/2023…
* baseline.login:
https://kernelci.org/test/case/id/6473c847e78ea8d0a72e85f5
failing since 267 days (last pass: v4.14.267-33-g871c9e115feb, first fail: v4.14.291-43-g3eabc273fb308) platform | arch | lab | compiler | defconfig | regressions ---------------------------+-------+---------------+----------+----------------------------+------------ qemu_arm64-virt-gicv3 | arm64 | lab-broonie | gcc-10 | defconfig | 1 Details:
https://kernelci.org/test/plan/id/6473cb772eca226ffc2e8651
Results: 0 PASS, 1 FAIL, 0 SKIP Full config: defconfig Compiler: gcc-10 (aarch64-linux-gnu-gcc (Debian 10.2.1-6) 10.2.1 20210110) Plain log:
https://storage.kernelci.org//stable-rc/linux-4.14.y/v4.14.315-87-g102232d7…
HTML log:
https://storage.kernelci.org//stable-rc/linux-4.14.y/v4.14.315-87-g102232d7…
Rootfs:
http://storage.kernelci.org/images/rootfs/buildroot/buildroot-baseline/2023…
* baseline.login:
https://kernelci.org/test/case/id/6473cb772eca226ffc2e8652
failing since 383 days (last pass: v4.14.277-55-gfb8b8dfe0168, first fail: v4.14.277-79-ga6b67a30bbcc) platform | arch | lab | compiler | defconfig | regressions ---------------------------+-------+---------------+----------+----------------------------+------------ qemu_arm64-virt-gicv3 | arm64 | lab-broonie | gcc-10 | defconfig+arm64-chromebook | 1 Details:
https://kernelci.org/test/plan/id/6473cbdb2649f22bf42e85f4
Results: 0 PASS, 1 FAIL, 0 SKIP Full config: defconfig+arm64-chromebook Compiler: gcc-10 (aarch64-linux-gnu-gcc (Debian 10.2.1-6) 10.2.1 20210110) Plain log:
https://storage.kernelci.org//stable-rc/linux-4.14.y/v4.14.315-87-g102232d7…
HTML log:
https://storage.kernelci.org//stable-rc/linux-4.14.y/v4.14.315-87-g102232d7…
Rootfs:
http://storage.kernelci.org/images/rootfs/buildroot/buildroot-baseline/2023…
* baseline.login:
https://kernelci.org/test/case/id/6473cbdb2649f22bf42e85f5
failing since 267 days (last pass: v4.14.267-33-g871c9e115feb, first fail: v4.14.291-43-g3eabc273fb308) platform | arch | lab | compiler | defconfig | regressions ---------------------------+-------+---------------+----------+----------------------------+------------ qemu_arm64-virt-gicv3 | arm64 | lab-collabora | gcc-10 | defconfig | 1 Details:
https://kernelci.org/test/plan/id/6473c81ef65bfe3d1c2e8618
Results: 0 PASS, 1 FAIL, 0 SKIP Full config: defconfig Compiler: gcc-10 (aarch64-linux-gnu-gcc (Debian 10.2.1-6) 10.2.1 20210110) Plain log:
https://storage.kernelci.org//stable-rc/linux-4.14.y/v4.14.315-87-g102232d7…
HTML log:
https://storage.kernelci.org//stable-rc/linux-4.14.y/v4.14.315-87-g102232d7…
Rootfs:
http://storage.kernelci.org/images/rootfs/buildroot/buildroot-baseline/2023…
* baseline.login:
https://kernelci.org/test/case/id/6473c81ef65bfe3d1c2e8619
failing since 383 days (last pass: v4.14.277-55-gfb8b8dfe0168, first fail: v4.14.277-79-ga6b67a30bbcc) platform | arch | lab | compiler | defconfig | regressions ---------------------------+-------+---------------+----------+----------------------------+------------ qemu_arm64-virt-gicv3 | arm64 | lab-collabora | gcc-10 | defconfig+arm64-chromebook | 1 Details:
https://kernelci.org/test/plan/id/6473c83ae78ea8d0a72e85eb
Results: 0 PASS, 1 FAIL, 0 SKIP Full config: defconfig+arm64-chromebook Compiler: gcc-10 (aarch64-linux-gnu-gcc (Debian 10.2.1-6) 10.2.1 20210110) Plain log:
https://storage.kernelci.org//stable-rc/linux-4.14.y/v4.14.315-87-g102232d7…
HTML log:
https://storage.kernelci.org//stable-rc/linux-4.14.y/v4.14.315-87-g102232d7…
Rootfs:
http://storage.kernelci.org/images/rootfs/buildroot/buildroot-baseline/2023…
* baseline.login:
https://kernelci.org/test/case/id/6473c83ae78ea8d0a72e85ec
failing since 267 days (last pass: v4.14.267-33-g871c9e115feb, first fail: v4.14.291-43-g3eabc273fb308) platform | arch | lab | compiler | defconfig | regressions ---------------------------+-------+---------------+----------+----------------------------+------------ qemu_arm64-virt-gicv3-uefi | arm64 | lab-baylibre | gcc-10 | defconfig | 1 Details:
https://kernelci.org/test/plan/id/6473c794feb5cee7f82e85ea
Results: 0 PASS, 1 FAIL, 0 SKIP Full config: defconfig Compiler: gcc-10 (aarch64-linux-gnu-gcc (Debian 10.2.1-6) 10.2.1 20210110) Plain log:
https://storage.kernelci.org//stable-rc/linux-4.14.y/v4.14.315-87-g102232d7…
HTML log:
https://storage.kernelci.org//stable-rc/linux-4.14.y/v4.14.315-87-g102232d7…
Rootfs:
http://storage.kernelci.org/images/rootfs/buildroot/buildroot-baseline/2023…
* baseline.login:
https://kernelci.org/test/case/id/6473c794feb5cee7f82e85eb
failing since 383 days (last pass: v4.14.277-55-gfb8b8dfe0168, first fail: v4.14.277-79-ga6b67a30bbcc) platform | arch | lab | compiler | defconfig | regressions ---------------------------+-------+---------------+----------+----------------------------+------------ qemu_arm64-virt-gicv3-uefi | arm64 | lab-baylibre | gcc-10 | defconfig+arm64-chromebook | 1 Details:
https://kernelci.org/test/plan/id/6473c85d0b3a95df892e861e
Results: 0 PASS, 1 FAIL, 0 SKIP Full config: defconfig+arm64-chromebook Compiler: gcc-10 (aarch64-linux-gnu-gcc (Debian 10.2.1-6) 10.2.1 20210110) Plain log:
https://storage.kernelci.org//stable-rc/linux-4.14.y/v4.14.315-87-g102232d7…
HTML log:
https://storage.kernelci.org//stable-rc/linux-4.14.y/v4.14.315-87-g102232d7…
Rootfs:
http://storage.kernelci.org/images/rootfs/buildroot/buildroot-baseline/2023…
* baseline.login:
https://kernelci.org/test/case/id/6473c85d0b3a95df892e861f
failing since 384 days (last pass: v4.14.277-55-gfb8b8dfe0168, first fail: v4.14.277-71-geacdf1a71409) platform | arch | lab | compiler | defconfig | regressions ---------------------------+-------+---------------+----------+----------------------------+------------ qemu_arm64-virt-gicv3-uefi | arm64 | lab-broonie | gcc-10 | defconfig | 1 Details:
https://kernelci.org/test/plan/id/6473caeb974da14af22e85f8
Results: 0 PASS, 1 FAIL, 0 SKIP Full config: defconfig Compiler: gcc-10 (aarch64-linux-gnu-gcc (Debian 10.2.1-6) 10.2.1 20210110) Plain log:
https://storage.kernelci.org//stable-rc/linux-4.14.y/v4.14.315-87-g102232d7…
HTML log:
https://storage.kernelci.org//stable-rc/linux-4.14.y/v4.14.315-87-g102232d7…
Rootfs:
http://storage.kernelci.org/images/rootfs/buildroot/buildroot-baseline/2023…
* baseline.login:
https://kernelci.org/test/case/id/6473caeb974da14af22e85f9
failing since 383 days (last pass: v4.14.277-55-gfb8b8dfe0168, first fail: v4.14.277-79-ga6b67a30bbcc) platform | arch | lab | compiler | defconfig | regressions ---------------------------+-------+---------------+----------+----------------------------+------------ qemu_arm64-virt-gicv3-uefi | arm64 | lab-broonie | gcc-10 | defconfig+arm64-chromebook | 1 Details:
https://kernelci.org/test/plan/id/6473cc2b8b5ec344d52e85f8
Results: 0 PASS, 1 FAIL, 0 SKIP Full config: defconfig+arm64-chromebook Compiler: gcc-10 (aarch64-linux-gnu-gcc (Debian 10.2.1-6) 10.2.1 20210110) Plain log:
https://storage.kernelci.org//stable-rc/linux-4.14.y/v4.14.315-87-g102232d7…
HTML log:
https://storage.kernelci.org//stable-rc/linux-4.14.y/v4.14.315-87-g102232d7…
Rootfs:
http://storage.kernelci.org/images/rootfs/buildroot/buildroot-baseline/2023…
* baseline.login:
https://kernelci.org/test/case/id/6473cc2b8b5ec344d52e85f9
failing since 384 days (last pass: v4.14.277-55-gfb8b8dfe0168, first fail: v4.14.277-71-geacdf1a71409) platform | arch | lab | compiler | defconfig | regressions ---------------------------+-------+---------------+----------+----------------------------+------------ qemu_arm64-virt-gicv3-uefi | arm64 | lab-collabora | gcc-10 | defconfig | 1 Details:
https://kernelci.org/test/plan/id/6473c81d524e6e935e2e864d
Results: 0 PASS, 1 FAIL, 0 SKIP Full config: defconfig Compiler: gcc-10 (aarch64-linux-gnu-gcc (Debian 10.2.1-6) 10.2.1 20210110) Plain log:
https://storage.kernelci.org//stable-rc/linux-4.14.y/v4.14.315-87-g102232d7…
HTML log:
https://storage.kernelci.org//stable-rc/linux-4.14.y/v4.14.315-87-g102232d7…
Rootfs:
http://storage.kernelci.org/images/rootfs/buildroot/buildroot-baseline/2023…
* baseline.login:
https://kernelci.org/test/case/id/6473c81d524e6e935e2e864e
failing since 383 days (last pass: v4.14.277-55-gfb8b8dfe0168, first fail: v4.14.277-79-ga6b67a30bbcc) platform | arch | lab | compiler | defconfig | regressions ---------------------------+-------+---------------+----------+----------------------------+------------ qemu_arm64-virt-gicv3-uefi | arm64 | lab-collabora | gcc-10 | defconfig+arm64-chromebook | 1 Details:
https://kernelci.org/test/plan/id/6473c89eee07180b5c2e861d
Results: 0 PASS, 1 FAIL, 0 SKIP Full config: defconfig+arm64-chromebook Compiler: gcc-10 (aarch64-linux-gnu-gcc (Debian 10.2.1-6) 10.2.1 20210110) Plain log:
https://storage.kernelci.org//stable-rc/linux-4.14.y/v4.14.315-87-g102232d7…
HTML log:
https://storage.kernelci.org//stable-rc/linux-4.14.y/v4.14.315-87-g102232d7…
Rootfs:
http://storage.kernelci.org/images/rootfs/buildroot/buildroot-baseline/2023…
* baseline.login:
https://kernelci.org/test/case/id/6473c89eee07180b5c2e861e
failing since 384 days (last pass: v4.14.277-55-gfb8b8dfe0168, first fail: v4.14.277-71-geacdf1a71409) platform | arch | lab | compiler | defconfig | regressions ---------------------------+-------+---------------+----------+----------------------------+------------ rk3399-gru-kevin | arm64 | lab-collabora | gcc-10 | defconfig+arm64-chromebook | 2 Details:
https://kernelci.org/test/plan/id/6473c7936d98991a122e8605
Results: 49 PASS, 23 FAIL, 2 SKIP Full config: defconfig+arm64-chromebook Compiler: gcc-10 (aarch64-linux-gnu-gcc (Debian 10.2.1-6) 10.2.1 20210110) Plain log:
https://storage.kernelci.org//stable-rc/linux-4.14.y/v4.14.315-87-g102232d7…
HTML log:
https://storage.kernelci.org//stable-rc/linux-4.14.y/v4.14.315-87-g102232d7…
Rootfs:
http://storage.kernelci.org/images/rootfs/buildroot/buildroot-baseline/2023…
* baseline.bootrr.rockchip-usb2phy1-probed:
https://kernelci.org/test/case/id/6473c7936d98991a122e864a
failing since 75 days (last pass: v4.14.308, first fail: v4.14.308-4-ge7a701196c571) 2023-05-28T21:28:27.549172 [ 49.496221] <LAVA_SIGNAL_TESTCASE TEST_CASE_ID=rockchip-usb2phy0-probed RESULT=fail> 2023-05-28T21:28:28.561690 /lava-10499155/1/../bin/lava-test-case 2023-05-28T21:28:28.571708 [ 50.520472] <LAVA_SIGNAL_TESTCASE TEST_CASE_ID=rockchip-usb2phy1-probed RESULT=fail> * baseline.bootrr.rockchip-usb2phy0-probed:
https://kernelci.org/test/case/id/6473c7936d98991a122e864b
failing since 75 days (last pass: v4.14.308, first fail: v4.14.308-4-ge7a701196c571) 2023-05-28T21:28:27.537818 /lava-10499155/1/../bin/lava-test-case
[View Less]
1 year, 9 months
1
0
0
0
[PATCH V2 3/4] irqchip/loongson-liointc: Fix IRQ trigger polarity
by Jianmin Lv
For the INT_POLARITY register of Loongson-2K series IRQ controller, '0' indicates high level or rising edge triggered, '1' indicates low level or falling edge triggered, and we can find out the information from the Loongson 2K1000LA User Manual v1.0, Table 9-2, Section 9.3 (中断寄存器描述 / Description of the Interrupt Registers). For Loongson-3 CPU series, setting INT_POLARITY register is not supported and writting it has no effect. So trigger polarity setting shouled be fixed for Loongson-2K CPU
…
[View More]
series. Fixes: 17343d0b4039 ("irqchip/loongson-liointc: Support to set IRQ type for ACPI path") Cc: stable(a)vger.kernel.org Reviewed-by: Huacai Chen <chenhuacai(a)kernel.org> Co-developed-by: Chong Qiao <qiaochong(a)loongson.cn> Signed-off-by: Chong Qiao <qiaochong(a)loongson.cn> Signed-off-by: Jianmin Lv <lvjianmin(a)loongson.cn> --- drivers/irqchip/irq-loongson-liointc.c | 12 ++++++++---- 1 file changed, 8 insertions(+), 4 deletions(-) diff --git a/drivers/irqchip/irq-loongson-liointc.c b/drivers/irqchip/irq-loongson-liointc.c index 8d00a9ad5b00..5dd9db8f8fa8 100644 --- a/drivers/irqchip/irq-loongson-liointc.c +++ b/drivers/irqchip/irq-loongson-liointc.c @@ -32,6 +32,10 @@ #define LIOINTC_REG_INTC_EN_STATUS (LIOINTC_INTC_CHIP_START + 0x04) #define LIOINTC_REG_INTC_ENABLE (LIOINTC_INTC_CHIP_START + 0x08) #define LIOINTC_REG_INTC_DISABLE (LIOINTC_INTC_CHIP_START + 0x0c) +/* + * LIOINTC_REG_INTC_POL register is only valid for Loongson-2K series, and + * Loongson-3 series behave as noops. + */ #define LIOINTC_REG_INTC_POL (LIOINTC_INTC_CHIP_START + 0x10) #define LIOINTC_REG_INTC_EDGE (LIOINTC_INTC_CHIP_START + 0x14) @@ -116,19 +120,19 @@ static int liointc_set_type(struct irq_data *data, unsigned int type) switch (type) { case IRQ_TYPE_LEVEL_HIGH: liointc_set_bit(gc, LIOINTC_REG_INTC_EDGE, mask, false); - liointc_set_bit(gc, LIOINTC_REG_INTC_POL, mask, true); + liointc_set_bit(gc, LIOINTC_REG_INTC_POL, mask, false); break; case IRQ_TYPE_LEVEL_LOW: liointc_set_bit(gc, LIOINTC_REG_INTC_EDGE, mask, false); - liointc_set_bit(gc, LIOINTC_REG_INTC_POL, mask, false); + liointc_set_bit(gc, LIOINTC_REG_INTC_POL, mask, true); break; case IRQ_TYPE_EDGE_RISING: liointc_set_bit(gc, LIOINTC_REG_INTC_EDGE, mask, true); - liointc_set_bit(gc, LIOINTC_REG_INTC_POL, mask, true); + liointc_set_bit(gc, LIOINTC_REG_INTC_POL, mask, false); break; case IRQ_TYPE_EDGE_FALLING: liointc_set_bit(gc, LIOINTC_REG_INTC_EDGE, mask, true); - liointc_set_bit(gc, LIOINTC_REG_INTC_POL, mask, false); + liointc_set_bit(gc, LIOINTC_REG_INTC_POL, mask, true); break; default: irq_gc_unlock_irqrestore(gc, flags); -- 2.31.1
[View Less]
1 year, 9 months
1
0
0
0
← Newer
1
...
26
27
28
29
30
31
32
...
188
Older →
Jump to page:
1
2
3
4
5
6
7
8
9
10
11
12
13
14
15
16
17
18
19
20
21
22
23
24
25
26
27
28
29
30
31
32
33
34
35
36
37
38
39
40
41
42
43
44
45
46
47
48
49
50
51
52
53
54
55
56
57
58
59
60
61
62
63
64
65
66
67
68
69
70
71
72
73
74
75
76
77
78
79
80
81
82
83
84
85
86
87
88
89
90
91
92
93
94
95
96
97
98
99
100
101
102
103
104
105
106
107
108
109
110
111
112
113
114
115
116
117
118
119
120
121
122
123
124
125
126
127
128
129
130
131
132
133
134
135
136
137
138
139
140
141
142
143
144
145
146
147
148
149
150
151
152
153
154
155
156
157
158
159
160
161
162
163
164
165
166
167
168
169
170
171
172
173
174
175
176
177
178
179
180
181
182
183
184
185
186
187
188
Results per page:
10
25
50
100
200