lists.linaro.org
Sign In
Sign Up
Sign In
Sign Up
Manage this list
×
Keyboard Shortcuts
Thread View
j
: Next unread message
k
: Previous unread message
j a
: Jump to all threads
j l
: Jump to MailingList overview
2025
January
2024
December
November
October
September
August
July
June
May
April
March
February
January
2023
December
November
October
September
August
July
June
May
April
March
February
January
2022
December
November
October
September
August
July
June
May
April
March
February
January
2021
December
November
October
September
August
July
June
May
April
March
February
January
2020
December
November
October
September
August
July
June
May
April
March
February
January
2019
December
November
October
September
August
July
June
May
April
March
February
January
2018
December
November
October
September
August
July
June
May
April
March
February
January
2017
December
November
List overview
Download
Linux-stable-mirror
May 2022
----- 2025 -----
January 2025
----- 2024 -----
December 2024
November 2024
October 2024
September 2024
August 2024
July 2024
June 2024
May 2024
April 2024
March 2024
February 2024
January 2024
----- 2023 -----
December 2023
November 2023
October 2023
September 2023
August 2023
July 2023
June 2023
May 2023
April 2023
March 2023
February 2023
January 2023
----- 2022 -----
December 2022
November 2022
October 2022
September 2022
August 2022
July 2022
June 2022
May 2022
April 2022
March 2022
February 2022
January 2022
----- 2021 -----
December 2021
November 2021
October 2021
September 2021
August 2021
July 2021
June 2021
May 2021
April 2021
March 2021
February 2021
January 2021
----- 2020 -----
December 2020
November 2020
October 2020
September 2020
August 2020
July 2020
June 2020
May 2020
April 2020
March 2020
February 2020
January 2020
----- 2019 -----
December 2019
November 2019
October 2019
September 2019
August 2019
July 2019
June 2019
May 2019
April 2019
March 2019
February 2019
January 2019
----- 2018 -----
December 2018
November 2018
October 2018
September 2018
August 2018
July 2018
June 2018
May 2018
April 2018
March 2018
February 2018
January 2018
----- 2017 -----
December 2017
November 2017
linux-stable-mirror@lists.linaro.org
373 participants
1579 discussions
Start a n
N
ew thread
stable-rc/queue/5.4 baseline: 109 runs, 10 regressions (v5.4.196-10-g50756fc0ce9d0)
by kernelci.org bot
stable-rc/queue/5.4 baseline: 109 runs, 10 regressions (v5.4.196-10-g50756fc0ce9d0) Regressions Summary ------------------- platform | arch | lab | compiler | defconfig | regressions ---------------------------+-------+--------------+----------+----------------------------+------------ jetson-tk1 | arm | lab-baylibre | gcc-10 | multi_v7_defconfig | 1 jetson-tk1 | arm | lab-baylibre | gcc-10 | tegra_defconfig | 1 qemu_arm64-virt-gicv2 | arm64 | lab-broonie | gcc-10 | defconfig+arm64-chromebook | 1 qemu_arm64-virt-gicv2 | arm64 | lab-broonie | gcc-10 | defconfig | 1 qemu_arm64-virt-gicv2-uefi | arm64 | lab-broonie | gcc-10 | defconfig+arm64-chromebook | 1 qemu_arm64-virt-gicv2-uefi | arm64 | lab-broonie | gcc-10 | defconfig | 1 qemu_arm64-virt-gicv3 | arm64 | lab-broonie | gcc-10 | defconfig+arm64-chromebook | 1 qemu_arm64-virt-gicv3 | arm64 | lab-broonie | gcc-10 | defconfig | 1 qemu_arm64-virt-gicv3-uefi | arm64 | lab-broonie | gcc-10 | defconfig+arm64-chromebook | 1 qemu_arm64-virt-gicv3-uefi | arm64 | lab-broonie | gcc-10 | defconfig | 1 Details:
https://kernelci.org/test/job/stable-rc/branch/queue%2F5.4/kernel/v5.4.196-…
Test: baseline Tree: stable-rc Branch: queue/5.4 Describe: v5.4.196-10-g50756fc0ce9d0 URL:
https://git.kernel.org/pub/scm/linux/kernel/git/stable/linux-stable-rc.git
SHA: 50756fc0ce9d0421f78650e84a95f1137348e720 Test Regressions ---------------- platform | arch | lab | compiler | defconfig | regressions ---------------------------+-------+--------------+----------+----------------------------+------------ jetson-tk1 | arm | lab-baylibre | gcc-10 | multi_v7_defconfig | 1 Details:
https://kernelci.org/test/plan/id/628fa88bab518e2534a39cf4
Results: 0 PASS, 1 FAIL, 0 SKIP Full config: multi_v7_defconfig Compiler: gcc-10 (arm-linux-gnueabihf-gcc (Debian 10.2.1-6) 10.2.1 20210110) Plain log:
https://storage.kernelci.org//stable-rc/queue-5.4/v5.4.196-10-g50756fc0ce9d…
HTML log:
https://storage.kernelci.org//stable-rc/queue-5.4/v5.4.196-10-g50756fc0ce9d…
Rootfs:
http://storage.kernelci.org/images/rootfs/buildroot/buildroot-baseline/2022…
* baseline.login:
https://kernelci.org/test/case/id/628fa88bab518e2534a39cf5
failing since 3 days (last pass: v5.4.193-43-g4405e358a087e, first fail: v5.4.195-59-g1d29d13f032f6) platform | arch | lab | compiler | defconfig | regressions ---------------------------+-------+--------------+----------+----------------------------+------------ jetson-tk1 | arm | lab-baylibre | gcc-10 | tegra_defconfig | 1 Details:
https://kernelci.org/test/plan/id/628fa692a58ee03251a39bd4
Results: 0 PASS, 1 FAIL, 0 SKIP Full config: tegra_defconfig Compiler: gcc-10 (arm-linux-gnueabihf-gcc (Debian 10.2.1-6) 10.2.1 20210110) Plain log:
https://storage.kernelci.org//stable-rc/queue-5.4/v5.4.196-10-g50756fc0ce9d…
HTML log:
https://storage.kernelci.org//stable-rc/queue-5.4/v5.4.196-10-g50756fc0ce9d…
Rootfs:
http://storage.kernelci.org/images/rootfs/buildroot/buildroot-baseline/2022…
* baseline.login:
https://kernelci.org/test/case/id/628fa692a58ee03251a39bd5
new failure (last pass: v5.4.196-8-g76bb630b46fa) platform | arch | lab | compiler | defconfig | regressions ---------------------------+-------+--------------+----------+----------------------------+------------ qemu_arm64-virt-gicv2 | arm64 | lab-broonie | gcc-10 | defconfig+arm64-chromebook | 1 Details:
https://kernelci.org/test/plan/id/628fa79409b871017ba39c2b
Results: 0 PASS, 1 FAIL, 0 SKIP Full config: defconfig+arm64-chromebook Compiler: gcc-10 (aarch64-linux-gnu-gcc (Debian 10.2.1-6) 10.2.1 20210110) Plain log:
https://storage.kernelci.org//stable-rc/queue-5.4/v5.4.196-10-g50756fc0ce9d…
HTML log:
https://storage.kernelci.org//stable-rc/queue-5.4/v5.4.196-10-g50756fc0ce9d…
Rootfs:
http://storage.kernelci.org/images/rootfs/buildroot/buildroot-baseline/2022…
* baseline.login:
https://kernelci.org/test/case/id/628fa79409b871017ba39c2c
failing since 16 days (last pass: v5.4.191-84-g56ce42d78d96, first fail: v5.4.191-125-g5917d1547e6e) platform | arch | lab | compiler | defconfig | regressions ---------------------------+-------+--------------+----------+----------------------------+------------ qemu_arm64-virt-gicv2 | arm64 | lab-broonie | gcc-10 | defconfig | 1 Details:
https://kernelci.org/test/plan/id/628faa515ea2929962a39be7
Results: 0 PASS, 1 FAIL, 0 SKIP Full config: defconfig Compiler: gcc-10 (aarch64-linux-gnu-gcc (Debian 10.2.1-6) 10.2.1 20210110) Plain log:
https://storage.kernelci.org//stable-rc/queue-5.4/v5.4.196-10-g50756fc0ce9d…
HTML log:
https://storage.kernelci.org//stable-rc/queue-5.4/v5.4.196-10-g50756fc0ce9d…
Rootfs:
http://storage.kernelci.org/images/rootfs/buildroot/buildroot-baseline/2022…
* baseline.login:
https://kernelci.org/test/case/id/628faa515ea2929962a39be8
failing since 16 days (last pass: v5.4.191-77-g1a3b249e415b, first fail: v5.4.191-125-g5917d1547e6e) platform | arch | lab | compiler | defconfig | regressions ---------------------------+-------+--------------+----------+----------------------------+------------ qemu_arm64-virt-gicv2-uefi | arm64 | lab-broonie | gcc-10 | defconfig+arm64-chromebook | 1 Details:
https://kernelci.org/test/plan/id/628fa7a908e8d2b2baa39bce
Results: 0 PASS, 1 FAIL, 0 SKIP Full config: defconfig+arm64-chromebook Compiler: gcc-10 (aarch64-linux-gnu-gcc (Debian 10.2.1-6) 10.2.1 20210110) Plain log:
https://storage.kernelci.org//stable-rc/queue-5.4/v5.4.196-10-g50756fc0ce9d…
HTML log:
https://storage.kernelci.org//stable-rc/queue-5.4/v5.4.196-10-g50756fc0ce9d…
Rootfs:
http://storage.kernelci.org/images/rootfs/buildroot/buildroot-baseline/2022…
* baseline.login:
https://kernelci.org/test/case/id/628fa7a908e8d2b2baa39bcf
failing since 16 days (last pass: v5.4.191-84-g56ce42d78d96, first fail: v5.4.191-125-g5917d1547e6e) platform | arch | lab | compiler | defconfig | regressions ---------------------------+-------+--------------+----------+----------------------------+------------ qemu_arm64-virt-gicv2-uefi | arm64 | lab-broonie | gcc-10 | defconfig | 1 Details:
https://kernelci.org/test/plan/id/628faa522b4d8e4feba39bcd
Results: 0 PASS, 1 FAIL, 0 SKIP Full config: defconfig Compiler: gcc-10 (aarch64-linux-gnu-gcc (Debian 10.2.1-6) 10.2.1 20210110) Plain log:
https://storage.kernelci.org//stable-rc/queue-5.4/v5.4.196-10-g50756fc0ce9d…
HTML log:
https://storage.kernelci.org//stable-rc/queue-5.4/v5.4.196-10-g50756fc0ce9d…
Rootfs:
http://storage.kernelci.org/images/rootfs/buildroot/buildroot-baseline/2022…
* baseline.login:
https://kernelci.org/test/case/id/628faa522b4d8e4feba39bce
failing since 16 days (last pass: v5.4.191-77-g1a3b249e415b, first fail: v5.4.191-125-g5917d1547e6e) platform | arch | lab | compiler | defconfig | regressions ---------------------------+-------+--------------+----------+----------------------------+------------ qemu_arm64-virt-gicv3 | arm64 | lab-broonie | gcc-10 | defconfig+arm64-chromebook | 1 Details:
https://kernelci.org/test/plan/id/628fa7f92b6c7c0edda39bce
Results: 0 PASS, 1 FAIL, 0 SKIP Full config: defconfig+arm64-chromebook Compiler: gcc-10 (aarch64-linux-gnu-gcc (Debian 10.2.1-6) 10.2.1 20210110) Plain log:
https://storage.kernelci.org//stable-rc/queue-5.4/v5.4.196-10-g50756fc0ce9d…
HTML log:
https://storage.kernelci.org//stable-rc/queue-5.4/v5.4.196-10-g50756fc0ce9d…
Rootfs:
http://storage.kernelci.org/images/rootfs/buildroot/buildroot-baseline/2022…
* baseline.login:
https://kernelci.org/test/case/id/628fa7f92b6c7c0edda39bcf
failing since 16 days (last pass: v5.4.191-84-g56ce42d78d96, first fail: v5.4.191-125-g5917d1547e6e) platform | arch | lab | compiler | defconfig | regressions ---------------------------+-------+--------------+----------+----------------------------+------------ qemu_arm64-virt-gicv3 | arm64 | lab-broonie | gcc-10 | defconfig | 1 Details:
https://kernelci.org/test/plan/id/628faba5d9c1fea631a39bed
Results: 0 PASS, 1 FAIL, 0 SKIP Full config: defconfig Compiler: gcc-10 (aarch64-linux-gnu-gcc (Debian 10.2.1-6) 10.2.1 20210110) Plain log:
https://storage.kernelci.org//stable-rc/queue-5.4/v5.4.196-10-g50756fc0ce9d…
HTML log:
https://storage.kernelci.org//stable-rc/queue-5.4/v5.4.196-10-g50756fc0ce9d…
Rootfs:
http://storage.kernelci.org/images/rootfs/buildroot/buildroot-baseline/2022…
* baseline.login:
https://kernelci.org/test/case/id/628faba5d9c1fea631a39bee
failing since 16 days (last pass: v5.4.191-77-g1a3b249e415b, first fail: v5.4.191-125-g5917d1547e6e) platform | arch | lab | compiler | defconfig | regressions ---------------------------+-------+--------------+----------+----------------------------+------------ qemu_arm64-virt-gicv3-uefi | arm64 | lab-broonie | gcc-10 | defconfig+arm64-chromebook | 1 Details:
https://kernelci.org/test/plan/id/628fa79509b871017ba39c47
Results: 0 PASS, 1 FAIL, 0 SKIP Full config: defconfig+arm64-chromebook Compiler: gcc-10 (aarch64-linux-gnu-gcc (Debian 10.2.1-6) 10.2.1 20210110) Plain log:
https://storage.kernelci.org//stable-rc/queue-5.4/v5.4.196-10-g50756fc0ce9d…
HTML log:
https://storage.kernelci.org//stable-rc/queue-5.4/v5.4.196-10-g50756fc0ce9d…
Rootfs:
http://storage.kernelci.org/images/rootfs/buildroot/buildroot-baseline/2022…
* baseline.login:
https://kernelci.org/test/case/id/628fa79509b871017ba39c48
failing since 16 days (last pass: v5.4.191-84-g56ce42d78d96, first fail: v5.4.191-125-g5917d1547e6e) platform | arch | lab | compiler | defconfig | regressions ---------------------------+-------+--------------+----------+----------------------------+------------ qemu_arm64-virt-gicv3-uefi | arm64 | lab-broonie | gcc-10 | defconfig | 1 Details:
https://kernelci.org/test/plan/id/628faa656931b98298a39be3
Results: 0 PASS, 1 FAIL, 0 SKIP Full config: defconfig Compiler: gcc-10 (aarch64-linux-gnu-gcc (Debian 10.2.1-6) 10.2.1 20210110) Plain log:
https://storage.kernelci.org//stable-rc/queue-5.4/v5.4.196-10-g50756fc0ce9d…
HTML log:
https://storage.kernelci.org//stable-rc/queue-5.4/v5.4.196-10-g50756fc0ce9d…
Rootfs:
http://storage.kernelci.org/images/rootfs/buildroot/buildroot-baseline/2022…
* baseline.login:
https://kernelci.org/test/case/id/628faa656931b98298a39be4
failing since 16 days (last pass: v5.4.191-77-g1a3b249e415b, first fail: v5.4.191-125-g5917d1547e6e)
2 years, 7 months
1
0
0
0
stable-rc/queue/5.15 baseline: 71 runs, 1 regressions (v5.15.43-4-gcd1decd79c79)
by kernelci.org bot
stable-rc/queue/5.15 baseline: 71 runs, 1 regressions (v5.15.43-4-gcd1decd79c79) Regressions Summary ------------------- platform | arch | lab | compiler | defconfig | regressions -----------------+-------+---------------+----------+----------------------------+------------ rk3399-gru-kevin | arm64 | lab-collabora | gcc-10 | defconfig+arm64-chromebook | 1 Details:
https://kernelci.org/test/job/stable-rc/branch/queue%2F5.15/kernel/v5.15.43…
Test: baseline Tree: stable-rc Branch: queue/5.15 Describe: v5.15.43-4-gcd1decd79c79 URL:
https://git.kernel.org/pub/scm/linux/kernel/git/stable/linux-stable-rc.git
SHA: cd1decd79c791f32b932fbb7447a0c26cf209bb9 Test Regressions ---------------- platform | arch | lab | compiler | defconfig | regressions -----------------+-------+---------------+----------+----------------------------+------------ rk3399-gru-kevin | arm64 | lab-collabora | gcc-10 | defconfig+arm64-chromebook | 1 Details:
https://kernelci.org/test/plan/id/628fa38ad2613f2f00a39bdf
Results: 88 PASS, 4 FAIL, 0 SKIP Full config: defconfig+arm64-chromebook Compiler: gcc-10 (aarch64-linux-gnu-gcc (Debian 10.2.1-6) 10.2.1 20210110) Plain log:
https://storage.kernelci.org//stable-rc/queue-5.15/v5.15.43-4-gcd1decd79c79…
HTML log:
https://storage.kernelci.org//stable-rc/queue-5.15/v5.15.43-4-gcd1decd79c79…
Rootfs:
http://storage.kernelci.org/images/rootfs/buildroot/buildroot-baseline/2022…
* baseline.bootrr.rockchip-i2s1-probed:
https://kernelci.org/test/case/id/628fa38ad2613f2f00a39c05
failing since 79 days (last pass: v5.15.26-42-gc89c0807b943, first fail: v5.15.26-257-g2b9a22cd5eb8) 2022-05-26T15:57:49.192156 <8>[ 59.788851] <LAVA_SIGNAL_TESTCASE TEST_CASE_ID=rockchip-i2s0-probed RESULT=pass> 2022-05-26T15:57:50.215310 /lava-6477936/1/../bin/lava-test-case
2 years, 7 months
1
0
0
0
stable-rc/queue/4.19 build: 176 builds: 6 failed, 170 passed, 2 errors, 29 warnings (v4.19.245-6-g6f74479c8fd4)
by kernelci.org bot
stable-rc/queue/4.19 build: 176 builds: 6 failed, 170 passed, 2 errors, 29 warnings (v4.19.245-6-g6f74479c8fd4) Full Build Summary:
https://kernelci.org/build/stable-rc/branch/queue%2F4.19/kernel/v4.19.245-6…
Tree: stable-rc Branch: queue/4.19 Git Describe: v4.19.245-6-g6f74479c8fd4 Git Commit: 6f74479c8fd442414e87fe47c3539b1325b777f3 Git URL:
https://git.kernel.org/pub/scm/linux/kernel/git/stable/linux-stable-rc.git
Built: 7 unique architectures Build Failures Detected: arm: rpc_defconfig: (gcc-10) FAIL mips: ip27_defconfig: (gcc-10) FAIL ip28_defconfig: (gcc-10) FAIL riscv: allnoconfig: (gcc-10) FAIL defconfig: (gcc-10) FAIL tinyconfig: (gcc-10) FAIL Errors and Warnings Detected: arc: arm64: defconfig (gcc-10): 3 warnings defconfig+arm64-chromebook (gcc-10): 3 warnings arm: omap1_defconfig (gcc-10): 1 warning rpc_defconfig (gcc-10): 2 errors i386: allnoconfig (gcc-10): 2 warnings i386_defconfig (gcc-10): 2 warnings tinyconfig (gcc-10): 2 warnings mips: lemote2f_defconfig (gcc-10): 1 warning loongson3_defconfig (gcc-10): 1 warning malta_qemu_32r6_defconfig (gcc-10): 1 warning mtx1_defconfig (gcc-10): 3 warnings nlm_xlp_defconfig (gcc-10): 1 warning riscv: x86_64: tinyconfig (gcc-10): 3 warnings x86_64_defconfig (gcc-10): 3 warnings x86_64_defconfig+x86-chromebook (gcc-10): 3 warnings Errors summary: 1 arm-linux-gnueabihf-gcc: error: unrecognized -march target: armv3 1 arm-linux-gnueabihf-gcc: error: missing argument to ‘-march=’ Warnings summary: 6 ld: warning: creating DT_TEXTREL in a PIE 6 aarch64-linux-gnu-ld: warning: -z norelro ignored 3 ld: arch/x86/boot/compressed/head_64.o: warning: relocation in read-only section `.head.text' 3 ld: arch/x86/boot/compressed/head_32.o: warning: relocation in read-only section `.head.text' 3 arch/x86/entry/entry_64.S:1738: Warning: no instruction mnemonic suffix given and no register operands; using default for `sysret' 2 sound/pci/echoaudio/echoaudio_dsp.c:647:9: warning: iteration 1073741824 invokes undefined behavior [-Waggressive-loop-optimizations] 2 net/core/rtnetlink.c:3199:1: warning: the frame size of 1328 bytes is larger than 1024 bytes [-Wframe-larger-than=] 1 {standard input}:132: Warning: macro instruction expanded into multiple instructions 1 sound/pci/echoaudio/echoaudio_dsp.c:658:9: warning: iteration 1073741824 invokes undefined behavior [-Waggressive-loop-optimizations] 1 net/core/rtnetlink.c:3199:1: warning: the frame size of 1344 bytes is larger than 1024 bytes [-Wframe-larger-than=] 1 drivers/gpio/gpio-omap.c:1233:34: warning: array ‘omap_gpio_match’ assumed to have one element ================================================================================ Detailed per-defconfig build reports: -------------------------------------------------------------------------------- 32r2el_defconfig (mips, gcc-10) — PASS, 0 errors, 0 warnings, 0 section mismatches -------------------------------------------------------------------------------- acs5k_tiny_defconfig (arm, gcc-10) — PASS, 0 errors, 0 warnings, 0 section mismatches -------------------------------------------------------------------------------- allnoconfig (riscv, gcc-10) — FAIL, 0 errors, 0 warnings, 0 section mismatches -------------------------------------------------------------------------------- allnoconfig (arc, gcc-10) — PASS, 0 errors, 0 warnings, 0 section mismatches -------------------------------------------------------------------------------- allnoconfig (i386, gcc-10) — PASS, 0 errors, 2 warnings, 0 section mismatches Warnings: ld: arch/x86/boot/compressed/head_32.o: warning: relocation in read-only section `.head.text' ld: warning: creating DT_TEXTREL in a PIE -------------------------------------------------------------------------------- am200epdkit_defconfig (arm, gcc-10) — PASS, 0 errors, 0 warnings, 0 section mismatches -------------------------------------------------------------------------------- ar7_defconfig (mips, gcc-10) — PASS, 0 errors, 0 warnings, 0 section mismatches -------------------------------------------------------------------------------- aspeed_g4_defconfig (arm, gcc-10) — PASS, 0 errors, 0 warnings, 0 section mismatches -------------------------------------------------------------------------------- aspeed_g5_defconfig (arm, gcc-10) — PASS, 0 errors, 0 warnings, 0 section mismatches -------------------------------------------------------------------------------- assabet_defconfig (arm, gcc-10) — PASS, 0 errors, 0 warnings, 0 section mismatches -------------------------------------------------------------------------------- at91_dt_defconfig (arm, gcc-10) — PASS, 0 errors, 0 warnings, 0 section mismatches -------------------------------------------------------------------------------- ath79_defconfig (mips, gcc-10) — PASS, 0 errors, 0 warnings, 0 section mismatches -------------------------------------------------------------------------------- axm55xx_defconfig (arm, gcc-10) — PASS, 0 errors, 0 warnings, 0 section mismatches -------------------------------------------------------------------------------- axs103_defconfig (arc, gcc-10) — PASS, 0 errors, 0 warnings, 0 section mismatches -------------------------------------------------------------------------------- axs103_smp_defconfig (arc, gcc-10) — PASS, 0 errors, 0 warnings, 0 section mismatches -------------------------------------------------------------------------------- badge4_defconfig (arm, gcc-10) — PASS, 0 errors, 0 warnings, 0 section mismatches -------------------------------------------------------------------------------- bcm2835_defconfig (arm, gcc-10) — PASS, 0 errors, 0 warnings, 0 section mismatches -------------------------------------------------------------------------------- bcm47xx_defconfig (mips, gcc-10) — PASS, 0 errors, 0 warnings, 0 section mismatches -------------------------------------------------------------------------------- bcm63xx_defconfig (mips, gcc-10) — PASS, 0 errors, 0 warnings, 0 section mismatches -------------------------------------------------------------------------------- bigsur_defconfig (mips, gcc-10) — PASS, 0 errors, 0 warnings, 0 section mismatches -------------------------------------------------------------------------------- bmips_be_defconfig (mips, gcc-10) — PASS, 0 errors, 0 warnings, 0 section mismatches -------------------------------------------------------------------------------- bmips_stb_defconfig (mips, gcc-10) — PASS, 0 errors, 0 warnings, 0 section mismatches -------------------------------------------------------------------------------- capcella_defconfig (mips, gcc-10) — PASS, 0 errors, 0 warnings, 0 section mismatches -------------------------------------------------------------------------------- cavium_octeon_defconfig (mips, gcc-10) — PASS, 0 errors, 0 warnings, 0 section mismatches -------------------------------------------------------------------------------- ci20_defconfig (mips, gcc-10) — PASS, 0 errors, 0 warnings, 0 section mismatches -------------------------------------------------------------------------------- cm_x2xx_defconfig (arm, gcc-10) — PASS, 0 errors, 0 warnings, 0 section mismatches -------------------------------------------------------------------------------- cm_x300_defconfig (arm, gcc-10) — PASS, 0 errors, 0 warnings, 0 section mismatches -------------------------------------------------------------------------------- cobalt_defconfig (mips, gcc-10) — PASS, 0 errors, 0 warnings, 0 section mismatches -------------------------------------------------------------------------------- colibri_pxa270_defconfig (arm, gcc-10) — PASS, 0 errors, 0 warnings, 0 section mismatches -------------------------------------------------------------------------------- colibri_pxa300_defconfig (arm, gcc-10) — PASS, 0 errors, 0 warnings, 0 section mismatches -------------------------------------------------------------------------------- collie_defconfig (arm, gcc-10) — PASS, 0 errors, 0 warnings, 0 section mismatches -------------------------------------------------------------------------------- corgi_defconfig (arm, gcc-10) — PASS, 0 errors, 0 warnings, 0 section mismatches -------------------------------------------------------------------------------- davinci_all_defconfig (arm, gcc-10) — PASS, 0 errors, 0 warnings, 0 section mismatches -------------------------------------------------------------------------------- db1xxx_defconfig (mips, gcc-10) — PASS, 0 errors, 0 warnings, 0 section mismatches -------------------------------------------------------------------------------- decstation_defconfig (mips, gcc-10) — PASS, 0 errors, 0 warnings, 0 section mismatches -------------------------------------------------------------------------------- defconfig (riscv, gcc-10) — FAIL, 0 errors, 0 warnings, 0 section mismatches -------------------------------------------------------------------------------- defconfig (arm64, gcc-10) — PASS, 0 errors, 3 warnings, 0 section mismatches Warnings: aarch64-linux-gnu-ld: warning: -z norelro ignored aarch64-linux-gnu-ld: warning: -z norelro ignored aarch64-linux-gnu-ld: warning: -z norelro ignored -------------------------------------------------------------------------------- defconfig+arm64-chromebook (arm64, gcc-10) — PASS, 0 errors, 3 warnings, 0 section mismatches Warnings: aarch64-linux-gnu-ld: warning: -z norelro ignored aarch64-linux-gnu-ld: warning: -z norelro ignored aarch64-linux-gnu-ld: warning: -z norelro ignored -------------------------------------------------------------------------------- dove_defconfig (arm, gcc-10) — PASS, 0 errors, 0 warnings, 0 section mismatches -------------------------------------------------------------------------------- e55_defconfig (mips, gcc-10) — PASS, 0 errors, 0 warnings, 0 section mismatches -------------------------------------------------------------------------------- ebsa110_defconfig (arm, gcc-10) — PASS, 0 errors, 0 warnings, 0 section mismatches -------------------------------------------------------------------------------- efm32_defconfig (arm, gcc-10) — PASS, 0 errors, 0 warnings, 0 section mismatches -------------------------------------------------------------------------------- em_x270_defconfig (arm, gcc-10) — PASS, 0 errors, 0 warnings, 0 section mismatches -------------------------------------------------------------------------------- ep93xx_defconfig (arm, gcc-10) — PASS, 0 errors, 0 warnings, 0 section mismatches -------------------------------------------------------------------------------- exynos_defconfig (arm, gcc-10) — PASS, 0 errors, 0 warnings, 0 section mismatches -------------------------------------------------------------------------------- ezx_defconfig (arm, gcc-10) — PASS, 0 errors, 0 warnings, 0 section mismatches -------------------------------------------------------------------------------- footbridge_defconfig (arm, gcc-10) — PASS, 0 errors, 0 warnings, 0 section mismatches -------------------------------------------------------------------------------- fuloong2e_defconfig (mips, gcc-10) — PASS, 0 errors, 0 warnings, 0 section mismatches -------------------------------------------------------------------------------- gcw0_defconfig (mips, gcc-10) — PASS, 0 errors, 0 warnings, 0 section mismatches -------------------------------------------------------------------------------- gemini_defconfig (arm, gcc-10) — PASS, 0 errors, 0 warnings, 0 section mismatches -------------------------------------------------------------------------------- gpr_defconfig (mips, gcc-10) — PASS, 0 errors, 0 warnings, 0 section mismatches -------------------------------------------------------------------------------- h3600_defconfig (arm, gcc-10) — PASS, 0 errors, 0 warnings, 0 section mismatches -------------------------------------------------------------------------------- h5000_defconfig (arm, gcc-10) — PASS, 0 errors, 0 warnings, 0 section mismatches -------------------------------------------------------------------------------- hackkit_defconfig (arm, gcc-10) — PASS, 0 errors, 0 warnings, 0 section mismatches -------------------------------------------------------------------------------- haps_hs_defconfig (arc, gcc-10) — PASS, 0 errors, 0 warnings, 0 section mismatches -------------------------------------------------------------------------------- haps_hs_smp_defconfig (arc, gcc-10) — PASS, 0 errors, 0 warnings, 0 section mismatches -------------------------------------------------------------------------------- hisi_defconfig (arm, gcc-10) — PASS, 0 errors, 0 warnings, 0 section mismatches -------------------------------------------------------------------------------- hsdk_defconfig (arc, gcc-10) — PASS, 0 errors, 0 warnings, 0 section mismatches -------------------------------------------------------------------------------- i386_defconfig (i386, gcc-10) — PASS, 0 errors, 2 warnings, 0 section mismatches Warnings: ld: arch/x86/boot/compressed/head_32.o: warning: relocation in read-only section `.head.text' ld: warning: creating DT_TEXTREL in a PIE -------------------------------------------------------------------------------- imote2_defconfig (arm, gcc-10) — PASS, 0 errors, 0 warnings, 0 section mismatches -------------------------------------------------------------------------------- imx_v4_v5_defconfig (arm, gcc-10) — PASS, 0 errors, 0 warnings, 0 section mismatches -------------------------------------------------------------------------------- imx_v6_v7_defconfig (arm, gcc-10) — PASS, 0 errors, 0 warnings, 0 section mismatches -------------------------------------------------------------------------------- integrator_defconfig (arm, gcc-10) — PASS, 0 errors, 0 warnings, 0 section mismatches -------------------------------------------------------------------------------- iop13xx_defconfig (arm, gcc-10) — PASS, 0 errors, 0 warnings, 0 section mismatches -------------------------------------------------------------------------------- iop32x_defconfig (arm, gcc-10) — PASS, 0 errors, 0 warnings, 0 section mismatches -------------------------------------------------------------------------------- ip22_defconfig (mips, gcc-10) — PASS, 0 errors, 0 warnings, 0 section mismatches -------------------------------------------------------------------------------- ip27_defconfig (mips, gcc-10) — FAIL, 0 errors, 0 warnings, 0 section mismatches -------------------------------------------------------------------------------- ip28_defconfig (mips, gcc-10) — FAIL, 0 errors, 0 warnings, 0 section mismatches -------------------------------------------------------------------------------- ip32_defconfig (mips, gcc-10) — PASS, 0 errors, 0 warnings, 0 section mismatches -------------------------------------------------------------------------------- ixp4xx_defconfig (arm, gcc-10) — PASS, 0 errors, 0 warnings, 0 section mismatches -------------------------------------------------------------------------------- jazz_defconfig (mips, gcc-10) — PASS, 0 errors, 0 warnings, 0 section mismatches -------------------------------------------------------------------------------- jmr3927_defconfig (mips, gcc-10) — PASS, 0 errors, 0 warnings, 0 section mismatches -------------------------------------------------------------------------------- keystone_defconfig (arm, gcc-10) — PASS, 0 errors, 0 warnings, 0 section mismatches -------------------------------------------------------------------------------- ks8695_defconfig (arm, gcc-10) — PASS, 0 errors, 0 warnings, 0 section mismatches -------------------------------------------------------------------------------- lart_defconfig (arm, gcc-10) — PASS, 0 errors, 0 warnings, 0 section mismatches -------------------------------------------------------------------------------- lasat_defconfig (mips, gcc-10) — PASS, 0 errors, 0 warnings, 0 section mismatches -------------------------------------------------------------------------------- lemote2f_defconfig (mips, gcc-10) — PASS, 0 errors, 1 warning, 0 section mismatches Warnings: net/core/rtnetlink.c:3199:1: warning: the frame size of 1328 bytes is larger than 1024 bytes [-Wframe-larger-than=] -------------------------------------------------------------------------------- loongson3_defconfig (mips, gcc-10) — PASS, 0 errors, 1 warning, 0 section mismatches Warnings: net/core/rtnetlink.c:3199:1: warning: the frame size of 1328 bytes is larger than 1024 bytes [-Wframe-larger-than=] -------------------------------------------------------------------------------- lpc18xx_defconfig (arm, gcc-10) — PASS, 0 errors, 0 warnings, 0 section mismatches -------------------------------------------------------------------------------- lpd270_defconfig (arm, gcc-10) — PASS, 0 errors, 0 warnings, 0 section mismatches -------------------------------------------------------------------------------- lubbock_defconfig (arm, gcc-10) — PASS, 0 errors, 0 warnings, 0 section mismatches -------------------------------------------------------------------------------- magician_defconfig (arm, gcc-10) — PASS, 0 errors, 0 warnings, 0 section mismatches -------------------------------------------------------------------------------- mainstone_defconfig (arm, gcc-10) — PASS, 0 errors, 0 warnings, 0 section mismatches -------------------------------------------------------------------------------- malta_defconfig (mips, gcc-10) — PASS, 0 errors, 0 warnings, 0 section mismatches -------------------------------------------------------------------------------- malta_kvm_defconfig (mips, gcc-10) — PASS, 0 errors, 0 warnings, 0 section mismatches -------------------------------------------------------------------------------- malta_kvm_guest_defconfig (mips, gcc-10) — PASS, 0 errors, 0 warnings, 0 section mismatches -------------------------------------------------------------------------------- malta_qemu_32r6_defconfig (mips, gcc-10) — PASS, 0 errors, 1 warning, 0 section mismatches Warnings: {standard input}:132: Warning: macro instruction expanded into multiple instructions -------------------------------------------------------------------------------- maltaaprp_defconfig (mips, gcc-10) — PASS, 0 errors, 0 warnings, 0 section mismatches -------------------------------------------------------------------------------- maltasmvp_defconfig (mips, gcc-10) — PASS, 0 errors, 0 warnings, 0 section mismatches -------------------------------------------------------------------------------- maltasmvp_eva_defconfig (mips, gcc-10) — PASS, 0 errors, 0 warnings, 0 section mismatches -------------------------------------------------------------------------------- maltaup_defconfig (mips, gcc-10) — PASS, 0 errors, 0 warnings, 0 section mismatches -------------------------------------------------------------------------------- maltaup_xpa_defconfig (mips, gcc-10) — PASS, 0 errors, 0 warnings, 0 section mismatches -------------------------------------------------------------------------------- markeins_defconfig (mips, gcc-10) — PASS, 0 errors, 0 warnings, 0 section mismatches -------------------------------------------------------------------------------- mini2440_defconfig (arm, gcc-10) — PASS, 0 errors, 0 warnings, 0 section mismatches -------------------------------------------------------------------------------- mmp2_defconfig (arm, gcc-10) — PASS, 0 errors, 0 warnings, 0 section mismatches -------------------------------------------------------------------------------- moxart_defconfig (arm, gcc-10) — PASS, 0 errors, 0 warnings, 0 section mismatches -------------------------------------------------------------------------------- mps2_defconfig (arm, gcc-10) — PASS, 0 errors, 0 warnings, 0 section mismatches -------------------------------------------------------------------------------- msp71xx_defconfig (mips, gcc-10) — PASS, 0 errors, 0 warnings, 0 section mismatches -------------------------------------------------------------------------------- mtx1_defconfig (mips, gcc-10) — PASS, 0 errors, 3 warnings, 0 section mismatches Warnings: sound/pci/echoaudio/echoaudio_dsp.c:647:9: warning: iteration 1073741824 invokes undefined behavior [-Waggressive-loop-optimizations] sound/pci/echoaudio/echoaudio_dsp.c:658:9: warning: iteration 1073741824 invokes undefined behavior [-Waggressive-loop-optimizations] sound/pci/echoaudio/echoaudio_dsp.c:647:9: warning: iteration 1073741824 invokes undefined behavior [-Waggressive-loop-optimizations] -------------------------------------------------------------------------------- multi_v4t_defconfig (arm, gcc-10) — PASS, 0 errors, 0 warnings, 0 section mismatches -------------------------------------------------------------------------------- multi_v5_defconfig (arm, gcc-10) — PASS, 0 errors, 0 warnings, 0 section mismatches -------------------------------------------------------------------------------- multi_v7_defconfig (arm, gcc-10) — PASS, 0 errors, 0 warnings, 0 section mismatches -------------------------------------------------------------------------------- mvebu_v5_defconfig (arm, gcc-10) — PASS, 0 errors, 0 warnings, 0 section mismatches -------------------------------------------------------------------------------- mvebu_v7_defconfig (arm, gcc-10) — PASS, 0 errors, 0 warnings, 0 section mismatches -------------------------------------------------------------------------------- mxs_defconfig (arm, gcc-10) — PASS, 0 errors, 0 warnings, 0 section mismatches -------------------------------------------------------------------------------- neponset_defconfig (arm, gcc-10) — PASS, 0 errors, 0 warnings, 0 section mismatches -------------------------------------------------------------------------------- netwinder_defconfig (arm, gcc-10) — PASS, 0 errors, 0 warnings, 0 section mismatches -------------------------------------------------------------------------------- netx_defconfig (arm, gcc-10) — PASS, 0 errors, 0 warnings, 0 section mismatches -------------------------------------------------------------------------------- nhk8815_defconfig (arm, gcc-10) — PASS, 0 errors, 0 warnings, 0 section mismatches -------------------------------------------------------------------------------- nlm_xlp_defconfig (mips, gcc-10) — PASS, 0 errors, 1 warning, 0 section mismatches Warnings: net/core/rtnetlink.c:3199:1: warning: the frame size of 1344 bytes is larger than 1024 bytes [-Wframe-larger-than=] -------------------------------------------------------------------------------- nlm_xlr_defconfig (mips, gcc-10) — PASS, 0 errors, 0 warnings, 0 section mismatches -------------------------------------------------------------------------------- nsim_hs_defconfig (arc, gcc-10) — PASS, 0 errors, 0 warnings, 0 section mismatches -------------------------------------------------------------------------------- nsim_hs_smp_defconfig (arc, gcc-10) — PASS, 0 errors, 0 warnings, 0 section mismatches -------------------------------------------------------------------------------- nsimosci_hs_defconfig (arc, gcc-10) — PASS, 0 errors, 0 warnings, 0 section mismatches -------------------------------------------------------------------------------- nsimosci_hs_smp_defconfig (arc, gcc-10) — PASS, 0 errors, 0 warnings, 0 section mismatches -------------------------------------------------------------------------------- nuc910_defconfig (arm, gcc-10) — PASS, 0 errors, 0 warnings, 0 section mismatches -------------------------------------------------------------------------------- nuc960_defconfig (arm, gcc-10) — PASS, 0 errors, 0 warnings, 0 section mismatches -------------------------------------------------------------------------------- omap1_defconfig (arm, gcc-10) — PASS, 0 errors, 1 warning, 0 section mismatches Warnings: drivers/gpio/gpio-omap.c:1233:34: warning: array ‘omap_gpio_match’ assumed to have one element -------------------------------------------------------------------------------- omap2plus_defconfig (arm, gcc-10) — PASS, 0 errors, 0 warnings, 0 section mismatches -------------------------------------------------------------------------------- omega2p_defconfig (mips, gcc-10) — PASS, 0 errors, 0 warnings, 0 section mismatches -------------------------------------------------------------------------------- orion5x_defconfig (arm, gcc-10) — PASS, 0 errors, 0 warnings, 0 section mismatches -------------------------------------------------------------------------------- oxnas_v6_defconfig (arm, gcc-10) — PASS, 0 errors, 0 warnings, 0 section mismatches -------------------------------------------------------------------------------- palmz72_defconfig (arm, gcc-10) — PASS, 0 errors, 0 warnings, 0 section mismatches -------------------------------------------------------------------------------- pcm027_defconfig (arm, gcc-10) — PASS, 0 errors, 0 warnings, 0 section mismatches -------------------------------------------------------------------------------- pic32mzda_defconfig (mips, gcc-10) — PASS, 0 errors, 0 warnings, 0 section mismatches -------------------------------------------------------------------------------- pistachio_defconfig (mips, gcc-10) — PASS, 0 errors, 0 warnings, 0 section mismatches -------------------------------------------------------------------------------- pnx8335_stb225_defconfig (mips, gcc-10) — PASS, 0 errors, 0 warnings, 0 section mismatches -------------------------------------------------------------------------------- prima2_defconfig (arm, gcc-10) — PASS, 0 errors, 0 warnings, 0 section mismatches -------------------------------------------------------------------------------- pxa255-idp_defconfig (arm, gcc-10) — PASS, 0 errors, 0 warnings, 0 section mismatches -------------------------------------------------------------------------------- pxa3xx_defconfig (arm, gcc-10) — PASS, 0 errors, 0 warnings, 0 section mismatches -------------------------------------------------------------------------------- pxa910_defconfig (arm, gcc-10) — PASS, 0 errors, 0 warnings, 0 section mismatches -------------------------------------------------------------------------------- pxa_defconfig (arm, gcc-10) — PASS, 0 errors, 0 warnings, 0 section mismatches -------------------------------------------------------------------------------- qcom_defconfig (arm, gcc-10) — PASS, 0 errors, 0 warnings, 0 section mismatches -------------------------------------------------------------------------------- raumfeld_defconfig (arm, gcc-10) — PASS, 0 errors, 0 warnings, 0 section mismatches -------------------------------------------------------------------------------- rb532_defconfig (mips, gcc-10) — PASS, 0 errors, 0 warnings, 0 section mismatches -------------------------------------------------------------------------------- rbtx49xx_defconfig (mips, gcc-10) — PASS, 0 errors, 0 warnings, 0 section mismatches -------------------------------------------------------------------------------- realview_defconfig (arm, gcc-10) — PASS, 0 errors, 0 warnings, 0 section mismatches -------------------------------------------------------------------------------- rm200_defconfig (mips, gcc-10) — PASS, 0 errors, 0 warnings, 0 section mismatches -------------------------------------------------------------------------------- rpc_defconfig (arm, gcc-10) — FAIL, 2 errors, 0 warnings, 0 section mismatches Errors: arm-linux-gnueabihf-gcc: error: unrecognized -march target: armv3 arm-linux-gnueabihf-gcc: error: missing argument to ‘-march=’ -------------------------------------------------------------------------------- rt305x_defconfig (mips, gcc-10) — PASS, 0 errors, 0 warnings, 0 section mismatches -------------------------------------------------------------------------------- s3c2410_defconfig (arm, gcc-10) — PASS, 0 errors, 0 warnings, 0 section mismatches -------------------------------------------------------------------------------- s3c6400_defconfig (arm, gcc-10) — PASS, 0 errors, 0 warnings, 0 section mismatches -------------------------------------------------------------------------------- s5pv210_defconfig (arm, gcc-10) — PASS, 0 errors, 0 warnings, 0 section mismatches -------------------------------------------------------------------------------- sama5_defconfig (arm, gcc-10) — PASS, 0 errors, 0 warnings, 0 section mismatches -------------------------------------------------------------------------------- sb1250_swarm_defconfig (mips, gcc-10) — PASS, 0 errors, 0 warnings, 0 section mismatches -------------------------------------------------------------------------------- shannon_defconfig (arm, gcc-10) — PASS, 0 errors, 0 warnings, 0 section mismatches -------------------------------------------------------------------------------- shmobile_defconfig (arm, gcc-10) — PASS, 0 errors, 0 warnings, 0 section mismatches -------------------------------------------------------------------------------- simpad_defconfig (arm, gcc-10) — PASS, 0 errors, 0 warnings, 0 section mismatches -------------------------------------------------------------------------------- spear13xx_defconfig (arm, gcc-10) — PASS, 0 errors, 0 warnings, 0 section mismatches -------------------------------------------------------------------------------- spear3xx_defconfig (arm, gcc-10) — PASS, 0 errors, 0 warnings, 0 section mismatches -------------------------------------------------------------------------------- spear6xx_defconfig (arm, gcc-10) — PASS, 0 errors, 0 warnings, 0 section mismatches -------------------------------------------------------------------------------- spitz_defconfig (arm, gcc-10) — PASS, 0 errors, 0 warnings, 0 section mismatches -------------------------------------------------------------------------------- stm32_defconfig (arm, gcc-10) — PASS, 0 errors, 0 warnings, 0 section mismatches -------------------------------------------------------------------------------- sunxi_defconfig (arm, gcc-10) — PASS, 0 errors, 0 warnings, 0 section mismatches -------------------------------------------------------------------------------- tb0219_defconfig (mips, gcc-10) — PASS, 0 errors, 0 warnings, 0 section mismatches -------------------------------------------------------------------------------- tb0226_defconfig (mips, gcc-10) — PASS, 0 errors, 0 warnings, 0 section mismatches -------------------------------------------------------------------------------- tb0287_defconfig (mips, gcc-10) — PASS, 0 errors, 0 warnings, 0 section mismatches -------------------------------------------------------------------------------- tct_hammer_defconfig (arm, gcc-10) — PASS, 0 errors, 0 warnings, 0 section mismatches -------------------------------------------------------------------------------- tegra_defconfig (arm, gcc-10) — PASS, 0 errors, 0 warnings, 0 section mismatches -------------------------------------------------------------------------------- tinyconfig (riscv, gcc-10) — FAIL, 0 errors, 0 warnings, 0 section mismatches -------------------------------------------------------------------------------- tinyconfig (arc, gcc-10) — PASS, 0 errors, 0 warnings, 0 section mismatches -------------------------------------------------------------------------------- tinyconfig (i386, gcc-10) — PASS, 0 errors, 2 warnings, 0 section mismatches Warnings: ld: arch/x86/boot/compressed/head_32.o: warning: relocation in read-only section `.head.text' ld: warning: creating DT_TEXTREL in a PIE -------------------------------------------------------------------------------- tinyconfig (x86_64, gcc-10) — PASS, 0 errors, 3 warnings, 0 section mismatches Warnings: arch/x86/entry/entry_64.S:1738: Warning: no instruction mnemonic suffix given and no register operands; using default for `sysret' ld: arch/x86/boot/compressed/head_64.o: warning: relocation in read-only section `.head.text' ld: warning: creating DT_TEXTREL in a PIE -------------------------------------------------------------------------------- u300_defconfig (arm, gcc-10) — PASS, 0 errors, 0 warnings, 0 section mismatches -------------------------------------------------------------------------------- u8500_defconfig (arm, gcc-10) — PASS, 0 errors, 0 warnings, 0 section mismatches -------------------------------------------------------------------------------- vdk_hs38_defconfig (arc, gcc-10) — PASS, 0 errors, 0 warnings, 0 section mismatches -------------------------------------------------------------------------------- vdk_hs38_smp_defconfig (arc, gcc-10) — PASS, 0 errors, 0 warnings, 0 section mismatches -------------------------------------------------------------------------------- vexpress_defconfig (arm, gcc-10) — PASS, 0 errors, 0 warnings, 0 section mismatches -------------------------------------------------------------------------------- vf610m4_defconfig (arm, gcc-10) — PASS, 0 errors, 0 warnings, 0 section mismatches -------------------------------------------------------------------------------- viper_defconfig (arm, gcc-10) — PASS, 0 errors, 0 warnings, 0 section mismatches -------------------------------------------------------------------------------- vt8500_v6_v7_defconfig (arm, gcc-10) — PASS, 0 errors, 0 warnings, 0 section mismatches -------------------------------------------------------------------------------- x86_64_defconfig (x86_64, gcc-10) — PASS, 0 errors, 3 warnings, 0 section mismatches Warnings: arch/x86/entry/entry_64.S:1738: Warning: no instruction mnemonic suffix given and no register operands; using default for `sysret' ld: arch/x86/boot/compressed/head_64.o: warning: relocation in read-only section `.head.text' ld: warning: creating DT_TEXTREL in a PIE -------------------------------------------------------------------------------- x86_64_defconfig+x86-chromebook (x86_64, gcc-10) — PASS, 0 errors, 3 warnings, 0 section mismatches Warnings: arch/x86/entry/entry_64.S:1738: Warning: no instruction mnemonic suffix given and no register operands; using default for `sysret' ld: arch/x86/boot/compressed/head_64.o: warning: relocation in read-only section `.head.text' ld: warning: creating DT_TEXTREL in a PIE -------------------------------------------------------------------------------- xcep_defconfig (arm, gcc-10) — PASS, 0 errors, 0 warnings, 0 section mismatches -------------------------------------------------------------------------------- zeus_defconfig (arm, gcc-10) — PASS, 0 errors, 0 warnings, 0 section mismatches -------------------------------------------------------------------------------- zx_defconfig (arm, gcc-10) — PASS, 0 errors, 0 warnings, 0 section mismatches --- For more info write to <info(a)kernelci.org>
2 years, 7 months
1
0
0
0
Patch for stable
by Yury Norov
Hi Greg, Can you please consider taking the patch "KVM: x86: hyper-v: fix type of valid_bank_mask" into stable? Commit ea8c66fe8d8f4f93df941e52120a3512d7bf5128 upstream. Thanks, Yury
2 years, 7 months
2
3
0
0
stable-rc/queue/5.10 build: 185 builds: 3 failed, 182 passed, 4 errors, 10 warnings (v5.10.118-162-ge84eac1aa5252)
by kernelci.org bot
stable-rc/queue/5.10 build: 185 builds: 3 failed, 182 passed, 4 errors, 10 warnings (v5.10.118-162-ge84eac1aa5252) Full Build Summary:
https://kernelci.org/build/stable-rc/branch/queue%2F5.10/kernel/v5.10.118-1…
Tree: stable-rc Branch: queue/5.10 Git Describe: v5.10.118-162-ge84eac1aa5252 Git Commit: e84eac1aa525211d884ab103b689cdbdb83be8e2 Git URL:
https://git.kernel.org/pub/scm/linux/kernel/git/stable/linux-stable-rc.git
Built: 7 unique architectures Build Failures Detected: arm: rpc_defconfig: (gcc-10) FAIL mips: ip27_defconfig: (gcc-10) FAIL ip28_defconfig: (gcc-10) FAIL Errors and Warnings Detected: arc: arm64: arm: rpc_defconfig (gcc-10): 4 errors i386: mips: 32r2el_defconfig (gcc-10): 1 warning decstation_64_defconfig (gcc-10): 1 warning decstation_defconfig (gcc-10): 1 warning decstation_r4k_defconfig (gcc-10): 1 warning lemote2f_defconfig (gcc-10): 1 warning rm200_defconfig (gcc-10): 1 warning riscv: rv32_defconfig (gcc-10): 4 warnings x86_64: Errors summary: 2 arm-linux-gnueabihf-gcc: error: unrecognized -march target: armv3m 2 arm-linux-gnueabihf-gcc: error: missing argument to ‘-march=’ Warnings summary: 3 kernel/rcu/tasks.h:707:13: warning: ‘show_rcu_tasks_rude_gp_kthread’ defined but not used [-Wunused-function] 2 <stdin>:830:2: warning: #warning syscall fstat64 not implemented [-Wcpp] 2 <stdin>:1127:2: warning: #warning syscall fstatat64 not implemented [-Wcpp] 1 net/mac80211/mlme.c:4349:1: warning: the frame size of 1040 bytes is larger than 1024 bytes [-Wframe-larger-than=] 1 drivers/block/paride/bpck.c:32: warning: "PC" redefined 1 WARNING: modpost: Symbol info of vmlinux is missing. Unresolved symbol check will be entirely skipped. ================================================================================ Detailed per-defconfig build reports: -------------------------------------------------------------------------------- 32r2el_defconfig (mips, gcc-10) — PASS, 0 errors, 1 warning, 0 section mismatches Warnings: WARNING: modpost: Symbol info of vmlinux is missing. Unresolved symbol check will be entirely skipped. -------------------------------------------------------------------------------- allnoconfig (arc, gcc-10) — PASS, 0 errors, 0 warnings, 0 section mismatches -------------------------------------------------------------------------------- allnoconfig (x86_64, gcc-10) — PASS, 0 errors, 0 warnings, 0 section mismatches -------------------------------------------------------------------------------- allnoconfig (i386, gcc-10) — PASS, 0 errors, 0 warnings, 0 section mismatches -------------------------------------------------------------------------------- am200epdkit_defconfig (arm, gcc-10) — PASS, 0 errors, 0 warnings, 0 section mismatches -------------------------------------------------------------------------------- ar7_defconfig (mips, gcc-10) — PASS, 0 errors, 0 warnings, 0 section mismatches -------------------------------------------------------------------------------- aspeed_g4_defconfig (arm, gcc-10) — PASS, 0 errors, 0 warnings, 0 section mismatches -------------------------------------------------------------------------------- aspeed_g5_defconfig (arm, gcc-10) — PASS, 0 errors, 0 warnings, 0 section mismatches -------------------------------------------------------------------------------- assabet_defconfig (arm, gcc-10) — PASS, 0 errors, 0 warnings, 0 section mismatches -------------------------------------------------------------------------------- at91_dt_defconfig (arm, gcc-10) — PASS, 0 errors, 0 warnings, 0 section mismatches -------------------------------------------------------------------------------- ath25_defconfig (mips, gcc-10) — PASS, 0 errors, 0 warnings, 0 section mismatches -------------------------------------------------------------------------------- ath79_defconfig (mips, gcc-10) — PASS, 0 errors, 0 warnings, 0 section mismatches -------------------------------------------------------------------------------- axm55xx_defconfig (arm, gcc-10) — PASS, 0 errors, 0 warnings, 0 section mismatches -------------------------------------------------------------------------------- axs103_defconfig (arc, gcc-10) — PASS, 0 errors, 0 warnings, 0 section mismatches -------------------------------------------------------------------------------- axs103_smp_defconfig (arc, gcc-10) — PASS, 0 errors, 0 warnings, 0 section mismatches -------------------------------------------------------------------------------- badge4_defconfig (arm, gcc-10) — PASS, 0 errors, 0 warnings, 0 section mismatches -------------------------------------------------------------------------------- bcm2835_defconfig (arm, gcc-10) — PASS, 0 errors, 0 warnings, 0 section mismatches -------------------------------------------------------------------------------- bcm47xx_defconfig (mips, gcc-10) — PASS, 0 errors, 0 warnings, 0 section mismatches -------------------------------------------------------------------------------- bcm63xx_defconfig (mips, gcc-10) — PASS, 0 errors, 0 warnings, 0 section mismatches -------------------------------------------------------------------------------- bigsur_defconfig (mips, gcc-10) — PASS, 0 errors, 0 warnings, 0 section mismatches -------------------------------------------------------------------------------- bmips_be_defconfig (mips, gcc-10) — PASS, 0 errors, 0 warnings, 0 section mismatches -------------------------------------------------------------------------------- bmips_stb_defconfig (mips, gcc-10) — PASS, 0 errors, 0 warnings, 0 section mismatches -------------------------------------------------------------------------------- capcella_defconfig (mips, gcc-10) — PASS, 0 errors, 0 warnings, 0 section mismatches -------------------------------------------------------------------------------- cavium_octeon_defconfig (mips, gcc-10) — PASS, 0 errors, 0 warnings, 0 section mismatches -------------------------------------------------------------------------------- cerfcube_defconfig (arm, gcc-10) — PASS, 0 errors, 0 warnings, 0 section mismatches -------------------------------------------------------------------------------- ci20_defconfig (mips, gcc-10) — PASS, 0 errors, 0 warnings, 0 section mismatches -------------------------------------------------------------------------------- cm_x300_defconfig (arm, gcc-10) — PASS, 0 errors, 0 warnings, 0 section mismatches -------------------------------------------------------------------------------- cobalt_defconfig (mips, gcc-10) — PASS, 0 errors, 0 warnings, 0 section mismatches -------------------------------------------------------------------------------- colibri_pxa270_defconfig (arm, gcc-10) — PASS, 0 errors, 0 warnings, 0 section mismatches -------------------------------------------------------------------------------- colibri_pxa300_defconfig (arm, gcc-10) — PASS, 0 errors, 0 warnings, 0 section mismatches -------------------------------------------------------------------------------- collie_defconfig (arm, gcc-10) — PASS, 0 errors, 0 warnings, 0 section mismatches -------------------------------------------------------------------------------- corgi_defconfig (arm, gcc-10) — PASS, 0 errors, 0 warnings, 0 section mismatches -------------------------------------------------------------------------------- cu1000-neo_defconfig (mips, gcc-10) — PASS, 0 errors, 0 warnings, 0 section mismatches -------------------------------------------------------------------------------- cu1830-neo_defconfig (mips, gcc-10) — PASS, 0 errors, 0 warnings, 0 section mismatches -------------------------------------------------------------------------------- davinci_all_defconfig (arm, gcc-10) — PASS, 0 errors, 0 warnings, 0 section mismatches -------------------------------------------------------------------------------- db1xxx_defconfig (mips, gcc-10) — PASS, 0 errors, 0 warnings, 0 section mismatches -------------------------------------------------------------------------------- decstation_64_defconfig (mips, gcc-10) — PASS, 0 errors, 1 warning, 0 section mismatches Warnings: kernel/rcu/tasks.h:707:13: warning: ‘show_rcu_tasks_rude_gp_kthread’ defined but not used [-Wunused-function] -------------------------------------------------------------------------------- decstation_defconfig (mips, gcc-10) — PASS, 0 errors, 1 warning, 0 section mismatches Warnings: kernel/rcu/tasks.h:707:13: warning: ‘show_rcu_tasks_rude_gp_kthread’ defined but not used [-Wunused-function] -------------------------------------------------------------------------------- decstation_r4k_defconfig (mips, gcc-10) — PASS, 0 errors, 1 warning, 0 section mismatches Warnings: kernel/rcu/tasks.h:707:13: warning: ‘show_rcu_tasks_rude_gp_kthread’ defined but not used [-Wunused-function] -------------------------------------------------------------------------------- defconfig (riscv, gcc-10) — PASS, 0 errors, 0 warnings, 0 section mismatches -------------------------------------------------------------------------------- defconfig (arm64, gcc-10) — PASS, 0 errors, 0 warnings, 0 section mismatches -------------------------------------------------------------------------------- defconfig+arm64-chromebook (arm64, gcc-10) — PASS, 0 errors, 0 warnings, 0 section mismatches -------------------------------------------------------------------------------- dove_defconfig (arm, gcc-10) — PASS, 0 errors, 0 warnings, 0 section mismatches -------------------------------------------------------------------------------- e55_defconfig (mips, gcc-10) — PASS, 0 errors, 0 warnings, 0 section mismatches -------------------------------------------------------------------------------- ebsa110_defconfig (arm, gcc-10) — PASS, 0 errors, 0 warnings, 0 section mismatches -------------------------------------------------------------------------------- efm32_defconfig (arm, gcc-10) — PASS, 0 errors, 0 warnings, 0 section mismatches -------------------------------------------------------------------------------- ep93xx_defconfig (arm, gcc-10) — PASS, 0 errors, 0 warnings, 0 section mismatches -------------------------------------------------------------------------------- eseries_pxa_defconfig (arm, gcc-10) — PASS, 0 errors, 0 warnings, 0 section mismatches -------------------------------------------------------------------------------- exynos_defconfig (arm, gcc-10) — PASS, 0 errors, 0 warnings, 0 section mismatches -------------------------------------------------------------------------------- ezx_defconfig (arm, gcc-10) — PASS, 0 errors, 0 warnings, 0 section mismatches -------------------------------------------------------------------------------- footbridge_defconfig (arm, gcc-10) — PASS, 0 errors, 0 warnings, 0 section mismatches -------------------------------------------------------------------------------- fuloong2e_defconfig (mips, gcc-10) — PASS, 0 errors, 0 warnings, 0 section mismatches -------------------------------------------------------------------------------- gcw0_defconfig (mips, gcc-10) — PASS, 0 errors, 0 warnings, 0 section mismatches -------------------------------------------------------------------------------- gemini_defconfig (arm, gcc-10) — PASS, 0 errors, 0 warnings, 0 section mismatches -------------------------------------------------------------------------------- gpr_defconfig (mips, gcc-10) — PASS, 0 errors, 0 warnings, 0 section mismatches -------------------------------------------------------------------------------- h3600_defconfig (arm, gcc-10) — PASS, 0 errors, 0 warnings, 0 section mismatches -------------------------------------------------------------------------------- h5000_defconfig (arm, gcc-10) — PASS, 0 errors, 0 warnings, 0 section mismatches -------------------------------------------------------------------------------- hackkit_defconfig (arm, gcc-10) — PASS, 0 errors, 0 warnings, 0 section mismatches -------------------------------------------------------------------------------- haps_hs_defconfig (arc, gcc-10) — PASS, 0 errors, 0 warnings, 0 section mismatches -------------------------------------------------------------------------------- haps_hs_smp_defconfig (arc, gcc-10) — PASS, 0 errors, 0 warnings, 0 section mismatches -------------------------------------------------------------------------------- hisi_defconfig (arm, gcc-10) — PASS, 0 errors, 0 warnings, 0 section mismatches -------------------------------------------------------------------------------- hsdk_defconfig (arc, gcc-10) — PASS, 0 errors, 0 warnings, 0 section mismatches -------------------------------------------------------------------------------- i386_defconfig (i386, gcc-10) — PASS, 0 errors, 0 warnings, 0 section mismatches -------------------------------------------------------------------------------- imote2_defconfig (arm, gcc-10) — PASS, 0 errors, 0 warnings, 0 section mismatches -------------------------------------------------------------------------------- imx_v4_v5_defconfig (arm, gcc-10) — PASS, 0 errors, 0 warnings, 0 section mismatches -------------------------------------------------------------------------------- imx_v6_v7_defconfig (arm, gcc-10) — PASS, 0 errors, 0 warnings, 0 section mismatches -------------------------------------------------------------------------------- integrator_defconfig (arm, gcc-10) — PASS, 0 errors, 0 warnings, 0 section mismatches -------------------------------------------------------------------------------- iop32x_defconfig (arm, gcc-10) — PASS, 0 errors, 0 warnings, 0 section mismatches -------------------------------------------------------------------------------- ip22_defconfig (mips, gcc-10) — PASS, 0 errors, 0 warnings, 0 section mismatches -------------------------------------------------------------------------------- ip27_defconfig (mips, gcc-10) — FAIL, 0 errors, 0 warnings, 0 section mismatches -------------------------------------------------------------------------------- ip28_defconfig (mips, gcc-10) — FAIL, 0 errors, 0 warnings, 0 section mismatches -------------------------------------------------------------------------------- ip32_defconfig (mips, gcc-10) — PASS, 0 errors, 0 warnings, 0 section mismatches -------------------------------------------------------------------------------- ixp4xx_defconfig (arm, gcc-10) — PASS, 0 errors, 0 warnings, 0 section mismatches -------------------------------------------------------------------------------- jazz_defconfig (mips, gcc-10) — PASS, 0 errors, 0 warnings, 0 section mismatches -------------------------------------------------------------------------------- jmr3927_defconfig (mips, gcc-10) — PASS, 0 errors, 0 warnings, 0 section mismatches -------------------------------------------------------------------------------- jornada720_defconfig (arm, gcc-10) — PASS, 0 errors, 0 warnings, 0 section mismatches -------------------------------------------------------------------------------- keystone_defconfig (arm, gcc-10) — PASS, 0 errors, 0 warnings, 0 section mismatches -------------------------------------------------------------------------------- lart_defconfig (arm, gcc-10) — PASS, 0 errors, 0 warnings, 0 section mismatches -------------------------------------------------------------------------------- lemote2f_defconfig (mips, gcc-10) — PASS, 0 errors, 1 warning, 0 section mismatches Warnings: net/mac80211/mlme.c:4349:1: warning: the frame size of 1040 bytes is larger than 1024 bytes [-Wframe-larger-than=] -------------------------------------------------------------------------------- loongson1b_defconfig (mips, gcc-10) — PASS, 0 errors, 0 warnings, 0 section mismatches -------------------------------------------------------------------------------- loongson1c_defconfig (mips, gcc-10) — PASS, 0 errors, 0 warnings, 0 section mismatches -------------------------------------------------------------------------------- loongson3_defconfig (mips, gcc-10) — PASS, 0 errors, 0 warnings, 0 section mismatches -------------------------------------------------------------------------------- lpc18xx_defconfig (arm, gcc-10) — PASS, 0 errors, 0 warnings, 0 section mismatches -------------------------------------------------------------------------------- lpc32xx_defconfig (arm, gcc-10) — PASS, 0 errors, 0 warnings, 0 section mismatches -------------------------------------------------------------------------------- lpd270_defconfig (arm, gcc-10) — PASS, 0 errors, 0 warnings, 0 section mismatches -------------------------------------------------------------------------------- lubbock_defconfig (arm, gcc-10) — PASS, 0 errors, 0 warnings, 0 section mismatches -------------------------------------------------------------------------------- magician_defconfig (arm, gcc-10) — PASS, 0 errors, 0 warnings, 0 section mismatches -------------------------------------------------------------------------------- mainstone_defconfig (arm, gcc-10) — PASS, 0 errors, 0 warnings, 0 section mismatches -------------------------------------------------------------------------------- malta_defconfig (mips, gcc-10) — PASS, 0 errors, 0 warnings, 0 section mismatches -------------------------------------------------------------------------------- malta_kvm_defconfig (mips, gcc-10) — PASS, 0 errors, 0 warnings, 0 section mismatches -------------------------------------------------------------------------------- malta_kvm_guest_defconfig (mips, gcc-10) — PASS, 0 errors, 0 warnings, 0 section mismatches -------------------------------------------------------------------------------- malta_qemu_32r6_defconfig (mips, gcc-10) — PASS, 0 errors, 0 warnings, 0 section mismatches -------------------------------------------------------------------------------- maltaaprp_defconfig (mips, gcc-10) — PASS, 0 errors, 0 warnings, 0 section mismatches -------------------------------------------------------------------------------- maltasmvp_defconfig (mips, gcc-10) — PASS, 0 errors, 0 warnings, 0 section mismatches -------------------------------------------------------------------------------- maltasmvp_eva_defconfig (mips, gcc-10) — PASS, 0 errors, 0 warnings, 0 section mismatches -------------------------------------------------------------------------------- maltaup_defconfig (mips, gcc-10) — PASS, 0 errors, 0 warnings, 0 section mismatches -------------------------------------------------------------------------------- maltaup_xpa_defconfig (mips, gcc-10) — PASS, 0 errors, 0 warnings, 0 section mismatches -------------------------------------------------------------------------------- milbeaut_m10v_defconfig (arm, gcc-10) — PASS, 0 errors, 0 warnings, 0 section mismatches -------------------------------------------------------------------------------- mini2440_defconfig (arm, gcc-10) — PASS, 0 errors, 0 warnings, 0 section mismatches -------------------------------------------------------------------------------- mmp2_defconfig (arm, gcc-10) — PASS, 0 errors, 0 warnings, 0 section mismatches -------------------------------------------------------------------------------- moxart_defconfig (arm, gcc-10) — PASS, 0 errors, 0 warnings, 0 section mismatches -------------------------------------------------------------------------------- mpc30x_defconfig (mips, gcc-10) — PASS, 0 errors, 0 warnings, 0 section mismatches -------------------------------------------------------------------------------- mps2_defconfig (arm, gcc-10) — PASS, 0 errors, 0 warnings, 0 section mismatches -------------------------------------------------------------------------------- mtx1_defconfig (mips, gcc-10) — PASS, 0 errors, 0 warnings, 0 section mismatches -------------------------------------------------------------------------------- multi_v4t_defconfig (arm, gcc-10) — PASS, 0 errors, 0 warnings, 0 section mismatches -------------------------------------------------------------------------------- multi_v5_defconfig (arm, gcc-10) — PASS, 0 errors, 0 warnings, 0 section mismatches -------------------------------------------------------------------------------- multi_v7_defconfig (arm, gcc-10) — PASS, 0 errors, 0 warnings, 0 section mismatches -------------------------------------------------------------------------------- mvebu_v5_defconfig (arm, gcc-10) — PASS, 0 errors, 0 warnings, 0 section mismatches -------------------------------------------------------------------------------- mvebu_v7_defconfig (arm, gcc-10) — PASS, 0 errors, 0 warnings, 0 section mismatches -------------------------------------------------------------------------------- mxs_defconfig (arm, gcc-10) — PASS, 0 errors, 0 warnings, 0 section mismatches -------------------------------------------------------------------------------- neponset_defconfig (arm, gcc-10) — PASS, 0 errors, 0 warnings, 0 section mismatches -------------------------------------------------------------------------------- netwinder_defconfig (arm, gcc-10) — PASS, 0 errors, 0 warnings, 0 section mismatches -------------------------------------------------------------------------------- nhk8815_defconfig (arm, gcc-10) — PASS, 0 errors, 0 warnings, 0 section mismatches -------------------------------------------------------------------------------- nlm_xlp_defconfig (mips, gcc-10) — PASS, 0 errors, 0 warnings, 0 section mismatches -------------------------------------------------------------------------------- nlm_xlr_defconfig (mips, gcc-10) — PASS, 0 errors, 0 warnings, 0 section mismatches -------------------------------------------------------------------------------- nommu_k210_defconfig (riscv, gcc-10) — PASS, 0 errors, 0 warnings, 0 section mismatches -------------------------------------------------------------------------------- nsimosci_hs_defconfig (arc, gcc-10) — PASS, 0 errors, 0 warnings, 0 section mismatches -------------------------------------------------------------------------------- nsimosci_hs_smp_defconfig (arc, gcc-10) — PASS, 0 errors, 0 warnings, 0 section mismatches -------------------------------------------------------------------------------- omap1_defconfig (arm, gcc-10) — PASS, 0 errors, 0 warnings, 0 section mismatches -------------------------------------------------------------------------------- omap2plus_defconfig (arm, gcc-10) — PASS, 0 errors, 0 warnings, 0 section mismatches -------------------------------------------------------------------------------- omega2p_defconfig (mips, gcc-10) — PASS, 0 errors, 0 warnings, 0 section mismatches -------------------------------------------------------------------------------- orion5x_defconfig (arm, gcc-10) — PASS, 0 errors, 0 warnings, 0 section mismatches -------------------------------------------------------------------------------- oxnas_v6_defconfig (arm, gcc-10) — PASS, 0 errors, 0 warnings, 0 section mismatches -------------------------------------------------------------------------------- palmz72_defconfig (arm, gcc-10) — PASS, 0 errors, 0 warnings, 0 section mismatches -------------------------------------------------------------------------------- pcm027_defconfig (arm, gcc-10) — PASS, 0 errors, 0 warnings, 0 section mismatches -------------------------------------------------------------------------------- pic32mzda_defconfig (mips, gcc-10) — PASS, 0 errors, 0 warnings, 0 section mismatches -------------------------------------------------------------------------------- pistachio_defconfig (mips, gcc-10) — PASS, 0 errors, 0 warnings, 0 section mismatches -------------------------------------------------------------------------------- pleb_defconfig (arm, gcc-10) — PASS, 0 errors, 0 warnings, 0 section mismatches -------------------------------------------------------------------------------- prima2_defconfig (arm, gcc-10) — PASS, 0 errors, 0 warnings, 0 section mismatches -------------------------------------------------------------------------------- pxa168_defconfig (arm, gcc-10) — PASS, 0 errors, 0 warnings, 0 section mismatches -------------------------------------------------------------------------------- pxa255-idp_defconfig (arm, gcc-10) — PASS, 0 errors, 0 warnings, 0 section mismatches -------------------------------------------------------------------------------- pxa3xx_defconfig (arm, gcc-10) — PASS, 0 errors, 0 warnings, 0 section mismatches -------------------------------------------------------------------------------- pxa910_defconfig (arm, gcc-10) — PASS, 0 errors, 0 warnings, 0 section mismatches -------------------------------------------------------------------------------- pxa_defconfig (arm, gcc-10) — PASS, 0 errors, 0 warnings, 0 section mismatches -------------------------------------------------------------------------------- qcom_defconfig (arm, gcc-10) — PASS, 0 errors, 0 warnings, 0 section mismatches -------------------------------------------------------------------------------- qi_lb60_defconfig (mips, gcc-10) — PASS, 0 errors, 0 warnings, 0 section mismatches -------------------------------------------------------------------------------- rb532_defconfig (mips, gcc-10) — PASS, 0 errors, 0 warnings, 0 section mismatches -------------------------------------------------------------------------------- rbtx49xx_defconfig (mips, gcc-10) — PASS, 0 errors, 0 warnings, 0 section mismatches -------------------------------------------------------------------------------- realview_defconfig (arm, gcc-10) — PASS, 0 errors, 0 warnings, 0 section mismatches -------------------------------------------------------------------------------- rm200_defconfig (mips, gcc-10) — PASS, 0 errors, 1 warning, 0 section mismatches Warnings: drivers/block/paride/bpck.c:32: warning: "PC" redefined -------------------------------------------------------------------------------- rpc_defconfig (arm, gcc-10) — FAIL, 4 errors, 0 warnings, 0 section mismatches Errors: arm-linux-gnueabihf-gcc: error: unrecognized -march target: armv3m arm-linux-gnueabihf-gcc: error: missing argument to ‘-march=’ arm-linux-gnueabihf-gcc: error: unrecognized -march target: armv3m arm-linux-gnueabihf-gcc: error: missing argument to ‘-march=’ -------------------------------------------------------------------------------- rs90_defconfig (mips, gcc-10) — PASS, 0 errors, 0 warnings, 0 section mismatches -------------------------------------------------------------------------------- rt305x_defconfig (mips, gcc-10) — PASS, 0 errors, 0 warnings, 0 section mismatches -------------------------------------------------------------------------------- rv32_defconfig (riscv, gcc-10) — PASS, 0 errors, 4 warnings, 0 section mismatches Warnings: <stdin>:830:2: warning: #warning syscall fstat64 not implemented [-Wcpp] <stdin>:1127:2: warning: #warning syscall fstatat64 not implemented [-Wcpp] <stdin>:830:2: warning: #warning syscall fstat64 not implemented [-Wcpp] <stdin>:1127:2: warning: #warning syscall fstatat64 not implemented [-Wcpp] -------------------------------------------------------------------------------- s3c2410_defconfig (arm, gcc-10) — PASS, 0 errors, 0 warnings, 0 section mismatches -------------------------------------------------------------------------------- s3c6400_defconfig (arm, gcc-10) — PASS, 0 errors, 0 warnings, 0 section mismatches -------------------------------------------------------------------------------- s5pv210_defconfig (arm, gcc-10) — PASS, 0 errors, 0 warnings, 0 section mismatches -------------------------------------------------------------------------------- sama5_defconfig (arm, gcc-10) — PASS, 0 errors, 0 warnings, 0 section mismatches -------------------------------------------------------------------------------- sb1250_swarm_defconfig (mips, gcc-10) — PASS, 0 errors, 0 warnings, 0 section mismatches -------------------------------------------------------------------------------- shannon_defconfig (arm, gcc-10) — PASS, 0 errors, 0 warnings, 0 section mismatches -------------------------------------------------------------------------------- shmobile_defconfig (arm, gcc-10) — PASS, 0 errors, 0 warnings, 0 section mismatches -------------------------------------------------------------------------------- simpad_defconfig (arm, gcc-10) — PASS, 0 errors, 0 warnings, 0 section mismatches -------------------------------------------------------------------------------- socfpga_defconfig (arm, gcc-10) — PASS, 0 errors, 0 warnings, 0 section mismatches -------------------------------------------------------------------------------- spear13xx_defconfig (arm, gcc-10) — PASS, 0 errors, 0 warnings, 0 section mismatches -------------------------------------------------------------------------------- spear3xx_defconfig (arm, gcc-10) — PASS, 0 errors, 0 warnings, 0 section mismatches -------------------------------------------------------------------------------- spear6xx_defconfig (arm, gcc-10) — PASS, 0 errors, 0 warnings, 0 section mismatches -------------------------------------------------------------------------------- spitz_defconfig (arm, gcc-10) — PASS, 0 errors, 0 warnings, 0 section mismatches -------------------------------------------------------------------------------- stm32_defconfig (arm, gcc-10) — PASS, 0 errors, 0 warnings, 0 section mismatches -------------------------------------------------------------------------------- sunxi_defconfig (arm, gcc-10) — PASS, 0 errors, 0 warnings, 0 section mismatches -------------------------------------------------------------------------------- tango4_defconfig (arm, gcc-10) — PASS, 0 errors, 0 warnings, 0 section mismatches -------------------------------------------------------------------------------- tb0219_defconfig (mips, gcc-10) — PASS, 0 errors, 0 warnings, 0 section mismatches -------------------------------------------------------------------------------- tb0226_defconfig (mips, gcc-10) — PASS, 0 errors, 0 warnings, 0 section mismatches -------------------------------------------------------------------------------- tb0287_defconfig (mips, gcc-10) — PASS, 0 errors, 0 warnings, 0 section mismatches -------------------------------------------------------------------------------- tct_hammer_defconfig (arm, gcc-10) — PASS, 0 errors, 0 warnings, 0 section mismatches -------------------------------------------------------------------------------- tegra_defconfig (arm, gcc-10) — PASS, 0 errors, 0 warnings, 0 section mismatches -------------------------------------------------------------------------------- tinyconfig (arc, gcc-10) — PASS, 0 errors, 0 warnings, 0 section mismatches -------------------------------------------------------------------------------- tinyconfig (i386, gcc-10) — PASS, 0 errors, 0 warnings, 0 section mismatches -------------------------------------------------------------------------------- tinyconfig (x86_64, gcc-10) — PASS, 0 errors, 0 warnings, 0 section mismatches -------------------------------------------------------------------------------- trizeps4_defconfig (arm, gcc-10) — PASS, 0 errors, 0 warnings, 0 section mismatches -------------------------------------------------------------------------------- u300_defconfig (arm, gcc-10) — PASS, 0 errors, 0 warnings, 0 section mismatches -------------------------------------------------------------------------------- u8500_defconfig (arm, gcc-10) — PASS, 0 errors, 0 warnings, 0 section mismatches -------------------------------------------------------------------------------- vdk_hs38_defconfig (arc, gcc-10) — PASS, 0 errors, 0 warnings, 0 section mismatches -------------------------------------------------------------------------------- vdk_hs38_smp_defconfig (arc, gcc-10) — PASS, 0 errors, 0 warnings, 0 section mismatches -------------------------------------------------------------------------------- versatile_defconfig (arm, gcc-10) — PASS, 0 errors, 0 warnings, 0 section mismatches -------------------------------------------------------------------------------- vexpress_defconfig (arm, gcc-10) — PASS, 0 errors, 0 warnings, 0 section mismatches -------------------------------------------------------------------------------- vf610m4_defconfig (arm, gcc-10) — PASS, 0 errors, 0 warnings, 0 section mismatches -------------------------------------------------------------------------------- viper_defconfig (arm, gcc-10) — PASS, 0 errors, 0 warnings, 0 section mismatches -------------------------------------------------------------------------------- vocore2_defconfig (mips, gcc-10) — PASS, 0 errors, 0 warnings, 0 section mismatches -------------------------------------------------------------------------------- vt8500_v6_v7_defconfig (arm, gcc-10) — PASS, 0 errors, 0 warnings, 0 section mismatches -------------------------------------------------------------------------------- workpad_defconfig (mips, gcc-10) — PASS, 0 errors, 0 warnings, 0 section mismatches -------------------------------------------------------------------------------- x86_64_defconfig (x86_64, gcc-10) — PASS, 0 errors, 0 warnings, 0 section mismatches -------------------------------------------------------------------------------- x86_64_defconfig+x86-chromebook (x86_64, gcc-10) — PASS, 0 errors, 0 warnings, 0 section mismatches -------------------------------------------------------------------------------- xcep_defconfig (arm, gcc-10) — PASS, 0 errors, 0 warnings, 0 section mismatches -------------------------------------------------------------------------------- zeus_defconfig (arm, gcc-10) — PASS, 0 errors, 0 warnings, 0 section mismatches -------------------------------------------------------------------------------- zx_defconfig (arm, gcc-10) — PASS, 0 errors, 0 warnings, 0 section mismatches --- For more info write to <info(a)kernelci.org>
2 years, 7 months
1
0
0
0
stable-rc/queue/5.15 baseline: 109 runs, 2 regressions (v5.15.43-3-ga16def6cd632)
by kernelci.org bot
stable-rc/queue/5.15 baseline: 109 runs, 2 regressions (v5.15.43-3-ga16def6cd632) Regressions Summary ------------------- platform | arch | lab | compiler | defconfig | regressions -----------+------+--------------+----------+--------------------+------------ jetson-tk1 | arm | lab-baylibre | gcc-10 | multi_v7_defconfig | 1 jetson-tk1 | arm | lab-baylibre | gcc-10 | tegra_defconfig | 1 Details:
https://kernelci.org/test/job/stable-rc/branch/queue%2F5.15/kernel/v5.15.43…
Test: baseline Tree: stable-rc Branch: queue/5.15 Describe: v5.15.43-3-ga16def6cd632 URL:
https://git.kernel.org/pub/scm/linux/kernel/git/stable/linux-stable-rc.git
SHA: a16def6cd6327c36957ee0f10ebc608c99f21259 Test Regressions ---------------- platform | arch | lab | compiler | defconfig | regressions -----------+------+--------------+----------+--------------------+------------ jetson-tk1 | arm | lab-baylibre | gcc-10 | multi_v7_defconfig | 1 Details:
https://kernelci.org/test/plan/id/628f9d966641490433a39bd4
Results: 0 PASS, 1 FAIL, 0 SKIP Full config: multi_v7_defconfig Compiler: gcc-10 (arm-linux-gnueabihf-gcc (Debian 10.2.1-6) 10.2.1 20210110) Plain log:
https://storage.kernelci.org//stable-rc/queue-5.15/v5.15.43-3-ga16def6cd632…
HTML log:
https://storage.kernelci.org//stable-rc/queue-5.15/v5.15.43-3-ga16def6cd632…
Rootfs:
http://storage.kernelci.org/images/rootfs/buildroot/buildroot-baseline/2022…
* baseline.login:
https://kernelci.org/test/case/id/628f9d966641490433a39bd5
failing since 2 days (last pass: v5.15.40-98-g6e388a6f5046, first fail: v5.15.41-132-gede7034a09d1) platform | arch | lab | compiler | defconfig | regressions -----------+------+--------------+----------+--------------------+------------ jetson-tk1 | arm | lab-baylibre | gcc-10 | tegra_defconfig | 1 Details:
https://kernelci.org/test/plan/id/628f9ad8fe64cd757fa39c9b
Results: 0 PASS, 1 FAIL, 0 SKIP Full config: tegra_defconfig Compiler: gcc-10 (arm-linux-gnueabihf-gcc (Debian 10.2.1-6) 10.2.1 20210110) Plain log:
https://storage.kernelci.org//stable-rc/queue-5.15/v5.15.43-3-ga16def6cd632…
HTML log:
https://storage.kernelci.org//stable-rc/queue-5.15/v5.15.43-3-ga16def6cd632…
Rootfs:
http://storage.kernelci.org/images/rootfs/buildroot/buildroot-baseline/2022…
* baseline.login:
https://kernelci.org/test/case/id/628f9ad8fe64cd757fa39c9c
failing since 2 days (last pass: v5.15.40-98-g6e388a6f5046, first fail: v5.15.41-132-gede7034a09d1)
2 years, 7 months
1
0
0
0
stable-rc/queue/5.17 build: 176 builds: 2 failed, 174 passed, 4 errors, 1 warning (v5.17.11-110-g77c86f3d903a)
by kernelci.org bot
stable-rc/queue/5.17 build: 176 builds: 2 failed, 174 passed, 4 errors, 1 warning (v5.17.11-110-g77c86f3d903a) Full Build Summary:
https://kernelci.org/build/stable-rc/branch/queue%2F5.17/kernel/v5.17.11-11…
Tree: stable-rc Branch: queue/5.17 Git Describe: v5.17.11-110-g77c86f3d903a Git Commit: 77c86f3d903a91b1a0213b971df38bbe509c68ba Git URL:
https://git.kernel.org/pub/scm/linux/kernel/git/stable/linux-stable-rc.git
Built: 7 unique architectures Build Failures Detected: arm: rpc_defconfig: (gcc-10) FAIL mips: decstation_64_defconfig: (gcc-10) FAIL Errors and Warnings Detected: arc: arm64: arm: rpc_defconfig (gcc-10): 2 errors i386: mips: 32r2el_defconfig (gcc-10): 1 warning fuloong2e_defconfig (gcc-10): 1 error lemote2f_defconfig (gcc-10): 1 error riscv: x86_64: Errors summary: 2 cc1: error: ‘-mloongson-mmi’ must be used with ‘-mhard-float’ 1 arch/arm/kernel/head.S:319: Error: missing expression -- `ldr r7,=0x' 1 arch/arm/kernel/head.S:319: Error: missing expression -- `ldr r3,=0x' Warnings summary: 1 arch/mips/boot/dts/img/boston.dts:128.19-178.5: Warning (pci_device_reg): /pci@14000000/pci2_root@0,0,0: PCI unit address format error, expected "0,0" ================================================================================ Detailed per-defconfig build reports: -------------------------------------------------------------------------------- 32r2el_defconfig (mips, gcc-10) — PASS, 0 errors, 1 warning, 0 section mismatches Warnings: arch/mips/boot/dts/img/boston.dts:128.19-178.5: Warning (pci_device_reg): /pci@14000000/pci2_root@0,0,0: PCI unit address format error, expected "0,0" -------------------------------------------------------------------------------- allnoconfig (arc, gcc-10) — PASS, 0 errors, 0 warnings, 0 section mismatches -------------------------------------------------------------------------------- allnoconfig (x86_64, gcc-10) — PASS, 0 errors, 0 warnings, 0 section mismatches -------------------------------------------------------------------------------- allnoconfig (i386, gcc-10) — PASS, 0 errors, 0 warnings, 0 section mismatches -------------------------------------------------------------------------------- am200epdkit_defconfig (arm, gcc-10) — PASS, 0 errors, 0 warnings, 0 section mismatches -------------------------------------------------------------------------------- ar7_defconfig (mips, gcc-10) — PASS, 0 errors, 0 warnings, 0 section mismatches -------------------------------------------------------------------------------- aspeed_g4_defconfig (arm, gcc-10) — PASS, 0 errors, 0 warnings, 0 section mismatches -------------------------------------------------------------------------------- aspeed_g5_defconfig (arm, gcc-10) — PASS, 0 errors, 0 warnings, 0 section mismatches -------------------------------------------------------------------------------- assabet_defconfig (arm, gcc-10) — PASS, 0 errors, 0 warnings, 0 section mismatches -------------------------------------------------------------------------------- at91_dt_defconfig (arm, gcc-10) — PASS, 0 errors, 0 warnings, 0 section mismatches -------------------------------------------------------------------------------- ath25_defconfig (mips, gcc-10) — PASS, 0 errors, 0 warnings, 0 section mismatches -------------------------------------------------------------------------------- ath79_defconfig (mips, gcc-10) — PASS, 0 errors, 0 warnings, 0 section mismatches -------------------------------------------------------------------------------- axm55xx_defconfig (arm, gcc-10) — PASS, 0 errors, 0 warnings, 0 section mismatches -------------------------------------------------------------------------------- axs103_defconfig (arc, gcc-10) — PASS, 0 errors, 0 warnings, 0 section mismatches -------------------------------------------------------------------------------- axs103_smp_defconfig (arc, gcc-10) — PASS, 0 errors, 0 warnings, 0 section mismatches -------------------------------------------------------------------------------- badge4_defconfig (arm, gcc-10) — PASS, 0 errors, 0 warnings, 0 section mismatches -------------------------------------------------------------------------------- bcm2835_defconfig (arm, gcc-10) — PASS, 0 errors, 0 warnings, 0 section mismatches -------------------------------------------------------------------------------- bcm47xx_defconfig (mips, gcc-10) — PASS, 0 errors, 0 warnings, 0 section mismatches -------------------------------------------------------------------------------- bcm63xx_defconfig (mips, gcc-10) — PASS, 0 errors, 0 warnings, 0 section mismatches -------------------------------------------------------------------------------- bigsur_defconfig (mips, gcc-10) — PASS, 0 errors, 0 warnings, 0 section mismatches -------------------------------------------------------------------------------- bmips_be_defconfig (mips, gcc-10) — PASS, 0 errors, 0 warnings, 0 section mismatches -------------------------------------------------------------------------------- bmips_stb_defconfig (mips, gcc-10) — PASS, 0 errors, 0 warnings, 0 section mismatches -------------------------------------------------------------------------------- capcella_defconfig (mips, gcc-10) — PASS, 0 errors, 0 warnings, 0 section mismatches -------------------------------------------------------------------------------- cavium_octeon_defconfig (mips, gcc-10) — PASS, 0 errors, 0 warnings, 0 section mismatches -------------------------------------------------------------------------------- cerfcube_defconfig (arm, gcc-10) — PASS, 0 errors, 0 warnings, 0 section mismatches -------------------------------------------------------------------------------- ci20_defconfig (mips, gcc-10) — PASS, 0 errors, 0 warnings, 0 section mismatches -------------------------------------------------------------------------------- cm_x300_defconfig (arm, gcc-10) — PASS, 0 errors, 0 warnings, 0 section mismatches -------------------------------------------------------------------------------- cobalt_defconfig (mips, gcc-10) — PASS, 0 errors, 0 warnings, 0 section mismatches -------------------------------------------------------------------------------- colibri_pxa270_defconfig (arm, gcc-10) — PASS, 0 errors, 0 warnings, 0 section mismatches -------------------------------------------------------------------------------- colibri_pxa300_defconfig (arm, gcc-10) — PASS, 0 errors, 0 warnings, 0 section mismatches -------------------------------------------------------------------------------- collie_defconfig (arm, gcc-10) — PASS, 0 errors, 0 warnings, 0 section mismatches -------------------------------------------------------------------------------- corgi_defconfig (arm, gcc-10) — PASS, 0 errors, 0 warnings, 0 section mismatches -------------------------------------------------------------------------------- cu1000-neo_defconfig (mips, gcc-10) — PASS, 0 errors, 0 warnings, 0 section mismatches -------------------------------------------------------------------------------- cu1830-neo_defconfig (mips, gcc-10) — PASS, 0 errors, 0 warnings, 0 section mismatches -------------------------------------------------------------------------------- davinci_all_defconfig (arm, gcc-10) — PASS, 0 errors, 0 warnings, 0 section mismatches -------------------------------------------------------------------------------- db1xxx_defconfig (mips, gcc-10) — PASS, 0 errors, 0 warnings, 0 section mismatches -------------------------------------------------------------------------------- decstation_64_defconfig (mips, gcc-10) — FAIL, 0 errors, 0 warnings, 0 section mismatches -------------------------------------------------------------------------------- decstation_defconfig (mips, gcc-10) — PASS, 0 errors, 0 warnings, 0 section mismatches -------------------------------------------------------------------------------- decstation_r4k_defconfig (mips, gcc-10) — PASS, 0 errors, 0 warnings, 0 section mismatches -------------------------------------------------------------------------------- defconfig (riscv, gcc-10) — PASS, 0 errors, 0 warnings, 0 section mismatches -------------------------------------------------------------------------------- defconfig (arm64, gcc-10) — PASS, 0 errors, 0 warnings, 0 section mismatches -------------------------------------------------------------------------------- defconfig+arm64-chromebook (arm64, gcc-10) — PASS, 0 errors, 0 warnings, 0 section mismatches -------------------------------------------------------------------------------- dove_defconfig (arm, gcc-10) — PASS, 0 errors, 0 warnings, 0 section mismatches -------------------------------------------------------------------------------- e55_defconfig (mips, gcc-10) — PASS, 0 errors, 0 warnings, 0 section mismatches -------------------------------------------------------------------------------- ep93xx_defconfig (arm, gcc-10) — PASS, 0 errors, 0 warnings, 0 section mismatches -------------------------------------------------------------------------------- eseries_pxa_defconfig (arm, gcc-10) — PASS, 0 errors, 0 warnings, 0 section mismatches -------------------------------------------------------------------------------- exynos_defconfig (arm, gcc-10) — PASS, 0 errors, 0 warnings, 0 section mismatches -------------------------------------------------------------------------------- ezx_defconfig (arm, gcc-10) — PASS, 0 errors, 0 warnings, 0 section mismatches -------------------------------------------------------------------------------- footbridge_defconfig (arm, gcc-10) — PASS, 0 errors, 0 warnings, 0 section mismatches -------------------------------------------------------------------------------- fuloong2e_defconfig (mips, gcc-10) — PASS, 1 error, 0 warnings, 0 section mismatches Errors: cc1: error: ‘-mloongson-mmi’ must be used with ‘-mhard-float’ -------------------------------------------------------------------------------- gcw0_defconfig (mips, gcc-10) — PASS, 0 errors, 0 warnings, 0 section mismatches -------------------------------------------------------------------------------- gpr_defconfig (mips, gcc-10) — PASS, 0 errors, 0 warnings, 0 section mismatches -------------------------------------------------------------------------------- h3600_defconfig (arm, gcc-10) — PASS, 0 errors, 0 warnings, 0 section mismatches -------------------------------------------------------------------------------- h5000_defconfig (arm, gcc-10) — PASS, 0 errors, 0 warnings, 0 section mismatches -------------------------------------------------------------------------------- hackkit_defconfig (arm, gcc-10) — PASS, 0 errors, 0 warnings, 0 section mismatches -------------------------------------------------------------------------------- haps_hs_defconfig (arc, gcc-10) — PASS, 0 errors, 0 warnings, 0 section mismatches -------------------------------------------------------------------------------- haps_hs_smp_defconfig (arc, gcc-10) — PASS, 0 errors, 0 warnings, 0 section mismatches -------------------------------------------------------------------------------- hisi_defconfig (arm, gcc-10) — PASS, 0 errors, 0 warnings, 0 section mismatches -------------------------------------------------------------------------------- hsdk_defconfig (arc, gcc-10) — PASS, 0 errors, 0 warnings, 0 section mismatches -------------------------------------------------------------------------------- i386_defconfig (i386, gcc-10) — PASS, 0 errors, 0 warnings, 0 section mismatches -------------------------------------------------------------------------------- imote2_defconfig (arm, gcc-10) — PASS, 0 errors, 0 warnings, 0 section mismatches -------------------------------------------------------------------------------- imx_v4_v5_defconfig (arm, gcc-10) — PASS, 0 errors, 0 warnings, 0 section mismatches -------------------------------------------------------------------------------- imx_v6_v7_defconfig (arm, gcc-10) — PASS, 0 errors, 0 warnings, 0 section mismatches -------------------------------------------------------------------------------- integrator_defconfig (arm, gcc-10) — PASS, 0 errors, 0 warnings, 0 section mismatches -------------------------------------------------------------------------------- iop32x_defconfig (arm, gcc-10) — PASS, 0 errors, 0 warnings, 0 section mismatches -------------------------------------------------------------------------------- ip22_defconfig (mips, gcc-10) — PASS, 0 errors, 0 warnings, 0 section mismatches -------------------------------------------------------------------------------- ip27_defconfig (mips, gcc-10) — PASS, 0 errors, 0 warnings, 0 section mismatches -------------------------------------------------------------------------------- ip28_defconfig (mips, gcc-10) — PASS, 0 errors, 0 warnings, 0 section mismatches -------------------------------------------------------------------------------- ip32_defconfig (mips, gcc-10) — PASS, 0 errors, 0 warnings, 0 section mismatches -------------------------------------------------------------------------------- ixp4xx_defconfig (arm, gcc-10) — PASS, 0 errors, 0 warnings, 0 section mismatches -------------------------------------------------------------------------------- jazz_defconfig (mips, gcc-10) — PASS, 0 errors, 0 warnings, 0 section mismatches -------------------------------------------------------------------------------- jmr3927_defconfig (mips, gcc-10) — PASS, 0 errors, 0 warnings, 0 section mismatches -------------------------------------------------------------------------------- jornada720_defconfig (arm, gcc-10) — PASS, 0 errors, 0 warnings, 0 section mismatches -------------------------------------------------------------------------------- keystone_defconfig (arm, gcc-10) — PASS, 0 errors, 0 warnings, 0 section mismatches -------------------------------------------------------------------------------- lart_defconfig (arm, gcc-10) — PASS, 0 errors, 0 warnings, 0 section mismatches -------------------------------------------------------------------------------- lemote2f_defconfig (mips, gcc-10) — PASS, 1 error, 0 warnings, 0 section mismatches Errors: cc1: error: ‘-mloongson-mmi’ must be used with ‘-mhard-float’ -------------------------------------------------------------------------------- loongson1c_defconfig (mips, gcc-10) — PASS, 0 errors, 0 warnings, 0 section mismatches -------------------------------------------------------------------------------- loongson2k_defconfig (mips, gcc-10) — PASS, 0 errors, 0 warnings, 0 section mismatches -------------------------------------------------------------------------------- loongson3_defconfig (mips, gcc-10) — PASS, 0 errors, 0 warnings, 0 section mismatches -------------------------------------------------------------------------------- lpc18xx_defconfig (arm, gcc-10) — PASS, 0 errors, 0 warnings, 0 section mismatches -------------------------------------------------------------------------------- lpc32xx_defconfig (arm, gcc-10) — PASS, 0 errors, 0 warnings, 0 section mismatches -------------------------------------------------------------------------------- lpd270_defconfig (arm, gcc-10) — PASS, 0 errors, 0 warnings, 0 section mismatches -------------------------------------------------------------------------------- lubbock_defconfig (arm, gcc-10) — PASS, 0 errors, 0 warnings, 0 section mismatches -------------------------------------------------------------------------------- magician_defconfig (arm, gcc-10) — PASS, 0 errors, 0 warnings, 0 section mismatches -------------------------------------------------------------------------------- mainstone_defconfig (arm, gcc-10) — PASS, 0 errors, 0 warnings, 0 section mismatches -------------------------------------------------------------------------------- malta_defconfig (mips, gcc-10) — PASS, 0 errors, 0 warnings, 0 section mismatches -------------------------------------------------------------------------------- malta_kvm_defconfig (mips, gcc-10) — PASS, 0 errors, 0 warnings, 0 section mismatches -------------------------------------------------------------------------------- malta_qemu_32r6_defconfig (mips, gcc-10) — PASS, 0 errors, 0 warnings, 0 section mismatches -------------------------------------------------------------------------------- maltaaprp_defconfig (mips, gcc-10) — PASS, 0 errors, 0 warnings, 0 section mismatches -------------------------------------------------------------------------------- maltasmvp_defconfig (mips, gcc-10) — PASS, 0 errors, 0 warnings, 0 section mismatches -------------------------------------------------------------------------------- maltasmvp_eva_defconfig (mips, gcc-10) — PASS, 0 errors, 0 warnings, 0 section mismatches -------------------------------------------------------------------------------- maltaup_defconfig (mips, gcc-10) — PASS, 0 errors, 0 warnings, 0 section mismatches -------------------------------------------------------------------------------- maltaup_xpa_defconfig (mips, gcc-10) — PASS, 0 errors, 0 warnings, 0 section mismatches -------------------------------------------------------------------------------- milbeaut_m10v_defconfig (arm, gcc-10) — PASS, 0 errors, 0 warnings, 0 section mismatches -------------------------------------------------------------------------------- mini2440_defconfig (arm, gcc-10) — PASS, 0 errors, 0 warnings, 0 section mismatches -------------------------------------------------------------------------------- mmp2_defconfig (arm, gcc-10) — PASS, 0 errors, 0 warnings, 0 section mismatches -------------------------------------------------------------------------------- moxart_defconfig (arm, gcc-10) — PASS, 0 errors, 0 warnings, 0 section mismatches -------------------------------------------------------------------------------- mpc30x_defconfig (mips, gcc-10) — PASS, 0 errors, 0 warnings, 0 section mismatches -------------------------------------------------------------------------------- mps2_defconfig (arm, gcc-10) — PASS, 0 errors, 0 warnings, 0 section mismatches -------------------------------------------------------------------------------- mtx1_defconfig (mips, gcc-10) — PASS, 0 errors, 0 warnings, 0 section mismatches -------------------------------------------------------------------------------- multi_v4t_defconfig (arm, gcc-10) — PASS, 0 errors, 0 warnings, 0 section mismatches -------------------------------------------------------------------------------- multi_v5_defconfig (arm, gcc-10) — PASS, 0 errors, 0 warnings, 0 section mismatches -------------------------------------------------------------------------------- multi_v7_defconfig (arm, gcc-10) — PASS, 0 errors, 0 warnings, 0 section mismatches -------------------------------------------------------------------------------- mvebu_v5_defconfig (arm, gcc-10) — PASS, 0 errors, 0 warnings, 0 section mismatches -------------------------------------------------------------------------------- mvebu_v7_defconfig (arm, gcc-10) — PASS, 0 errors, 0 warnings, 0 section mismatches -------------------------------------------------------------------------------- mxs_defconfig (arm, gcc-10) — PASS, 0 errors, 0 warnings, 0 section mismatches -------------------------------------------------------------------------------- neponset_defconfig (arm, gcc-10) — PASS, 0 errors, 0 warnings, 0 section mismatches -------------------------------------------------------------------------------- netwinder_defconfig (arm, gcc-10) — PASS, 0 errors, 0 warnings, 0 section mismatches -------------------------------------------------------------------------------- nhk8815_defconfig (arm, gcc-10) — PASS, 0 errors, 0 warnings, 0 section mismatches -------------------------------------------------------------------------------- nommu_k210_defconfig (riscv, gcc-10) — PASS, 0 errors, 0 warnings, 0 section mismatches -------------------------------------------------------------------------------- nommu_k210_sdcard_defconfig (riscv, gcc-10) — PASS, 0 errors, 0 warnings, 0 section mismatches -------------------------------------------------------------------------------- nsimosci_hs_defconfig (arc, gcc-10) — PASS, 0 errors, 0 warnings, 0 section mismatches -------------------------------------------------------------------------------- nsimosci_hs_smp_defconfig (arc, gcc-10) — PASS, 0 errors, 0 warnings, 0 section mismatches -------------------------------------------------------------------------------- omap1_defconfig (arm, gcc-10) — PASS, 0 errors, 0 warnings, 0 section mismatches -------------------------------------------------------------------------------- omap2plus_defconfig (arm, gcc-10) — PASS, 0 errors, 0 warnings, 0 section mismatches -------------------------------------------------------------------------------- omega2p_defconfig (mips, gcc-10) — PASS, 0 errors, 0 warnings, 0 section mismatches -------------------------------------------------------------------------------- orion5x_defconfig (arm, gcc-10) — PASS, 0 errors, 0 warnings, 0 section mismatches -------------------------------------------------------------------------------- oxnas_v6_defconfig (arm, gcc-10) — PASS, 0 errors, 0 warnings, 0 section mismatches -------------------------------------------------------------------------------- palmz72_defconfig (arm, gcc-10) — PASS, 0 errors, 0 warnings, 0 section mismatches -------------------------------------------------------------------------------- pcm027_defconfig (arm, gcc-10) — PASS, 0 errors, 0 warnings, 0 section mismatches -------------------------------------------------------------------------------- pic32mzda_defconfig (mips, gcc-10) — PASS, 0 errors, 0 warnings, 0 section mismatches -------------------------------------------------------------------------------- pleb_defconfig (arm, gcc-10) — PASS, 0 errors, 0 warnings, 0 section mismatches -------------------------------------------------------------------------------- pxa168_defconfig (arm, gcc-10) — PASS, 0 errors, 0 warnings, 0 section mismatches -------------------------------------------------------------------------------- pxa255-idp_defconfig (arm, gcc-10) — PASS, 0 errors, 0 warnings, 0 section mismatches -------------------------------------------------------------------------------- pxa3xx_defconfig (arm, gcc-10) — PASS, 0 errors, 0 warnings, 0 section mismatches -------------------------------------------------------------------------------- pxa910_defconfig (arm, gcc-10) — PASS, 0 errors, 0 warnings, 0 section mismatches -------------------------------------------------------------------------------- pxa_defconfig (arm, gcc-10) — PASS, 0 errors, 0 warnings, 0 section mismatches -------------------------------------------------------------------------------- qcom_defconfig (arm, gcc-10) — PASS, 0 errors, 0 warnings, 0 section mismatches -------------------------------------------------------------------------------- qi_lb60_defconfig (mips, gcc-10) — PASS, 0 errors, 0 warnings, 0 section mismatches -------------------------------------------------------------------------------- rb532_defconfig (mips, gcc-10) — PASS, 0 errors, 0 warnings, 0 section mismatches -------------------------------------------------------------------------------- rbtx49xx_defconfig (mips, gcc-10) — PASS, 0 errors, 0 warnings, 0 section mismatches -------------------------------------------------------------------------------- realview_defconfig (arm, gcc-10) — PASS, 0 errors, 0 warnings, 0 section mismatches -------------------------------------------------------------------------------- rm200_defconfig (mips, gcc-10) — PASS, 0 errors, 0 warnings, 0 section mismatches -------------------------------------------------------------------------------- rpc_defconfig (arm, gcc-10) — FAIL, 2 errors, 0 warnings, 0 section mismatches Errors: arch/arm/kernel/head.S:319: Error: missing expression -- `ldr r7,=0x' arch/arm/kernel/head.S:319: Error: missing expression -- `ldr r3,=0x' -------------------------------------------------------------------------------- rs90_defconfig (mips, gcc-10) — PASS, 0 errors, 0 warnings, 0 section mismatches -------------------------------------------------------------------------------- rt305x_defconfig (mips, gcc-10) — PASS, 0 errors, 0 warnings, 0 section mismatches -------------------------------------------------------------------------------- rv32_defconfig (riscv, gcc-10) — PASS, 0 errors, 0 warnings, 0 section mismatches -------------------------------------------------------------------------------- s3c2410_defconfig (arm, gcc-10) — PASS, 0 errors, 0 warnings, 0 section mismatches -------------------------------------------------------------------------------- s3c6400_defconfig (arm, gcc-10) — PASS, 0 errors, 0 warnings, 0 section mismatches -------------------------------------------------------------------------------- s5pv210_defconfig (arm, gcc-10) — PASS, 0 errors, 0 warnings, 0 section mismatches -------------------------------------------------------------------------------- sama5_defconfig (arm, gcc-10) — PASS, 0 errors, 0 warnings, 0 section mismatches -------------------------------------------------------------------------------- sama7_defconfig (arm, gcc-10) — PASS, 0 errors, 0 warnings, 0 section mismatches -------------------------------------------------------------------------------- sb1250_swarm_defconfig (mips, gcc-10) — PASS, 0 errors, 0 warnings, 0 section mismatches -------------------------------------------------------------------------------- shannon_defconfig (arm, gcc-10) — PASS, 0 errors, 0 warnings, 0 section mismatches -------------------------------------------------------------------------------- shmobile_defconfig (arm, gcc-10) — PASS, 0 errors, 0 warnings, 0 section mismatches -------------------------------------------------------------------------------- simpad_defconfig (arm, gcc-10) — PASS, 0 errors, 0 warnings, 0 section mismatches -------------------------------------------------------------------------------- socfpga_defconfig (arm, gcc-10) — PASS, 0 errors, 0 warnings, 0 section mismatches -------------------------------------------------------------------------------- spear13xx_defconfig (arm, gcc-10) — PASS, 0 errors, 0 warnings, 0 section mismatches -------------------------------------------------------------------------------- spear3xx_defconfig (arm, gcc-10) — PASS, 0 errors, 0 warnings, 0 section mismatches -------------------------------------------------------------------------------- spear6xx_defconfig (arm, gcc-10) — PASS, 0 errors, 0 warnings, 0 section mismatches -------------------------------------------------------------------------------- spitz_defconfig (arm, gcc-10) — PASS, 0 errors, 0 warnings, 0 section mismatches -------------------------------------------------------------------------------- stm32_defconfig (arm, gcc-10) — PASS, 0 errors, 0 warnings, 0 section mismatches -------------------------------------------------------------------------------- sunxi_defconfig (arm, gcc-10) — PASS, 0 errors, 0 warnings, 0 section mismatches -------------------------------------------------------------------------------- tb0219_defconfig (mips, gcc-10) — PASS, 0 errors, 0 warnings, 0 section mismatches -------------------------------------------------------------------------------- tb0226_defconfig (mips, gcc-10) — PASS, 0 errors, 0 warnings, 0 section mismatches -------------------------------------------------------------------------------- tb0287_defconfig (mips, gcc-10) — PASS, 0 errors, 0 warnings, 0 section mismatches -------------------------------------------------------------------------------- tct_hammer_defconfig (arm, gcc-10) — PASS, 0 errors, 0 warnings, 0 section mismatches -------------------------------------------------------------------------------- tegra_defconfig (arm, gcc-10) — PASS, 0 errors, 0 warnings, 0 section mismatches -------------------------------------------------------------------------------- tinyconfig (x86_64, gcc-10) — PASS, 0 errors, 0 warnings, 0 section mismatches -------------------------------------------------------------------------------- tinyconfig (i386, gcc-10) — PASS, 0 errors, 0 warnings, 0 section mismatches -------------------------------------------------------------------------------- tinyconfig (arc, gcc-10) — PASS, 0 errors, 0 warnings, 0 section mismatches -------------------------------------------------------------------------------- trizeps4_defconfig (arm, gcc-10) — PASS, 0 errors, 0 warnings, 0 section mismatches -------------------------------------------------------------------------------- u8500_defconfig (arm, gcc-10) — PASS, 0 errors, 0 warnings, 0 section mismatches -------------------------------------------------------------------------------- vdk_hs38_defconfig (arc, gcc-10) — PASS, 0 errors, 0 warnings, 0 section mismatches -------------------------------------------------------------------------------- vdk_hs38_smp_defconfig (arc, gcc-10) — PASS, 0 errors, 0 warnings, 0 section mismatches -------------------------------------------------------------------------------- versatile_defconfig (arm, gcc-10) — PASS, 0 errors, 0 warnings, 0 section mismatches -------------------------------------------------------------------------------- vexpress_defconfig (arm, gcc-10) — PASS, 0 errors, 0 warnings, 0 section mismatches -------------------------------------------------------------------------------- vf610m4_defconfig (arm, gcc-10) — PASS, 0 errors, 0 warnings, 0 section mismatches -------------------------------------------------------------------------------- viper_defconfig (arm, gcc-10) — PASS, 0 errors, 0 warnings, 0 section mismatches -------------------------------------------------------------------------------- vocore2_defconfig (mips, gcc-10) — PASS, 0 errors, 0 warnings, 0 section mismatches -------------------------------------------------------------------------------- vt8500_v6_v7_defconfig (arm, gcc-10) — PASS, 0 errors, 0 warnings, 0 section mismatches -------------------------------------------------------------------------------- workpad_defconfig (mips, gcc-10) — PASS, 0 errors, 0 warnings, 0 section mismatches -------------------------------------------------------------------------------- x86_64_defconfig (x86_64, gcc-10) — PASS, 0 errors, 0 warnings, 0 section mismatches -------------------------------------------------------------------------------- x86_64_defconfig+x86-chromebook (x86_64, gcc-10) — PASS, 0 errors, 0 warnings, 0 section mismatches -------------------------------------------------------------------------------- xcep_defconfig (arm, gcc-10) — PASS, 0 errors, 0 warnings, 0 section mismatches -------------------------------------------------------------------------------- zeus_defconfig (arm, gcc-10) — PASS, 0 errors, 0 warnings, 0 section mismatches --- For more info write to <info(a)kernelci.org>
2 years, 7 months
1
0
0
0
stable-rc/queue/5.4 baseline: 111 runs, 9 regressions (v5.4.196-8-g76bb630b46fa)
by kernelci.org bot
stable-rc/queue/5.4 baseline: 111 runs, 9 regressions (v5.4.196-8-g76bb630b46fa) Regressions Summary ------------------- platform | arch | lab | compiler | defconfig | regressions ---------------------------+-------+--------------+----------+----------------------------+------------ jetson-tk1 | arm | lab-baylibre | gcc-10 | multi_v7_defconfig | 1 qemu_arm64-virt-gicv2 | arm64 | lab-broonie | gcc-10 | defconfig | 1 qemu_arm64-virt-gicv2 | arm64 | lab-broonie | gcc-10 | defconfig+arm64-chromebook | 1 qemu_arm64-virt-gicv2-uefi | arm64 | lab-broonie | gcc-10 | defconfig | 1 qemu_arm64-virt-gicv2-uefi | arm64 | lab-broonie | gcc-10 | defconfig+arm64-chromebook | 1 qemu_arm64-virt-gicv3 | arm64 | lab-broonie | gcc-10 | defconfig | 1 qemu_arm64-virt-gicv3 | arm64 | lab-broonie | gcc-10 | defconfig+arm64-chromebook | 1 qemu_arm64-virt-gicv3-uefi | arm64 | lab-broonie | gcc-10 | defconfig | 1 qemu_arm64-virt-gicv3-uefi | arm64 | lab-broonie | gcc-10 | defconfig+arm64-chromebook | 1 Details:
https://kernelci.org/test/job/stable-rc/branch/queue%2F5.4/kernel/v5.4.196-…
Test: baseline Tree: stable-rc Branch: queue/5.4 Describe: v5.4.196-8-g76bb630b46fa URL:
https://git.kernel.org/pub/scm/linux/kernel/git/stable/linux-stable-rc.git
SHA: 76bb630b46fac83a82f1b35e48f272cfe373d5b5 Test Regressions ---------------- platform | arch | lab | compiler | defconfig | regressions ---------------------------+-------+--------------+----------+----------------------------+------------ jetson-tk1 | arm | lab-baylibre | gcc-10 | multi_v7_defconfig | 1 Details:
https://kernelci.org/test/plan/id/628f98f809473dfec5a39c14
Results: 0 PASS, 1 FAIL, 0 SKIP Full config: multi_v7_defconfig Compiler: gcc-10 (arm-linux-gnueabihf-gcc (Debian 10.2.1-6) 10.2.1 20210110) Plain log:
https://storage.kernelci.org//stable-rc/queue-5.4/v5.4.196-8-g76bb630b46fa/…
HTML log:
https://storage.kernelci.org//stable-rc/queue-5.4/v5.4.196-8-g76bb630b46fa/…
Rootfs:
http://storage.kernelci.org/images/rootfs/buildroot/buildroot-baseline/2022…
* baseline.login:
https://kernelci.org/test/case/id/628f98f809473dfec5a39c15
failing since 3 days (last pass: v5.4.193-43-g4405e358a087e, first fail: v5.4.195-59-g1d29d13f032f6) platform | arch | lab | compiler | defconfig | regressions ---------------------------+-------+--------------+----------+----------------------------+------------ qemu_arm64-virt-gicv2 | arm64 | lab-broonie | gcc-10 | defconfig | 1 Details:
https://kernelci.org/test/plan/id/628f97665a2d7d30caa39bee
Results: 0 PASS, 1 FAIL, 0 SKIP Full config: defconfig Compiler: gcc-10 (aarch64-linux-gnu-gcc (Debian 10.2.1-6) 10.2.1 20210110) Plain log:
https://storage.kernelci.org//stable-rc/queue-5.4/v5.4.196-8-g76bb630b46fa/…
HTML log:
https://storage.kernelci.org//stable-rc/queue-5.4/v5.4.196-8-g76bb630b46fa/…
Rootfs:
http://storage.kernelci.org/images/rootfs/buildroot/buildroot-baseline/2022…
* baseline.login:
https://kernelci.org/test/case/id/628f97665a2d7d30caa39bef
failing since 16 days (last pass: v5.4.191-77-g1a3b249e415b, first fail: v5.4.191-125-g5917d1547e6e) platform | arch | lab | compiler | defconfig | regressions ---------------------------+-------+--------------+----------+----------------------------+------------ qemu_arm64-virt-gicv2 | arm64 | lab-broonie | gcc-10 | defconfig+arm64-chromebook | 1 Details:
https://kernelci.org/test/plan/id/628f9ac2f9f9245ac3a39be1
Results: 0 PASS, 1 FAIL, 0 SKIP Full config: defconfig+arm64-chromebook Compiler: gcc-10 (aarch64-linux-gnu-gcc (Debian 10.2.1-6) 10.2.1 20210110) Plain log:
https://storage.kernelci.org//stable-rc/queue-5.4/v5.4.196-8-g76bb630b46fa/…
HTML log:
https://storage.kernelci.org//stable-rc/queue-5.4/v5.4.196-8-g76bb630b46fa/…
Rootfs:
http://storage.kernelci.org/images/rootfs/buildroot/buildroot-baseline/2022…
* baseline.login:
https://kernelci.org/test/case/id/628f9ac2f9f9245ac3a39be2
failing since 16 days (last pass: v5.4.191-84-g56ce42d78d96, first fail: v5.4.191-125-g5917d1547e6e) platform | arch | lab | compiler | defconfig | regressions ---------------------------+-------+--------------+----------+----------------------------+------------ qemu_arm64-virt-gicv2-uefi | arm64 | lab-broonie | gcc-10 | defconfig | 1 Details:
https://kernelci.org/test/plan/id/628f97525a2d7d30caa39bcd
Results: 0 PASS, 1 FAIL, 0 SKIP Full config: defconfig Compiler: gcc-10 (aarch64-linux-gnu-gcc (Debian 10.2.1-6) 10.2.1 20210110) Plain log:
https://storage.kernelci.org//stable-rc/queue-5.4/v5.4.196-8-g76bb630b46fa/…
HTML log:
https://storage.kernelci.org//stable-rc/queue-5.4/v5.4.196-8-g76bb630b46fa/…
Rootfs:
http://storage.kernelci.org/images/rootfs/buildroot/buildroot-baseline/2022…
* baseline.login:
https://kernelci.org/test/case/id/628f97525a2d7d30caa39bce
failing since 16 days (last pass: v5.4.191-77-g1a3b249e415b, first fail: v5.4.191-125-g5917d1547e6e) platform | arch | lab | compiler | defconfig | regressions ---------------------------+-------+--------------+----------+----------------------------+------------ qemu_arm64-virt-gicv2-uefi | arm64 | lab-broonie | gcc-10 | defconfig+arm64-chromebook | 1 Details:
https://kernelci.org/test/plan/id/628f9afe07ef5b843ca39bd8
Results: 0 PASS, 1 FAIL, 0 SKIP Full config: defconfig+arm64-chromebook Compiler: gcc-10 (aarch64-linux-gnu-gcc (Debian 10.2.1-6) 10.2.1 20210110) Plain log:
https://storage.kernelci.org//stable-rc/queue-5.4/v5.4.196-8-g76bb630b46fa/…
HTML log:
https://storage.kernelci.org//stable-rc/queue-5.4/v5.4.196-8-g76bb630b46fa/…
Rootfs:
http://storage.kernelci.org/images/rootfs/buildroot/buildroot-baseline/2022…
* baseline.login:
https://kernelci.org/test/case/id/628f9afe07ef5b843ca39bd9
failing since 16 days (last pass: v5.4.191-84-g56ce42d78d96, first fail: v5.4.191-125-g5917d1547e6e) platform | arch | lab | compiler | defconfig | regressions ---------------------------+-------+--------------+----------+----------------------------+------------ qemu_arm64-virt-gicv3 | arm64 | lab-broonie | gcc-10 | defconfig | 1 Details:
https://kernelci.org/test/plan/id/628f973eccc12e802aa39c0d
Results: 0 PASS, 1 FAIL, 0 SKIP Full config: defconfig Compiler: gcc-10 (aarch64-linux-gnu-gcc (Debian 10.2.1-6) 10.2.1 20210110) Plain log:
https://storage.kernelci.org//stable-rc/queue-5.4/v5.4.196-8-g76bb630b46fa/…
HTML log:
https://storage.kernelci.org//stable-rc/queue-5.4/v5.4.196-8-g76bb630b46fa/…
Rootfs:
http://storage.kernelci.org/images/rootfs/buildroot/buildroot-baseline/2022…
* baseline.login:
https://kernelci.org/test/case/id/628f973eccc12e802aa39c0e
failing since 16 days (last pass: v5.4.191-77-g1a3b249e415b, first fail: v5.4.191-125-g5917d1547e6e) platform | arch | lab | compiler | defconfig | regressions ---------------------------+-------+--------------+----------+----------------------------+------------ qemu_arm64-virt-gicv3 | arm64 | lab-broonie | gcc-10 | defconfig+arm64-chromebook | 1 Details:
https://kernelci.org/test/plan/id/628f9ac4f9f9245ac3a39be7
Results: 0 PASS, 1 FAIL, 0 SKIP Full config: defconfig+arm64-chromebook Compiler: gcc-10 (aarch64-linux-gnu-gcc (Debian 10.2.1-6) 10.2.1 20210110) Plain log:
https://storage.kernelci.org//stable-rc/queue-5.4/v5.4.196-8-g76bb630b46fa/…
HTML log:
https://storage.kernelci.org//stable-rc/queue-5.4/v5.4.196-8-g76bb630b46fa/…
Rootfs:
http://storage.kernelci.org/images/rootfs/buildroot/buildroot-baseline/2022…
* baseline.login:
https://kernelci.org/test/case/id/628f9ac4f9f9245ac3a39be8
failing since 16 days (last pass: v5.4.191-84-g56ce42d78d96, first fail: v5.4.191-125-g5917d1547e6e) platform | arch | lab | compiler | defconfig | regressions ---------------------------+-------+--------------+----------+----------------------------+------------ qemu_arm64-virt-gicv3-uefi | arm64 | lab-broonie | gcc-10 | defconfig | 1 Details:
https://kernelci.org/test/plan/id/628f97675a2d7d30caa39bf3
Results: 0 PASS, 1 FAIL, 0 SKIP Full config: defconfig Compiler: gcc-10 (aarch64-linux-gnu-gcc (Debian 10.2.1-6) 10.2.1 20210110) Plain log:
https://storage.kernelci.org//stable-rc/queue-5.4/v5.4.196-8-g76bb630b46fa/…
HTML log:
https://storage.kernelci.org//stable-rc/queue-5.4/v5.4.196-8-g76bb630b46fa/…
Rootfs:
http://storage.kernelci.org/images/rootfs/buildroot/buildroot-baseline/2022…
* baseline.login:
https://kernelci.org/test/case/id/628f97675a2d7d30caa39bf4
failing since 16 days (last pass: v5.4.191-77-g1a3b249e415b, first fail: v5.4.191-125-g5917d1547e6e) platform | arch | lab | compiler | defconfig | regressions ---------------------------+-------+--------------+----------+----------------------------+------------ qemu_arm64-virt-gicv3-uefi | arm64 | lab-broonie | gcc-10 | defconfig+arm64-chromebook | 1 Details:
https://kernelci.org/test/plan/id/628f9b271cfe9affa5a39bcd
Results: 0 PASS, 1 FAIL, 0 SKIP Full config: defconfig+arm64-chromebook Compiler: gcc-10 (aarch64-linux-gnu-gcc (Debian 10.2.1-6) 10.2.1 20210110) Plain log:
https://storage.kernelci.org//stable-rc/queue-5.4/v5.4.196-8-g76bb630b46fa/…
HTML log:
https://storage.kernelci.org//stable-rc/queue-5.4/v5.4.196-8-g76bb630b46fa/…
Rootfs:
http://storage.kernelci.org/images/rootfs/buildroot/buildroot-baseline/2022…
* baseline.login:
https://kernelci.org/test/case/id/628f9b271cfe9affa5a39bce
failing since 16 days (last pass: v5.4.191-84-g56ce42d78d96, first fail: v5.4.191-125-g5917d1547e6e)
2 years, 7 months
1
0
0
0
stable-rc/queue/5.15 build: 158 builds: 4 failed, 154 passed, 14 errors, 4 warnings (v5.15.43-144-g375b1504fe930)
by kernelci.org bot
stable-rc/queue/5.15 build: 158 builds: 4 failed, 154 passed, 14 errors, 4 warnings (v5.15.43-144-g375b1504fe930) Full Build Summary:
https://kernelci.org/build/stable-rc/branch/queue%2F5.15/kernel/v5.15.43-14…
Tree: stable-rc Branch: queue/5.15 Git Describe: v5.15.43-144-g375b1504fe930 Git Commit: 375b1504fe9301fb7799c7ff92bea1c603fff855 Git URL:
https://git.kernel.org/pub/scm/linux/kernel/git/stable/linux-stable-rc.git
Built: 7 unique architectures Build Failures Detected: arm: rpc_defconfig: (gcc-10) FAIL mips: decstation_64_defconfig: (gcc-10) FAIL ip27_defconfig: (gcc-10) FAIL ip28_defconfig: (gcc-10) FAIL Errors and Warnings Detected: arc: tinyconfig (gcc-10): 1 warning arm64: arm: rpc_defconfig (gcc-10): 4 errors i386: mips: 32r2el_defconfig (gcc-10): 1 warning bigsur_defconfig (gcc-10): 1 error cavium_octeon_defconfig (gcc-10): 1 error decstation_64_defconfig (gcc-10): 1 error fuloong2e_defconfig (gcc-10): 1 error ip32_defconfig (gcc-10): 1 error lemote2f_defconfig (gcc-10): 1 error, 1 warning loongson2k_defconfig (gcc-10): 1 error, 1 warning loongson3_defconfig (gcc-10): 1 error nlm_xlp_defconfig (gcc-10): 1 error sb1250_swarm_defconfig (gcc-10): 1 error riscv: x86_64: Errors summary: 10 expr: syntax error: unexpected argument ‘0xffffffff80000000’ 2 arm-linux-gnueabihf-gcc: error: unrecognized -march target: armv3m 2 arm-linux-gnueabihf-gcc: error: missing argument to ‘-march=’ Warnings summary: 2 net/mac80211/mlme.c:4377:1: warning: the frame size of 1200 bytes is larger than 1024 bytes [-Wframe-larger-than=] 1 arch/mips/boot/dts/img/boston.dts:128.19-178.5: Warning (pci_device_reg): /pci@14000000/pci2_root@0,0,0: PCI unit address format error, expected "0,0" 1 arch/arc/Makefile:26: ** WARNING ** CONFIG_ARC_TUNE_MCPU flag '' is unknown, fallback to '' ================================================================================ Detailed per-defconfig build reports: -------------------------------------------------------------------------------- 32r2el_defconfig (mips, gcc-10) — PASS, 0 errors, 1 warning, 0 section mismatches Warnings: arch/mips/boot/dts/img/boston.dts:128.19-178.5: Warning (pci_device_reg): /pci@14000000/pci2_root@0,0,0: PCI unit address format error, expected "0,0" -------------------------------------------------------------------------------- allnoconfig (i386, gcc-10) — PASS, 0 errors, 0 warnings, 0 section mismatches -------------------------------------------------------------------------------- allnoconfig (x86_64, gcc-10) — PASS, 0 errors, 0 warnings, 0 section mismatches -------------------------------------------------------------------------------- am200epdkit_defconfig (arm, gcc-10) — PASS, 0 errors, 0 warnings, 0 section mismatches -------------------------------------------------------------------------------- ar7_defconfig (mips, gcc-10) — PASS, 0 errors, 0 warnings, 0 section mismatches -------------------------------------------------------------------------------- aspeed_g4_defconfig (arm, gcc-10) — PASS, 0 errors, 0 warnings, 0 section mismatches -------------------------------------------------------------------------------- aspeed_g5_defconfig (arm, gcc-10) — PASS, 0 errors, 0 warnings, 0 section mismatches -------------------------------------------------------------------------------- assabet_defconfig (arm, gcc-10) — PASS, 0 errors, 0 warnings, 0 section mismatches -------------------------------------------------------------------------------- at91_dt_defconfig (arm, gcc-10) — PASS, 0 errors, 0 warnings, 0 section mismatches -------------------------------------------------------------------------------- ath25_defconfig (mips, gcc-10) — PASS, 0 errors, 0 warnings, 0 section mismatches -------------------------------------------------------------------------------- ath79_defconfig (mips, gcc-10) — PASS, 0 errors, 0 warnings, 0 section mismatches -------------------------------------------------------------------------------- axm55xx_defconfig (arm, gcc-10) — PASS, 0 errors, 0 warnings, 0 section mismatches -------------------------------------------------------------------------------- axs103_defconfig (arc, gcc-10) — PASS, 0 errors, 0 warnings, 0 section mismatches -------------------------------------------------------------------------------- axs103_smp_defconfig (arc, gcc-10) — PASS, 0 errors, 0 warnings, 0 section mismatches -------------------------------------------------------------------------------- badge4_defconfig (arm, gcc-10) — PASS, 0 errors, 0 warnings, 0 section mismatches -------------------------------------------------------------------------------- bcm2835_defconfig (arm, gcc-10) — PASS, 0 errors, 0 warnings, 0 section mismatches -------------------------------------------------------------------------------- bcm47xx_defconfig (mips, gcc-10) — PASS, 0 errors, 0 warnings, 0 section mismatches -------------------------------------------------------------------------------- bcm63xx_defconfig (mips, gcc-10) — PASS, 0 errors, 0 warnings, 0 section mismatches -------------------------------------------------------------------------------- bigsur_defconfig (mips, gcc-10) — PASS, 1 error, 0 warnings, 0 section mismatches Errors: expr: syntax error: unexpected argument ‘0xffffffff80000000’ -------------------------------------------------------------------------------- bmips_be_defconfig (mips, gcc-10) — PASS, 0 errors, 0 warnings, 0 section mismatches -------------------------------------------------------------------------------- bmips_stb_defconfig (mips, gcc-10) — PASS, 0 errors, 0 warnings, 0 section mismatches -------------------------------------------------------------------------------- capcella_defconfig (mips, gcc-10) — PASS, 0 errors, 0 warnings, 0 section mismatches -------------------------------------------------------------------------------- cavium_octeon_defconfig (mips, gcc-10) — PASS, 1 error, 0 warnings, 0 section mismatches Errors: expr: syntax error: unexpected argument ‘0xffffffff80000000’ -------------------------------------------------------------------------------- cerfcube_defconfig (arm, gcc-10) — PASS, 0 errors, 0 warnings, 0 section mismatches -------------------------------------------------------------------------------- ci20_defconfig (mips, gcc-10) — PASS, 0 errors, 0 warnings, 0 section mismatches -------------------------------------------------------------------------------- cm_x300_defconfig (arm, gcc-10) — PASS, 0 errors, 0 warnings, 0 section mismatches -------------------------------------------------------------------------------- cobalt_defconfig (mips, gcc-10) — PASS, 0 errors, 0 warnings, 0 section mismatches -------------------------------------------------------------------------------- colibri_pxa270_defconfig (arm, gcc-10) — PASS, 0 errors, 0 warnings, 0 section mismatches -------------------------------------------------------------------------------- colibri_pxa300_defconfig (arm, gcc-10) — PASS, 0 errors, 0 warnings, 0 section mismatches -------------------------------------------------------------------------------- collie_defconfig (arm, gcc-10) — PASS, 0 errors, 0 warnings, 0 section mismatches -------------------------------------------------------------------------------- corgi_defconfig (arm, gcc-10) — PASS, 0 errors, 0 warnings, 0 section mismatches -------------------------------------------------------------------------------- cu1000-neo_defconfig (mips, gcc-10) — PASS, 0 errors, 0 warnings, 0 section mismatches -------------------------------------------------------------------------------- cu1830-neo_defconfig (mips, gcc-10) — PASS, 0 errors, 0 warnings, 0 section mismatches -------------------------------------------------------------------------------- davinci_all_defconfig (arm, gcc-10) — PASS, 0 errors, 0 warnings, 0 section mismatches -------------------------------------------------------------------------------- db1xxx_defconfig (mips, gcc-10) — PASS, 0 errors, 0 warnings, 0 section mismatches -------------------------------------------------------------------------------- decstation_64_defconfig (mips, gcc-10) — FAIL, 1 error, 0 warnings, 0 section mismatches Errors: expr: syntax error: unexpected argument ‘0xffffffff80000000’ -------------------------------------------------------------------------------- decstation_r4k_defconfig (mips, gcc-10) — PASS, 0 errors, 0 warnings, 0 section mismatches -------------------------------------------------------------------------------- defconfig (riscv, gcc-10) — PASS, 0 errors, 0 warnings, 0 section mismatches -------------------------------------------------------------------------------- defconfig (arm64, gcc-10) — PASS, 0 errors, 0 warnings, 0 section mismatches -------------------------------------------------------------------------------- defconfig+arm64-chromebook (arm64, gcc-10) — PASS, 0 errors, 0 warnings, 0 section mismatches -------------------------------------------------------------------------------- dove_defconfig (arm, gcc-10) — PASS, 0 errors, 0 warnings, 0 section mismatches -------------------------------------------------------------------------------- e55_defconfig (mips, gcc-10) — PASS, 0 errors, 0 warnings, 0 section mismatches -------------------------------------------------------------------------------- ep93xx_defconfig (arm, gcc-10) — PASS, 0 errors, 0 warnings, 0 section mismatches -------------------------------------------------------------------------------- eseries_pxa_defconfig (arm, gcc-10) — PASS, 0 errors, 0 warnings, 0 section mismatches -------------------------------------------------------------------------------- exynos_defconfig (arm, gcc-10) — PASS, 0 errors, 0 warnings, 0 section mismatches -------------------------------------------------------------------------------- ezx_defconfig (arm, gcc-10) — PASS, 0 errors, 0 warnings, 0 section mismatches -------------------------------------------------------------------------------- fuloong2e_defconfig (mips, gcc-10) — PASS, 1 error, 0 warnings, 0 section mismatches Errors: expr: syntax error: unexpected argument ‘0xffffffff80000000’ -------------------------------------------------------------------------------- gcw0_defconfig (mips, gcc-10) — PASS, 0 errors, 0 warnings, 0 section mismatches -------------------------------------------------------------------------------- gemini_defconfig (arm, gcc-10) — PASS, 0 errors, 0 warnings, 0 section mismatches -------------------------------------------------------------------------------- gpr_defconfig (mips, gcc-10) — PASS, 0 errors, 0 warnings, 0 section mismatches -------------------------------------------------------------------------------- h3600_defconfig (arm, gcc-10) — PASS, 0 errors, 0 warnings, 0 section mismatches -------------------------------------------------------------------------------- h5000_defconfig (arm, gcc-10) — PASS, 0 errors, 0 warnings, 0 section mismatches -------------------------------------------------------------------------------- hackkit_defconfig (arm, gcc-10) — PASS, 0 errors, 0 warnings, 0 section mismatches -------------------------------------------------------------------------------- haps_hs_defconfig (arc, gcc-10) — PASS, 0 errors, 0 warnings, 0 section mismatches -------------------------------------------------------------------------------- haps_hs_smp_defconfig (arc, gcc-10) — PASS, 0 errors, 0 warnings, 0 section mismatches -------------------------------------------------------------------------------- hsdk_defconfig (arc, gcc-10) — PASS, 0 errors, 0 warnings, 0 section mismatches -------------------------------------------------------------------------------- imote2_defconfig (arm, gcc-10) — PASS, 0 errors, 0 warnings, 0 section mismatches -------------------------------------------------------------------------------- imx_v4_v5_defconfig (arm, gcc-10) — PASS, 0 errors, 0 warnings, 0 section mismatches -------------------------------------------------------------------------------- imx_v6_v7_defconfig (arm, gcc-10) — PASS, 0 errors, 0 warnings, 0 section mismatches -------------------------------------------------------------------------------- integrator_defconfig (arm, gcc-10) — PASS, 0 errors, 0 warnings, 0 section mismatches -------------------------------------------------------------------------------- ip22_defconfig (mips, gcc-10) — PASS, 0 errors, 0 warnings, 0 section mismatches -------------------------------------------------------------------------------- ip27_defconfig (mips, gcc-10) — FAIL, 0 errors, 0 warnings, 0 section mismatches -------------------------------------------------------------------------------- ip28_defconfig (mips, gcc-10) — FAIL, 0 errors, 0 warnings, 0 section mismatches -------------------------------------------------------------------------------- ip32_defconfig (mips, gcc-10) — PASS, 1 error, 0 warnings, 0 section mismatches Errors: expr: syntax error: unexpected argument ‘0xffffffff80000000’ -------------------------------------------------------------------------------- ixp4xx_defconfig (arm, gcc-10) — PASS, 0 errors, 0 warnings, 0 section mismatches -------------------------------------------------------------------------------- jmr3927_defconfig (mips, gcc-10) — PASS, 0 errors, 0 warnings, 0 section mismatches -------------------------------------------------------------------------------- keystone_defconfig (arm, gcc-10) — PASS, 0 errors, 0 warnings, 0 section mismatches -------------------------------------------------------------------------------- lart_defconfig (arm, gcc-10) — PASS, 0 errors, 0 warnings, 0 section mismatches -------------------------------------------------------------------------------- lemote2f_defconfig (mips, gcc-10) — PASS, 1 error, 1 warning, 0 section mismatches Errors: expr: syntax error: unexpected argument ‘0xffffffff80000000’ Warnings: net/mac80211/mlme.c:4377:1: warning: the frame size of 1200 bytes is larger than 1024 bytes [-Wframe-larger-than=] -------------------------------------------------------------------------------- loongson1b_defconfig (mips, gcc-10) — PASS, 0 errors, 0 warnings, 0 section mismatches -------------------------------------------------------------------------------- loongson1c_defconfig (mips, gcc-10) — PASS, 0 errors, 0 warnings, 0 section mismatches -------------------------------------------------------------------------------- loongson2k_defconfig (mips, gcc-10) — PASS, 1 error, 1 warning, 0 section mismatches Errors: expr: syntax error: unexpected argument ‘0xffffffff80000000’ Warnings: net/mac80211/mlme.c:4377:1: warning: the frame size of 1200 bytes is larger than 1024 bytes [-Wframe-larger-than=] -------------------------------------------------------------------------------- loongson3_defconfig (mips, gcc-10) — PASS, 1 error, 0 warnings, 0 section mismatches Errors: expr: syntax error: unexpected argument ‘0xffffffff80000000’ -------------------------------------------------------------------------------- lpc18xx_defconfig (arm, gcc-10) — PASS, 0 errors, 0 warnings, 0 section mismatches -------------------------------------------------------------------------------- lpc32xx_defconfig (arm, gcc-10) — PASS, 0 errors, 0 warnings, 0 section mismatches -------------------------------------------------------------------------------- lpd270_defconfig (arm, gcc-10) — PASS, 0 errors, 0 warnings, 0 section mismatches -------------------------------------------------------------------------------- lubbock_defconfig (arm, gcc-10) — PASS, 0 errors, 0 warnings, 0 section mismatches -------------------------------------------------------------------------------- mainstone_defconfig (arm, gcc-10) — PASS, 0 errors, 0 warnings, 0 section mismatches -------------------------------------------------------------------------------- malta_kvm_defconfig (mips, gcc-10) — PASS, 0 errors, 0 warnings, 0 section mismatches -------------------------------------------------------------------------------- malta_qemu_32r6_defconfig (mips, gcc-10) — PASS, 0 errors, 0 warnings, 0 section mismatches -------------------------------------------------------------------------------- maltaaprp_defconfig (mips, gcc-10) — PASS, 0 errors, 0 warnings, 0 section mismatches -------------------------------------------------------------------------------- maltasmvp_defconfig (mips, gcc-10) — PASS, 0 errors, 0 warnings, 0 section mismatches -------------------------------------------------------------------------------- maltasmvp_eva_defconfig (mips, gcc-10) — PASS, 0 errors, 0 warnings, 0 section mismatches -------------------------------------------------------------------------------- maltaup_defconfig (mips, gcc-10) — PASS, 0 errors, 0 warnings, 0 section mismatches -------------------------------------------------------------------------------- maltaup_xpa_defconfig (mips, gcc-10) — PASS, 0 errors, 0 warnings, 0 section mismatches -------------------------------------------------------------------------------- milbeaut_m10v_defconfig (arm, gcc-10) — PASS, 0 errors, 0 warnings, 0 section mismatches -------------------------------------------------------------------------------- mini2440_defconfig (arm, gcc-10) — PASS, 0 errors, 0 warnings, 0 section mismatches -------------------------------------------------------------------------------- mmp2_defconfig (arm, gcc-10) — PASS, 0 errors, 0 warnings, 0 section mismatches -------------------------------------------------------------------------------- moxart_defconfig (arm, gcc-10) — PASS, 0 errors, 0 warnings, 0 section mismatches -------------------------------------------------------------------------------- mpc30x_defconfig (mips, gcc-10) — PASS, 0 errors, 0 warnings, 0 section mismatches -------------------------------------------------------------------------------- mps2_defconfig (arm, gcc-10) — PASS, 0 errors, 0 warnings, 0 section mismatches -------------------------------------------------------------------------------- multi_v4t_defconfig (arm, gcc-10) — PASS, 0 errors, 0 warnings, 0 section mismatches -------------------------------------------------------------------------------- multi_v5_defconfig (arm, gcc-10) — PASS, 0 errors, 0 warnings, 0 section mismatches -------------------------------------------------------------------------------- multi_v7_defconfig (arm, gcc-10) — PASS, 0 errors, 0 warnings, 0 section mismatches -------------------------------------------------------------------------------- mvebu_v5_defconfig (arm, gcc-10) — PASS, 0 errors, 0 warnings, 0 section mismatches -------------------------------------------------------------------------------- mvebu_v7_defconfig (arm, gcc-10) — PASS, 0 errors, 0 warnings, 0 section mismatches -------------------------------------------------------------------------------- mxs_defconfig (arm, gcc-10) — PASS, 0 errors, 0 warnings, 0 section mismatches -------------------------------------------------------------------------------- neponset_defconfig (arm, gcc-10) — PASS, 0 errors, 0 warnings, 0 section mismatches -------------------------------------------------------------------------------- netwinder_defconfig (arm, gcc-10) — PASS, 0 errors, 0 warnings, 0 section mismatches -------------------------------------------------------------------------------- nhk8815_defconfig (arm, gcc-10) — PASS, 0 errors, 0 warnings, 0 section mismatches -------------------------------------------------------------------------------- nlm_xlp_defconfig (mips, gcc-10) — PASS, 1 error, 0 warnings, 0 section mismatches Errors: expr: syntax error: unexpected argument ‘0xffffffff80000000’ -------------------------------------------------------------------------------- nlm_xlr_defconfig (mips, gcc-10) — PASS, 0 errors, 0 warnings, 0 section mismatches -------------------------------------------------------------------------------- nommu_k210_defconfig (riscv, gcc-10) — PASS, 0 errors, 0 warnings, 0 section mismatches -------------------------------------------------------------------------------- nommu_k210_sdcard_defconfig (riscv, gcc-10) — PASS, 0 errors, 0 warnings, 0 section mismatches -------------------------------------------------------------------------------- nsimosci_hs_defconfig (arc, gcc-10) — PASS, 0 errors, 0 warnings, 0 section mismatches -------------------------------------------------------------------------------- nsimosci_hs_smp_defconfig (arc, gcc-10) — PASS, 0 errors, 0 warnings, 0 section mismatches -------------------------------------------------------------------------------- omap1_defconfig (arm, gcc-10) — PASS, 0 errors, 0 warnings, 0 section mismatches -------------------------------------------------------------------------------- omap2plus_defconfig (arm, gcc-10) — PASS, 0 errors, 0 warnings, 0 section mismatches -------------------------------------------------------------------------------- omega2p_defconfig (mips, gcc-10) — PASS, 0 errors, 0 warnings, 0 section mismatches -------------------------------------------------------------------------------- oxnas_v6_defconfig (arm, gcc-10) — PASS, 0 errors, 0 warnings, 0 section mismatches -------------------------------------------------------------------------------- pcm027_defconfig (arm, gcc-10) — PASS, 0 errors, 0 warnings, 0 section mismatches -------------------------------------------------------------------------------- pic32mzda_defconfig (mips, gcc-10) — PASS, 0 errors, 0 warnings, 0 section mismatches -------------------------------------------------------------------------------- pleb_defconfig (arm, gcc-10) — PASS, 0 errors, 0 warnings, 0 section mismatches -------------------------------------------------------------------------------- pxa255-idp_defconfig (arm, gcc-10) — PASS, 0 errors, 0 warnings, 0 section mismatches -------------------------------------------------------------------------------- pxa3xx_defconfig (arm, gcc-10) — PASS, 0 errors, 0 warnings, 0 section mismatches -------------------------------------------------------------------------------- pxa910_defconfig (arm, gcc-10) — PASS, 0 errors, 0 warnings, 0 section mismatches -------------------------------------------------------------------------------- pxa_defconfig (arm, gcc-10) — PASS, 0 errors, 0 warnings, 0 section mismatches -------------------------------------------------------------------------------- qcom_defconfig (arm, gcc-10) — PASS, 0 errors, 0 warnings, 0 section mismatches -------------------------------------------------------------------------------- qi_lb60_defconfig (mips, gcc-10) — PASS, 0 errors, 0 warnings, 0 section mismatches -------------------------------------------------------------------------------- rb532_defconfig (mips, gcc-10) — PASS, 0 errors, 0 warnings, 0 section mismatches -------------------------------------------------------------------------------- rbtx49xx_defconfig (mips, gcc-10) — PASS, 0 errors, 0 warnings, 0 section mismatches -------------------------------------------------------------------------------- realview_defconfig (arm, gcc-10) — PASS, 0 errors, 0 warnings, 0 section mismatches -------------------------------------------------------------------------------- rpc_defconfig (arm, gcc-10) — FAIL, 4 errors, 0 warnings, 0 section mismatches Errors: arm-linux-gnueabihf-gcc: error: unrecognized -march target: armv3m arm-linux-gnueabihf-gcc: error: missing argument to ‘-march=’ arm-linux-gnueabihf-gcc: error: unrecognized -march target: armv3m arm-linux-gnueabihf-gcc: error: missing argument to ‘-march=’ -------------------------------------------------------------------------------- rs90_defconfig (mips, gcc-10) — PASS, 0 errors, 0 warnings, 0 section mismatches -------------------------------------------------------------------------------- rv32_defconfig (riscv, gcc-10) — PASS, 0 errors, 0 warnings, 0 section mismatches -------------------------------------------------------------------------------- s3c6400_defconfig (arm, gcc-10) — PASS, 0 errors, 0 warnings, 0 section mismatches -------------------------------------------------------------------------------- s5pv210_defconfig (arm, gcc-10) — PASS, 0 errors, 0 warnings, 0 section mismatches -------------------------------------------------------------------------------- sama7_defconfig (arm, gcc-10) — PASS, 0 errors, 0 warnings, 0 section mismatches -------------------------------------------------------------------------------- sb1250_swarm_defconfig (mips, gcc-10) — PASS, 1 error, 0 warnings, 0 section mismatches Errors: expr: syntax error: unexpected argument ‘0xffffffff80000000’ -------------------------------------------------------------------------------- shannon_defconfig (arm, gcc-10) — PASS, 0 errors, 0 warnings, 0 section mismatches -------------------------------------------------------------------------------- shmobile_defconfig (arm, gcc-10) — PASS, 0 errors, 0 warnings, 0 section mismatches -------------------------------------------------------------------------------- simpad_defconfig (arm, gcc-10) — PASS, 0 errors, 0 warnings, 0 section mismatches -------------------------------------------------------------------------------- socfpga_defconfig (arm, gcc-10) — PASS, 0 errors, 0 warnings, 0 section mismatches -------------------------------------------------------------------------------- spear13xx_defconfig (arm, gcc-10) — PASS, 0 errors, 0 warnings, 0 section mismatches -------------------------------------------------------------------------------- spear3xx_defconfig (arm, gcc-10) — PASS, 0 errors, 0 warnings, 0 section mismatches -------------------------------------------------------------------------------- spitz_defconfig (arm, gcc-10) — PASS, 0 errors, 0 warnings, 0 section mismatches -------------------------------------------------------------------------------- stm32_defconfig (arm, gcc-10) — PASS, 0 errors, 0 warnings, 0 section mismatches -------------------------------------------------------------------------------- sunxi_defconfig (arm, gcc-10) — PASS, 0 errors, 0 warnings, 0 section mismatches -------------------------------------------------------------------------------- tb0219_defconfig (mips, gcc-10) — PASS, 0 errors, 0 warnings, 0 section mismatches -------------------------------------------------------------------------------- tb0287_defconfig (mips, gcc-10) — PASS, 0 errors, 0 warnings, 0 section mismatches -------------------------------------------------------------------------------- tct_hammer_defconfig (arm, gcc-10) — PASS, 0 errors, 0 warnings, 0 section mismatches -------------------------------------------------------------------------------- tegra_defconfig (arm, gcc-10) — PASS, 0 errors, 0 warnings, 0 section mismatches -------------------------------------------------------------------------------- tinyconfig (i386, gcc-10) — PASS, 0 errors, 0 warnings, 0 section mismatches -------------------------------------------------------------------------------- tinyconfig (x86_64, gcc-10) — PASS, 0 errors, 0 warnings, 0 section mismatches -------------------------------------------------------------------------------- tinyconfig (arc, gcc-10) — PASS, 0 errors, 1 warning, 0 section mismatches Warnings: arch/arc/Makefile:26: ** WARNING ** CONFIG_ARC_TUNE_MCPU flag '' is unknown, fallback to '' -------------------------------------------------------------------------------- trizeps4_defconfig (arm, gcc-10) — PASS, 0 errors, 0 warnings, 0 section mismatches -------------------------------------------------------------------------------- u8500_defconfig (arm, gcc-10) — PASS, 0 errors, 0 warnings, 0 section mismatches -------------------------------------------------------------------------------- vdk_hs38_defconfig (arc, gcc-10) — PASS, 0 errors, 0 warnings, 0 section mismatches -------------------------------------------------------------------------------- vexpress_defconfig (arm, gcc-10) — PASS, 0 errors, 0 warnings, 0 section mismatches -------------------------------------------------------------------------------- vf610m4_defconfig (arm, gcc-10) — PASS, 0 errors, 0 warnings, 0 section mismatches -------------------------------------------------------------------------------- viper_defconfig (arm, gcc-10) — PASS, 0 errors, 0 warnings, 0 section mismatches -------------------------------------------------------------------------------- vocore2_defconfig (mips, gcc-10) — PASS, 0 errors, 0 warnings, 0 section mismatches -------------------------------------------------------------------------------- vt8500_v6_v7_defconfig (arm, gcc-10) — PASS, 0 errors, 0 warnings, 0 section mismatches -------------------------------------------------------------------------------- workpad_defconfig (mips, gcc-10) — PASS, 0 errors, 0 warnings, 0 section mismatches -------------------------------------------------------------------------------- x86_64_defconfig (x86_64, gcc-10) — PASS, 0 errors, 0 warnings, 0 section mismatches -------------------------------------------------------------------------------- x86_64_defconfig+x86-chromebook (x86_64, gcc-10) — PASS, 0 errors, 0 warnings, 0 section mismatches -------------------------------------------------------------------------------- xcep_defconfig (arm, gcc-10) — PASS, 0 errors, 0 warnings, 0 section mismatches -------------------------------------------------------------------------------- zeus_defconfig (arm, gcc-10) — PASS, 0 errors, 0 warnings, 0 section mismatches --- For more info write to <info(a)kernelci.org>
2 years, 7 months
1
0
0
0
stable-rc/queue/5.17 baseline: 114 runs, 2 regressions (v5.17.11-2-ge8ea2b4363353)
by kernelci.org bot
stable-rc/queue/5.17 baseline: 114 runs, 2 regressions (v5.17.11-2-ge8ea2b4363353) Regressions Summary ------------------- platform | arch | lab | compiler | defconfig | regressions --------------+------+--------------+----------+-------------------+------------ at91sam9g20ek | arm | lab-broonie | gcc-10 | at91_dt_defconfig | 1 jetson-tk1 | arm | lab-baylibre | gcc-10 | tegra_defconfig | 1 Details:
https://kernelci.org/test/job/stable-rc/branch/queue%2F5.17/kernel/v5.17.11…
Test: baseline Tree: stable-rc Branch: queue/5.17 Describe: v5.17.11-2-ge8ea2b4363353 URL:
https://git.kernel.org/pub/scm/linux/kernel/git/stable/linux-stable-rc.git
SHA: e8ea2b436335375f0bc1fb85162563ac231e1f60 Test Regressions ---------------- platform | arch | lab | compiler | defconfig | regressions --------------+------+--------------+----------+-------------------+------------ at91sam9g20ek | arm | lab-broonie | gcc-10 | at91_dt_defconfig | 1 Details:
https://kernelci.org/test/plan/id/628f8df83545fe33faa39be4
Results: 0 PASS, 1 FAIL, 0 SKIP Full config: at91_dt_defconfig Compiler: gcc-10 (arm-linux-gnueabihf-gcc (Debian 10.2.1-6) 10.2.1 20210110) Plain log:
https://storage.kernelci.org//stable-rc/queue-5.17/v5.17.11-2-ge8ea2b436335…
HTML log:
https://storage.kernelci.org//stable-rc/queue-5.17/v5.17.11-2-ge8ea2b436335…
Rootfs:
http://storage.kernelci.org/images/rootfs/buildroot/buildroot-baseline/2022…
* baseline.login:
https://kernelci.org/test/case/id/628f8df83545fe33faa39be5
new failure (last pass: v5.17.11) platform | arch | lab | compiler | defconfig | regressions --------------+------+--------------+----------+-------------------+------------ jetson-tk1 | arm | lab-baylibre | gcc-10 | tegra_defconfig | 1 Details:
https://kernelci.org/test/plan/id/628f949779674040eea39bd2
Results: 0 PASS, 1 FAIL, 0 SKIP Full config: tegra_defconfig Compiler: gcc-10 (arm-linux-gnueabihf-gcc (Debian 10.2.1-6) 10.2.1 20210110) Plain log:
https://storage.kernelci.org//stable-rc/queue-5.17/v5.17.11-2-ge8ea2b436335…
HTML log:
https://storage.kernelci.org//stable-rc/queue-5.17/v5.17.11-2-ge8ea2b436335…
Rootfs:
http://storage.kernelci.org/images/rootfs/buildroot/buildroot-baseline/2022…
* baseline.login:
https://kernelci.org/test/case/id/628f949779674040eea39bd3
failing since 2 days (last pass: v5.17.7-12-g470ab13d43837, first fail: v5.17.9-158-g0fff55a57433d)
2 years, 7 months
1
0
0
0
← Newer
1
...
18
19
20
21
22
23
24
...
158
Older →
Jump to page:
1
2
3
4
5
6
7
8
9
10
11
12
13
14
15
16
17
18
19
20
21
22
23
24
25
26
27
28
29
30
31
32
33
34
35
36
37
38
39
40
41
42
43
44
45
46
47
48
49
50
51
52
53
54
55
56
57
58
59
60
61
62
63
64
65
66
67
68
69
70
71
72
73
74
75
76
77
78
79
80
81
82
83
84
85
86
87
88
89
90
91
92
93
94
95
96
97
98
99
100
101
102
103
104
105
106
107
108
109
110
111
112
113
114
115
116
117
118
119
120
121
122
123
124
125
126
127
128
129
130
131
132
133
134
135
136
137
138
139
140
141
142
143
144
145
146
147
148
149
150
151
152
153
154
155
156
157
158
Results per page:
10
25
50
100
200