lists.linaro.org
Sign In
Sign Up
Sign In
Sign Up
Manage this list
×
Keyboard Shortcuts
Thread View
j
: Next unread message
k
: Previous unread message
j a
: Jump to all threads
j l
: Jump to MailingList overview
2025
May
April
March
February
January
2024
December
November
October
September
August
July
June
May
April
March
February
January
2023
December
November
October
September
August
July
June
May
April
March
February
January
2022
December
November
October
September
August
July
June
May
April
March
February
January
2021
December
November
October
September
August
July
June
May
April
March
February
January
2020
December
November
October
September
August
July
June
May
April
March
February
January
2019
December
November
October
September
August
July
June
May
April
March
February
January
2018
December
November
October
September
August
July
June
May
April
March
February
January
2017
December
November
October
September
August
July
June
May
April
March
February
January
2016
December
November
October
September
August
July
June
May
April
March
February
January
2015
December
November
October
September
August
July
June
May
April
March
February
January
2014
December
November
October
September
August
July
June
May
April
March
February
January
2013
December
November
October
September
August
List overview
Download
Kernel-build-reports
April 2024
----- 2025 -----
May 2025
April 2025
March 2025
February 2025
January 2025
----- 2024 -----
December 2024
November 2024
October 2024
September 2024
August 2024
July 2024
June 2024
May 2024
April 2024
March 2024
February 2024
January 2024
----- 2023 -----
December 2023
November 2023
October 2023
September 2023
August 2023
July 2023
June 2023
May 2023
April 2023
March 2023
February 2023
January 2023
----- 2022 -----
December 2022
November 2022
October 2022
September 2022
August 2022
July 2022
June 2022
May 2022
April 2022
March 2022
February 2022
January 2022
----- 2021 -----
December 2021
November 2021
October 2021
September 2021
August 2021
July 2021
June 2021
May 2021
April 2021
March 2021
February 2021
January 2021
----- 2020 -----
December 2020
November 2020
October 2020
September 2020
August 2020
July 2020
June 2020
May 2020
April 2020
March 2020
February 2020
January 2020
----- 2019 -----
December 2019
November 2019
October 2019
September 2019
August 2019
July 2019
June 2019
May 2019
April 2019
March 2019
February 2019
January 2019
----- 2018 -----
December 2018
November 2018
October 2018
September 2018
August 2018
July 2018
June 2018
May 2018
April 2018
March 2018
February 2018
January 2018
----- 2017 -----
December 2017
November 2017
October 2017
September 2017
August 2017
July 2017
June 2017
May 2017
April 2017
March 2017
February 2017
January 2017
----- 2016 -----
December 2016
November 2016
October 2016
September 2016
August 2016
July 2016
June 2016
May 2016
April 2016
March 2016
February 2016
January 2016
----- 2015 -----
December 2015
November 2015
October 2015
September 2015
August 2015
July 2015
June 2015
May 2015
April 2015
March 2015
February 2015
January 2015
----- 2014 -----
December 2014
November 2014
October 2014
September 2014
August 2014
July 2014
June 2014
May 2014
April 2014
March 2014
February 2014
January 2014
----- 2013 -----
December 2013
November 2013
October 2013
September 2013
August 2013
kernel-build-reports@lists.linaro.org
1 participants
687 discussions
Start a n
N
ew thread
stable-rc/queue/6.1 baseline: 112 runs, 1 regressions (v6.1.87-47-gabeefd7a692fd)
by kernelci.org bot
stable-rc/queue/6.1 baseline: 112 runs, 1 regressions (v6.1.87-47-gabeefd7a692fd) Regressions Summary ------------------- platform | arch | lab | compiler | defconfig | regressions -----------+------+---------------+----------+--------------------+------------ odroid-xu3 | arm | lab-collabora | gcc-10 | multi_v7_defconfig | 1 Details:
https://kernelci.org/test/job/stable-rc/branch/queue%2F6.1/kernel/v6.1.87-4…
Test: baseline Tree: stable-rc Branch: queue/6.1 Describe: v6.1.87-47-gabeefd7a692fd URL:
https://git.kernel.org/pub/scm/linux/kernel/git/stable/linux-stable-rc.git
SHA: abeefd7a692fd9d40d246c3157cf68bb3d84ea8e Test Regressions ---------------- platform | arch | lab | compiler | defconfig | regressions -----------+------+---------------+----------+--------------------+------------ odroid-xu3 | arm | lab-collabora | gcc-10 | multi_v7_defconfig | 1 Details:
https://kernelci.org/test/plan/id/6623baba04d1dff4af4c4306
Results: 0 PASS, 1 FAIL, 0 SKIP Full config: multi_v7_defconfig Compiler: gcc-10 (arm-linux-gnueabihf-gcc (Debian 10.2.1-6) 10.2.1 20210110) Plain log:
https://storage.kernelci.org//stable-rc/queue-6.1/v6.1.87-47-gabeefd7a692fd…
HTML log:
https://storage.kernelci.org//stable-rc/queue-6.1/v6.1.87-47-gabeefd7a692fd…
Rootfs:
http://storage.kernelci.org/images/rootfs/buildroot/buildroot-baseline/2023…
* baseline.login:
https://kernelci.org/test/case/id/6623baba04d1dff4af4c4307
new failure (last pass: v6.1.87-47-g4a73629694749)
1 year
1
0
0
0
stable-rc/queue/6.6 baseline: 112 runs, 2 regressions (v6.6.28-58-g42a6a6e5e5538)
by kernelci.org bot
stable-rc/queue/6.6 baseline: 112 runs, 2 regressions (v6.6.28-58-g42a6a6e5e5538) Regressions Summary ------------------- platform | arch | lab | compiler | defconfig | regressions -----------------------------+-------+---------------+----------+----------------------------+------------ mt8183-kukui-...uniper-sku16 | arm64 | lab-collabora | gcc-10 | defconfig+arm64-chromebook | 1 mt8195-cherry-tomato-r2 | arm64 | lab-collabora | gcc-10 | defconfig+arm64-chromebook | 1 Details:
https://kernelci.org/test/job/stable-rc/branch/queue%2F6.6/kernel/v6.6.28-5…
Test: baseline Tree: stable-rc Branch: queue/6.6 Describe: v6.6.28-58-g42a6a6e5e5538 URL:
https://git.kernel.org/pub/scm/linux/kernel/git/stable/linux-stable-rc.git
SHA: 42a6a6e5e553844443e8e5e289d59f1ffda56dfe Test Regressions ---------------- platform | arch | lab | compiler | defconfig | regressions -----------------------------+-------+---------------+----------+----------------------------+------------ mt8183-kukui-...uniper-sku16 | arm64 | lab-collabora | gcc-10 | defconfig+arm64-chromebook | 1 Details:
https://kernelci.org/test/plan/id/6623a284e4ca08f36a4c42db
Results: 0 PASS, 1 FAIL, 0 SKIP Full config: defconfig+arm64-chromebook Compiler: gcc-10 (aarch64-linux-gnu-gcc (Debian 10.2.1-6) 10.2.1 20210110) Plain log:
https://storage.kernelci.org//stable-rc/queue-6.6/v6.6.28-58-g42a6a6e5e5538…
HTML log:
https://storage.kernelci.org//stable-rc/queue-6.6/v6.6.28-58-g42a6a6e5e5538…
Rootfs:
http://storage.kernelci.org/images/rootfs/buildroot/buildroot-baseline/2023…
* baseline.login:
https://kernelci.org/test/case/id/6623a284e4ca08f36a4c42dc
new failure (last pass: v6.6.28-58-g96da84f1f11cf) platform | arch | lab | compiler | defconfig | regressions -----------------------------+-------+---------------+----------+----------------------------+------------ mt8195-cherry-tomato-r2 | arm64 | lab-collabora | gcc-10 | defconfig+arm64-chromebook | 1 Details:
https://kernelci.org/test/plan/id/6623a288e4ca08f36a4c42e5
Results: 0 PASS, 1 FAIL, 0 SKIP Full config: defconfig+arm64-chromebook Compiler: gcc-10 (aarch64-linux-gnu-gcc (Debian 10.2.1-6) 10.2.1 20210110) Plain log:
https://storage.kernelci.org//stable-rc/queue-6.6/v6.6.28-58-g42a6a6e5e5538…
HTML log:
https://storage.kernelci.org//stable-rc/queue-6.6/v6.6.28-58-g42a6a6e5e5538…
Rootfs:
http://storage.kernelci.org/images/rootfs/buildroot/buildroot-baseline/2023…
* baseline.login:
https://kernelci.org/test/case/id/6623a288e4ca08f36a4c42e6
new failure (last pass: v6.6.28-58-g96da84f1f11cf)
1 year
1
0
0
0
stable-rc/queue/4.19 build: 19 builds: 3 failed, 16 passed, 20 warnings (v4.19.312-19-g6fec979b49085)
by kernelci.org bot
stable-rc/queue/4.19 build: 19 builds: 3 failed, 16 passed, 20 warnings (v4.19.312-19-g6fec979b49085) Full Build Summary:
https://kernelci.org/build/stable-rc/branch/queue%2F4.19/kernel/v4.19.312-1…
Tree: stable-rc Branch: queue/4.19 Git Describe: v4.19.312-19-g6fec979b49085 Git Commit: 6fec979b49085f9a2806304f14a28874b31b1b1b Git URL:
https://git.kernel.org/pub/scm/linux/kernel/git/stable/linux-stable-rc.git
Built: 7 unique architectures Build Failures Detected: riscv: allnoconfig: (gcc-10) FAIL defconfig: (gcc-10) FAIL tinyconfig: (gcc-10) FAIL Warnings Detected: arc: arm64: defconfig (gcc-10): 3 warnings defconfig+arm64-chromebook (gcc-10): 3 warnings arm: i386: allnoconfig (gcc-10): 2 warnings i386_defconfig (gcc-10): 2 warnings tinyconfig (gcc-10): 2 warnings mips: riscv: x86_64: allnoconfig (gcc-10): 2 warnings tinyconfig (gcc-10): 2 warnings x86_64_defconfig (gcc-10): 2 warnings x86_64_defconfig+x86-board (gcc-10): 2 warnings Warnings summary: 7 ld: warning: creating DT_TEXTREL in a PIE 6 aarch64-linux-gnu-ld: warning: -z norelro ignored 4 ld: arch/x86/boot/compressed/head_64.o: warning: relocation in read-only section `.head.text' 3 ld: arch/x86/boot/compressed/head_32.o: warning: relocation in read-only section `.head.text' Section mismatches summary: 4 WARNING: modpost: Found 1 section mismatch(es). ================================================================================ Detailed per-defconfig build reports: -------------------------------------------------------------------------------- 32r2el_defconfig (mips, gcc-10) — PASS, 0 errors, 0 warnings, 0 section mismatches -------------------------------------------------------------------------------- allnoconfig (riscv, gcc-10) — FAIL, 0 errors, 0 warnings, 0 section mismatches -------------------------------------------------------------------------------- allnoconfig (x86_64, gcc-10) — PASS, 0 errors, 2 warnings, 0 section mismatches Warnings: ld: arch/x86/boot/compressed/head_64.o: warning: relocation in read-only section `.head.text' ld: warning: creating DT_TEXTREL in a PIE -------------------------------------------------------------------------------- allnoconfig (i386, gcc-10) — PASS, 0 errors, 2 warnings, 0 section mismatches Warnings: ld: arch/x86/boot/compressed/head_32.o: warning: relocation in read-only section `.head.text' ld: warning: creating DT_TEXTREL in a PIE -------------------------------------------------------------------------------- defconfig (riscv, gcc-10) — FAIL, 0 errors, 0 warnings, 0 section mismatches -------------------------------------------------------------------------------- defconfig (arm64, gcc-10) — PASS, 0 errors, 3 warnings, 0 section mismatches Warnings: aarch64-linux-gnu-ld: warning: -z norelro ignored aarch64-linux-gnu-ld: warning: -z norelro ignored aarch64-linux-gnu-ld: warning: -z norelro ignored Section mismatches: WARNING: modpost: Found 1 section mismatch(es). -------------------------------------------------------------------------------- defconfig+arm64-chromebook (arm64, gcc-10) — PASS, 0 errors, 3 warnings, 0 section mismatches Warnings: aarch64-linux-gnu-ld: warning: -z norelro ignored aarch64-linux-gnu-ld: warning: -z norelro ignored aarch64-linux-gnu-ld: warning: -z norelro ignored Section mismatches: WARNING: modpost: Found 1 section mismatch(es). -------------------------------------------------------------------------------- haps_hs_smp_defconfig (arc, gcc-10) — PASS, 0 errors, 0 warnings, 0 section mismatches -------------------------------------------------------------------------------- i386_defconfig (i386, gcc-10) — PASS, 0 errors, 2 warnings, 0 section mismatches Warnings: ld: arch/x86/boot/compressed/head_32.o: warning: relocation in read-only section `.head.text' ld: warning: creating DT_TEXTREL in a PIE -------------------------------------------------------------------------------- imx_v6_v7_defconfig (arm, gcc-10) — PASS, 0 errors, 0 warnings, 0 section mismatches -------------------------------------------------------------------------------- multi_v5_defconfig (arm, gcc-10) — PASS, 0 errors, 0 warnings, 0 section mismatches Section mismatches: WARNING: modpost: Found 1 section mismatch(es). -------------------------------------------------------------------------------- multi_v7_defconfig (arm, gcc-10) — PASS, 0 errors, 0 warnings, 0 section mismatches Section mismatches: WARNING: modpost: Found 1 section mismatch(es). -------------------------------------------------------------------------------- omap2plus_defconfig (arm, gcc-10) — PASS, 0 errors, 0 warnings, 0 section mismatches -------------------------------------------------------------------------------- tinyconfig (riscv, gcc-10) — FAIL, 0 errors, 0 warnings, 0 section mismatches -------------------------------------------------------------------------------- tinyconfig (i386, gcc-10) — PASS, 0 errors, 2 warnings, 0 section mismatches Warnings: ld: arch/x86/boot/compressed/head_32.o: warning: relocation in read-only section `.head.text' ld: warning: creating DT_TEXTREL in a PIE -------------------------------------------------------------------------------- tinyconfig (x86_64, gcc-10) — PASS, 0 errors, 2 warnings, 0 section mismatches Warnings: ld: arch/x86/boot/compressed/head_64.o: warning: relocation in read-only section `.head.text' ld: warning: creating DT_TEXTREL in a PIE -------------------------------------------------------------------------------- vexpress_defconfig (arm, gcc-10) — PASS, 0 errors, 0 warnings, 0 section mismatches -------------------------------------------------------------------------------- x86_64_defconfig (x86_64, gcc-10) — PASS, 0 errors, 2 warnings, 0 section mismatches Warnings: ld: arch/x86/boot/compressed/head_64.o: warning: relocation in read-only section `.head.text' ld: warning: creating DT_TEXTREL in a PIE -------------------------------------------------------------------------------- x86_64_defconfig+x86-board (x86_64, gcc-10) — PASS, 0 errors, 2 warnings, 0 section mismatches Warnings: ld: arch/x86/boot/compressed/head_64.o: warning: relocation in read-only section `.head.text' ld: warning: creating DT_TEXTREL in a PIE --- For more info write to <info(a)kernelci.org>
1 year
1
0
0
0
stable-rc/queue/5.4 build: 17 builds: 5 failed, 12 passed, 5 errors, 29 warnings (v5.4.274-25-g6d19c8bee1877)
by kernelci.org bot
stable-rc/queue/5.4 build: 17 builds: 5 failed, 12 passed, 5 errors, 29 warnings (v5.4.274-25-g6d19c8bee1877) Full Build Summary:
https://kernelci.org/build/stable-rc/branch/queue%2F5.4/kernel/v5.4.274-25-…
Tree: stable-rc Branch: queue/5.4 Git Describe: v5.4.274-25-g6d19c8bee1877 Git Commit: 6d19c8bee187734ee1aec1f43b36dfb85702277b Git URL:
https://git.kernel.org/pub/scm/linux/kernel/git/stable/linux-stable-rc.git
Built: 7 unique architectures Build Failures Detected: arm: imx_v6_v7_defconfig: (gcc-10) FAIL multi_v5_defconfig: (gcc-10) FAIL multi_v7_defconfig: (gcc-10) FAIL omap2plus_defconfig: (gcc-10) FAIL vexpress_defconfig: (gcc-10) FAIL Errors and Warnings Detected: arc: arm64: defconfig (gcc-10): 2 warnings defconfig+arm64-chromebook (gcc-10): 2 warnings arm: imx_v6_v7_defconfig (gcc-10): 1 error, 1 warning multi_v5_defconfig (gcc-10): 1 error, 1 warning multi_v7_defconfig (gcc-10): 1 error, 1 warning omap2plus_defconfig (gcc-10): 1 error, 1 warning vexpress_defconfig (gcc-10): 1 error, 1 warning i386: allnoconfig (gcc-10): 2 warnings i386_defconfig (gcc-10): 2 warnings tinyconfig (gcc-10): 2 warnings mips: riscv: x86_64: allnoconfig (gcc-10): 4 warnings tinyconfig (gcc-10): 4 warnings x86_64_defconfig (gcc-10): 3 warnings x86_64_defconfig+x86-board (gcc-10): 3 warnings Errors summary: 5 kernel/trace/ring_buffer.c:1203:7: error: implicit declaration of function ‘try_cmpxchg’; did you mean ‘xa_cmpxchg’? [-Werror=implicit-function-declaration] Warnings summary: 7 ld: warning: creating DT_TEXTREL in a PIE 5 cc1: some warnings being treated as errors 4 ld: arch/x86/boot/compressed/head_64.o: warning: relocation in read-only section `.head.text' 4 arch/arm64/include/asm/memory.h:238:15: warning: cast from pointer to integer of different size [-Wpointer-to-int-cast] 3 ld: arch/x86/boot/compressed/head_32.o: warning: relocation in read-only section `.head.text' 2 arch/x86/entry/entry_64.o: warning: objtool: .entry.text+0x1c1: stack state mismatch: cfa1=7+56 cfa2=7+40 2 arch/x86/entry/entry_64.o: warning: objtool: .entry.text+0x151: stack state mismatch: cfa1=7+56 cfa2=7+40 2 arch/x86/entry/entry_64.S:1756: Warning: no instruction mnemonic suffix given and no register operands; using default for `sysret' ================================================================================ Detailed per-defconfig build reports: -------------------------------------------------------------------------------- 32r2el_defconfig (mips, gcc-10) — PASS, 0 errors, 0 warnings, 0 section mismatches -------------------------------------------------------------------------------- allnoconfig (i386, gcc-10) — PASS, 0 errors, 2 warnings, 0 section mismatches Warnings: ld: arch/x86/boot/compressed/head_32.o: warning: relocation in read-only section `.head.text' ld: warning: creating DT_TEXTREL in a PIE -------------------------------------------------------------------------------- allnoconfig (x86_64, gcc-10) — PASS, 0 errors, 4 warnings, 0 section mismatches Warnings: arch/x86/entry/entry_64.S:1756: Warning: no instruction mnemonic suffix given and no register operands; using default for `sysret' arch/x86/entry/entry_64.o: warning: objtool: .entry.text+0x151: stack state mismatch: cfa1=7+56 cfa2=7+40 ld: arch/x86/boot/compressed/head_64.o: warning: relocation in read-only section `.head.text' ld: warning: creating DT_TEXTREL in a PIE -------------------------------------------------------------------------------- defconfig (riscv, gcc-10) — PASS, 0 errors, 0 warnings, 0 section mismatches -------------------------------------------------------------------------------- defconfig (arm64, gcc-10) — PASS, 0 errors, 2 warnings, 0 section mismatches Warnings: arch/arm64/include/asm/memory.h:238:15: warning: cast from pointer to integer of different size [-Wpointer-to-int-cast] arch/arm64/include/asm/memory.h:238:15: warning: cast from pointer to integer of different size [-Wpointer-to-int-cast] -------------------------------------------------------------------------------- defconfig+arm64-chromebook (arm64, gcc-10) — PASS, 0 errors, 2 warnings, 0 section mismatches Warnings: arch/arm64/include/asm/memory.h:238:15: warning: cast from pointer to integer of different size [-Wpointer-to-int-cast] arch/arm64/include/asm/memory.h:238:15: warning: cast from pointer to integer of different size [-Wpointer-to-int-cast] -------------------------------------------------------------------------------- haps_hs_smp_defconfig (arc, gcc-10) — PASS, 0 errors, 0 warnings, 0 section mismatches -------------------------------------------------------------------------------- i386_defconfig (i386, gcc-10) — PASS, 0 errors, 2 warnings, 0 section mismatches Warnings: ld: arch/x86/boot/compressed/head_32.o: warning: relocation in read-only section `.head.text' ld: warning: creating DT_TEXTREL in a PIE -------------------------------------------------------------------------------- imx_v6_v7_defconfig (arm, gcc-10) — FAIL, 1 error, 1 warning, 0 section mismatches Errors: kernel/trace/ring_buffer.c:1203:7: error: implicit declaration of function ‘try_cmpxchg’; did you mean ‘xa_cmpxchg’? [-Werror=implicit-function-declaration] Warnings: cc1: some warnings being treated as errors -------------------------------------------------------------------------------- multi_v5_defconfig (arm, gcc-10) — FAIL, 1 error, 1 warning, 0 section mismatches Errors: kernel/trace/ring_buffer.c:1203:7: error: implicit declaration of function ‘try_cmpxchg’; did you mean ‘xa_cmpxchg’? [-Werror=implicit-function-declaration] Warnings: cc1: some warnings being treated as errors -------------------------------------------------------------------------------- multi_v7_defconfig (arm, gcc-10) — FAIL, 1 error, 1 warning, 0 section mismatches Errors: kernel/trace/ring_buffer.c:1203:7: error: implicit declaration of function ‘try_cmpxchg’; did you mean ‘xa_cmpxchg’? [-Werror=implicit-function-declaration] Warnings: cc1: some warnings being treated as errors -------------------------------------------------------------------------------- omap2plus_defconfig (arm, gcc-10) — FAIL, 1 error, 1 warning, 0 section mismatches Errors: kernel/trace/ring_buffer.c:1203:7: error: implicit declaration of function ‘try_cmpxchg’; did you mean ‘xa_cmpxchg’? [-Werror=implicit-function-declaration] Warnings: cc1: some warnings being treated as errors -------------------------------------------------------------------------------- tinyconfig (i386, gcc-10) — PASS, 0 errors, 2 warnings, 0 section mismatches Warnings: ld: arch/x86/boot/compressed/head_32.o: warning: relocation in read-only section `.head.text' ld: warning: creating DT_TEXTREL in a PIE -------------------------------------------------------------------------------- tinyconfig (x86_64, gcc-10) — PASS, 0 errors, 4 warnings, 0 section mismatches Warnings: arch/x86/entry/entry_64.S:1756: Warning: no instruction mnemonic suffix given and no register operands; using default for `sysret' arch/x86/entry/entry_64.o: warning: objtool: .entry.text+0x151: stack state mismatch: cfa1=7+56 cfa2=7+40 ld: arch/x86/boot/compressed/head_64.o: warning: relocation in read-only section `.head.text' ld: warning: creating DT_TEXTREL in a PIE -------------------------------------------------------------------------------- vexpress_defconfig (arm, gcc-10) — FAIL, 1 error, 1 warning, 0 section mismatches Errors: kernel/trace/ring_buffer.c:1203:7: error: implicit declaration of function ‘try_cmpxchg’; did you mean ‘xa_cmpxchg’? [-Werror=implicit-function-declaration] Warnings: cc1: some warnings being treated as errors -------------------------------------------------------------------------------- x86_64_defconfig (x86_64, gcc-10) — PASS, 0 errors, 3 warnings, 0 section mismatches Warnings: arch/x86/entry/entry_64.o: warning: objtool: .entry.text+0x1c1: stack state mismatch: cfa1=7+56 cfa2=7+40 ld: arch/x86/boot/compressed/head_64.o: warning: relocation in read-only section `.head.text' ld: warning: creating DT_TEXTREL in a PIE -------------------------------------------------------------------------------- x86_64_defconfig+x86-board (x86_64, gcc-10) — PASS, 0 errors, 3 warnings, 0 section mismatches Warnings: arch/x86/entry/entry_64.o: warning: objtool: .entry.text+0x1c1: stack state mismatch: cfa1=7+56 cfa2=7+40 ld: arch/x86/boot/compressed/head_64.o: warning: relocation in read-only section `.head.text' ld: warning: creating DT_TEXTREL in a PIE --- For more info write to <info(a)kernelci.org>
1 year
1
0
0
0
stable-rc/queue/5.10 build: 19 builds: 5 failed, 14 passed, 5 errors, 10 warnings (v5.10.215-39-gea88757efb10b)
by kernelci.org bot
stable-rc/queue/5.10 build: 19 builds: 5 failed, 14 passed, 5 errors, 10 warnings (v5.10.215-39-gea88757efb10b) Full Build Summary:
https://kernelci.org/build/stable-rc/branch/queue%2F5.10/kernel/v5.10.215-3…
Tree: stable-rc Branch: queue/5.10 Git Describe: v5.10.215-39-gea88757efb10b Git Commit: ea88757efb10b417eb451bbd0c204f65124e79e6 Git URL:
https://git.kernel.org/pub/scm/linux/kernel/git/stable/linux-stable-rc.git
Built: 7 unique architectures Build Failures Detected: arm: imx_v6_v7_defconfig: (gcc-10) FAIL multi_v5_defconfig: (gcc-10) FAIL multi_v7_defconfig: (gcc-10) FAIL omap2plus_defconfig: (gcc-10) FAIL vexpress_defconfig: (gcc-10) FAIL Errors and Warnings Detected: arc: arm64: arm: imx_v6_v7_defconfig (gcc-10): 1 error, 1 warning multi_v5_defconfig (gcc-10): 1 error, 1 warning multi_v7_defconfig (gcc-10): 1 error, 1 warning omap2plus_defconfig (gcc-10): 1 error, 1 warning vexpress_defconfig (gcc-10): 1 error, 1 warning i386: mips: 32r2el_defconfig (gcc-10): 1 warning riscv: rv32_defconfig (gcc-10): 4 warnings x86_64: Errors summary: 5 kernel/trace/ring_buffer.c:1479:7: error: implicit declaration of function ‘try_cmpxchg’; did you mean ‘xa_cmpxchg’? [-Werror=implicit-function-declaration] Warnings summary: 5 cc1: some warnings being treated as errors 2 <stdin>:830:2: warning: #warning syscall fstat64 not implemented [-Wcpp] 2 <stdin>:1127:2: warning: #warning syscall fstatat64 not implemented [-Wcpp] 1 WARNING: modpost: Symbol info of vmlinux is missing. Unresolved symbol check will be entirely skipped. ================================================================================ Detailed per-defconfig build reports: -------------------------------------------------------------------------------- 32r2el_defconfig (mips, gcc-10) — PASS, 0 errors, 1 warning, 0 section mismatches Warnings: WARNING: modpost: Symbol info of vmlinux is missing. Unresolved symbol check will be entirely skipped. -------------------------------------------------------------------------------- allnoconfig (i386, gcc-10) — PASS, 0 errors, 0 warnings, 0 section mismatches -------------------------------------------------------------------------------- allnoconfig (x86_64, gcc-10) — PASS, 0 errors, 0 warnings, 0 section mismatches -------------------------------------------------------------------------------- defconfig (riscv, gcc-10) — PASS, 0 errors, 0 warnings, 0 section mismatches -------------------------------------------------------------------------------- defconfig (arm64, gcc-10) — PASS, 0 errors, 0 warnings, 0 section mismatches -------------------------------------------------------------------------------- defconfig+arm64-chromebook (arm64, gcc-10) — PASS, 0 errors, 0 warnings, 0 section mismatches -------------------------------------------------------------------------------- haps_hs_smp_defconfig (arc, gcc-10) — PASS, 0 errors, 0 warnings, 0 section mismatches -------------------------------------------------------------------------------- i386_defconfig (i386, gcc-10) — PASS, 0 errors, 0 warnings, 0 section mismatches -------------------------------------------------------------------------------- imx_v6_v7_defconfig (arm, gcc-10) — FAIL, 1 error, 1 warning, 0 section mismatches Errors: kernel/trace/ring_buffer.c:1479:7: error: implicit declaration of function ‘try_cmpxchg’; did you mean ‘xa_cmpxchg’? [-Werror=implicit-function-declaration] Warnings: cc1: some warnings being treated as errors -------------------------------------------------------------------------------- multi_v5_defconfig (arm, gcc-10) — FAIL, 1 error, 1 warning, 0 section mismatches Errors: kernel/trace/ring_buffer.c:1479:7: error: implicit declaration of function ‘try_cmpxchg’; did you mean ‘xa_cmpxchg’? [-Werror=implicit-function-declaration] Warnings: cc1: some warnings being treated as errors -------------------------------------------------------------------------------- multi_v7_defconfig (arm, gcc-10) — FAIL, 1 error, 1 warning, 0 section mismatches Errors: kernel/trace/ring_buffer.c:1479:7: error: implicit declaration of function ‘try_cmpxchg’; did you mean ‘xa_cmpxchg’? [-Werror=implicit-function-declaration] Warnings: cc1: some warnings being treated as errors -------------------------------------------------------------------------------- nommu_k210_defconfig (riscv, gcc-10) — PASS, 0 errors, 0 warnings, 0 section mismatches -------------------------------------------------------------------------------- omap2plus_defconfig (arm, gcc-10) — FAIL, 1 error, 1 warning, 0 section mismatches Errors: kernel/trace/ring_buffer.c:1479:7: error: implicit declaration of function ‘try_cmpxchg’; did you mean ‘xa_cmpxchg’? [-Werror=implicit-function-declaration] Warnings: cc1: some warnings being treated as errors -------------------------------------------------------------------------------- rv32_defconfig (riscv, gcc-10) — PASS, 0 errors, 4 warnings, 0 section mismatches Warnings: <stdin>:830:2: warning: #warning syscall fstat64 not implemented [-Wcpp] <stdin>:1127:2: warning: #warning syscall fstatat64 not implemented [-Wcpp] <stdin>:830:2: warning: #warning syscall fstat64 not implemented [-Wcpp] <stdin>:1127:2: warning: #warning syscall fstatat64 not implemented [-Wcpp] -------------------------------------------------------------------------------- tinyconfig (x86_64, gcc-10) — PASS, 0 errors, 0 warnings, 0 section mismatches -------------------------------------------------------------------------------- tinyconfig (i386, gcc-10) — PASS, 0 errors, 0 warnings, 0 section mismatches -------------------------------------------------------------------------------- vexpress_defconfig (arm, gcc-10) — FAIL, 1 error, 1 warning, 0 section mismatches Errors: kernel/trace/ring_buffer.c:1479:7: error: implicit declaration of function ‘try_cmpxchg’; did you mean ‘xa_cmpxchg’? [-Werror=implicit-function-declaration] Warnings: cc1: some warnings being treated as errors -------------------------------------------------------------------------------- x86_64_defconfig (x86_64, gcc-10) — PASS, 0 errors, 0 warnings, 0 section mismatches -------------------------------------------------------------------------------- x86_64_defconfig+x86-board (x86_64, gcc-10) — PASS, 0 errors, 0 warnings, 0 section mismatches --- For more info write to <info(a)kernelci.org>
1 year
1
0
0
0
stable-rc/queue/6.1 build: 20 builds: 0 failed, 20 passed, 1 warning (v6.1.87-47-gabeefd7a692fd)
by kernelci.org bot
stable-rc/queue/6.1 build: 20 builds: 0 failed, 20 passed, 1 warning (v6.1.87-47-gabeefd7a692fd) Full Build Summary:
https://kernelci.org/build/stable-rc/branch/queue%2F6.1/kernel/v6.1.87-47-g…
Tree: stable-rc Branch: queue/6.1 Git Describe: v6.1.87-47-gabeefd7a692fd Git Commit: abeefd7a692fd9d40d246c3157cf68bb3d84ea8e Git URL:
https://git.kernel.org/pub/scm/linux/kernel/git/stable/linux-stable-rc.git
Built: 7 unique architectures Warnings Detected: arc: arm64: arm: i386: mips: 32r2el_defconfig (gcc-10): 1 warning riscv: x86_64: Warnings summary: 1 arch/mips/boot/dts/img/boston.dts:128.19-178.5: Warning (pci_device_reg): /pci@14000000/pci2_root@0,0,0: PCI unit address format error, expected "0,0" ================================================================================ Detailed per-defconfig build reports: -------------------------------------------------------------------------------- 32r2el_defconfig (mips, gcc-10) — PASS, 0 errors, 1 warning, 0 section mismatches Warnings: arch/mips/boot/dts/img/boston.dts:128.19-178.5: Warning (pci_device_reg): /pci@14000000/pci2_root@0,0,0: PCI unit address format error, expected "0,0" -------------------------------------------------------------------------------- allnoconfig (i386, gcc-10) — PASS, 0 errors, 0 warnings, 0 section mismatches -------------------------------------------------------------------------------- allnoconfig (x86_64, gcc-10) — PASS, 0 errors, 0 warnings, 0 section mismatches -------------------------------------------------------------------------------- defconfig (riscv, gcc-10) — PASS, 0 errors, 0 warnings, 0 section mismatches -------------------------------------------------------------------------------- defconfig (arm64, gcc-10) — PASS, 0 errors, 0 warnings, 0 section mismatches -------------------------------------------------------------------------------- defconfig+arm64-chromebook (arm64, gcc-10) — PASS, 0 errors, 0 warnings, 0 section mismatches -------------------------------------------------------------------------------- haps_hs_smp_defconfig (arc, gcc-10) — PASS, 0 errors, 0 warnings, 0 section mismatches -------------------------------------------------------------------------------- i386_defconfig (i386, gcc-10) — PASS, 0 errors, 0 warnings, 0 section mismatches -------------------------------------------------------------------------------- imx_v6_v7_defconfig (arm, gcc-10) — PASS, 0 errors, 0 warnings, 0 section mismatches -------------------------------------------------------------------------------- multi_v5_defconfig (arm, gcc-10) — PASS, 0 errors, 0 warnings, 0 section mismatches -------------------------------------------------------------------------------- multi_v7_defconfig (arm, gcc-10) — PASS, 0 errors, 0 warnings, 0 section mismatches -------------------------------------------------------------------------------- nommu_k210_defconfig (riscv, gcc-10) — PASS, 0 errors, 0 warnings, 0 section mismatches -------------------------------------------------------------------------------- nommu_k210_sdcard_defconfig (riscv, gcc-10) — PASS, 0 errors, 0 warnings, 0 section mismatches -------------------------------------------------------------------------------- omap2plus_defconfig (arm, gcc-10) — PASS, 0 errors, 0 warnings, 0 section mismatches -------------------------------------------------------------------------------- rv32_defconfig (riscv, gcc-10) — PASS, 0 errors, 0 warnings, 0 section mismatches -------------------------------------------------------------------------------- tinyconfig (x86_64, gcc-10) — PASS, 0 errors, 0 warnings, 0 section mismatches -------------------------------------------------------------------------------- tinyconfig (i386, gcc-10) — PASS, 0 errors, 0 warnings, 0 section mismatches -------------------------------------------------------------------------------- vexpress_defconfig (arm, gcc-10) — PASS, 0 errors, 0 warnings, 0 section mismatches -------------------------------------------------------------------------------- x86_64_defconfig (x86_64, gcc-10) — PASS, 0 errors, 0 warnings, 0 section mismatches -------------------------------------------------------------------------------- x86_64_defconfig+x86-board (x86_64, gcc-10) — PASS, 0 errors, 0 warnings, 0 section mismatches --- For more info write to <info(a)kernelci.org>
1 year
1
0
0
0
stable-rc/queue/5.15 build: 20 builds: 0 failed, 20 passed, 3 warnings (v5.15.156-26-gecdd0592aa09b)
by kernelci.org bot
stable-rc/queue/5.15 build: 20 builds: 0 failed, 20 passed, 3 warnings (v5.15.156-26-gecdd0592aa09b) Full Build Summary:
https://kernelci.org/build/stable-rc/branch/queue%2F5.15/kernel/v5.15.156-2…
Tree: stable-rc Branch: queue/5.15 Git Describe: v5.15.156-26-gecdd0592aa09b Git Commit: ecdd0592aa09bd23cb3fbb47d46e529e21b93aa4 Git URL:
https://git.kernel.org/pub/scm/linux/kernel/git/stable/linux-stable-rc.git
Built: 7 unique architectures Warnings Detected: arc: arm64: arm: i386: mips: 32r2el_defconfig (gcc-10): 1 warning riscv: x86_64: x86_64_defconfig (gcc-10): 1 warning x86_64_defconfig+x86-board (gcc-10): 1 warning Warnings summary: 2 arch/x86/kernel/smp.o: warning: objtool: sysvec_reboot()+0x45: unreachable instruction 1 arch/mips/boot/dts/img/boston.dts:128.19-178.5: Warning (pci_device_reg): /pci@14000000/pci2_root@0,0,0: PCI unit address format error, expected "0,0" ================================================================================ Detailed per-defconfig build reports: -------------------------------------------------------------------------------- 32r2el_defconfig (mips, gcc-10) — PASS, 0 errors, 1 warning, 0 section mismatches Warnings: arch/mips/boot/dts/img/boston.dts:128.19-178.5: Warning (pci_device_reg): /pci@14000000/pci2_root@0,0,0: PCI unit address format error, expected "0,0" -------------------------------------------------------------------------------- allnoconfig (x86_64, gcc-10) — PASS, 0 errors, 0 warnings, 0 section mismatches -------------------------------------------------------------------------------- allnoconfig (i386, gcc-10) — PASS, 0 errors, 0 warnings, 0 section mismatches -------------------------------------------------------------------------------- defconfig (riscv, gcc-10) — PASS, 0 errors, 0 warnings, 0 section mismatches -------------------------------------------------------------------------------- defconfig (arm64, gcc-10) — PASS, 0 errors, 0 warnings, 0 section mismatches -------------------------------------------------------------------------------- defconfig+arm64-chromebook (arm64, gcc-10) — PASS, 0 errors, 0 warnings, 0 section mismatches -------------------------------------------------------------------------------- haps_hs_smp_defconfig (arc, gcc-10) — PASS, 0 errors, 0 warnings, 0 section mismatches -------------------------------------------------------------------------------- i386_defconfig (i386, gcc-10) — PASS, 0 errors, 0 warnings, 0 section mismatches -------------------------------------------------------------------------------- imx_v6_v7_defconfig (arm, gcc-10) — PASS, 0 errors, 0 warnings, 0 section mismatches -------------------------------------------------------------------------------- multi_v5_defconfig (arm, gcc-10) — PASS, 0 errors, 0 warnings, 0 section mismatches -------------------------------------------------------------------------------- multi_v7_defconfig (arm, gcc-10) — PASS, 0 errors, 0 warnings, 0 section mismatches -------------------------------------------------------------------------------- nommu_k210_defconfig (riscv, gcc-10) — PASS, 0 errors, 0 warnings, 0 section mismatches -------------------------------------------------------------------------------- nommu_k210_sdcard_defconfig (riscv, gcc-10) — PASS, 0 errors, 0 warnings, 0 section mismatches -------------------------------------------------------------------------------- omap2plus_defconfig (arm, gcc-10) — PASS, 0 errors, 0 warnings, 0 section mismatches -------------------------------------------------------------------------------- rv32_defconfig (riscv, gcc-10) — PASS, 0 errors, 0 warnings, 0 section mismatches -------------------------------------------------------------------------------- tinyconfig (i386, gcc-10) — PASS, 0 errors, 0 warnings, 0 section mismatches -------------------------------------------------------------------------------- tinyconfig (x86_64, gcc-10) — PASS, 0 errors, 0 warnings, 0 section mismatches -------------------------------------------------------------------------------- vexpress_defconfig (arm, gcc-10) — PASS, 0 errors, 0 warnings, 0 section mismatches -------------------------------------------------------------------------------- x86_64_defconfig (x86_64, gcc-10) — PASS, 0 errors, 1 warning, 0 section mismatches Warnings: arch/x86/kernel/smp.o: warning: objtool: sysvec_reboot()+0x45: unreachable instruction -------------------------------------------------------------------------------- x86_64_defconfig+x86-board (x86_64, gcc-10) — PASS, 0 errors, 1 warning, 0 section mismatches Warnings: arch/x86/kernel/smp.o: warning: objtool: sysvec_reboot()+0x45: unreachable instruction --- For more info write to <info(a)kernelci.org>
1 year
1
0
0
0
stable-rc/queue/6.8 build: 19 builds: 0 failed, 19 passed, 2 warnings (v6.8.7-53-g8ca1f5a209a07)
by kernelci.org bot
stable-rc/queue/6.8 build: 19 builds: 0 failed, 19 passed, 2 warnings (v6.8.7-53-g8ca1f5a209a07) Full Build Summary:
https://kernelci.org/build/stable-rc/branch/queue%2F6.8/kernel/v6.8.7-53-g8…
Tree: stable-rc Branch: queue/6.8 Git Describe: v6.8.7-53-g8ca1f5a209a07 Git Commit: 8ca1f5a209a071e760d9f1236bfaf704e2a12c3e Git URL:
https://git.kernel.org/pub/scm/linux/kernel/git/stable/linux-stable-rc.git
Built: 7 unique architectures Warnings Detected: arc: haps_hs_smp_defconfig (gcc-10): 2 warnings arm64: arm: i386: mips: riscv: x86_64: Warnings summary: 1 arch/arc/kernel/ptrace.c:342:16: warning: no previous prototype for 'syscall_trace_enter' [-Wmissing-prototypes] 1 arch/arc/kernel/kprobes.c:193:15: warning: no previous prototype for 'arc_kprobe_handler' [-Wmissing-prototypes] ================================================================================ Detailed per-defconfig build reports: -------------------------------------------------------------------------------- 32r2el_defconfig (mips, gcc-10) — PASS, 0 errors, 0 warnings, 0 section mismatches -------------------------------------------------------------------------------- allnoconfig (x86_64, gcc-10) — PASS, 0 errors, 0 warnings, 0 section mismatches -------------------------------------------------------------------------------- allnoconfig (i386, gcc-10) — PASS, 0 errors, 0 warnings, 0 section mismatches -------------------------------------------------------------------------------- defconfig (riscv, gcc-10) — PASS, 0 errors, 0 warnings, 0 section mismatches -------------------------------------------------------------------------------- defconfig (arm64, gcc-10) — PASS, 0 errors, 0 warnings, 0 section mismatches -------------------------------------------------------------------------------- defconfig+arm64-chromebook (arm64, gcc-10) — PASS, 0 errors, 0 warnings, 0 section mismatches -------------------------------------------------------------------------------- haps_hs_smp_defconfig (arc, gcc-10) — PASS, 0 errors, 2 warnings, 0 section mismatches Warnings: arch/arc/kernel/ptrace.c:342:16: warning: no previous prototype for 'syscall_trace_enter' [-Wmissing-prototypes] arch/arc/kernel/kprobes.c:193:15: warning: no previous prototype for 'arc_kprobe_handler' [-Wmissing-prototypes] -------------------------------------------------------------------------------- i386_defconfig (i386, gcc-10) — PASS, 0 errors, 0 warnings, 0 section mismatches -------------------------------------------------------------------------------- imx_v6_v7_defconfig (arm, gcc-10) — PASS, 0 errors, 0 warnings, 0 section mismatches -------------------------------------------------------------------------------- multi_v5_defconfig (arm, gcc-10) — PASS, 0 errors, 0 warnings, 0 section mismatches -------------------------------------------------------------------------------- multi_v7_defconfig (arm, gcc-10) — PASS, 0 errors, 0 warnings, 0 section mismatches -------------------------------------------------------------------------------- nommu_k210_defconfig (riscv, gcc-10) — PASS, 0 errors, 0 warnings, 0 section mismatches -------------------------------------------------------------------------------- nommu_k210_sdcard_defconfig (riscv, gcc-10) — PASS, 0 errors, 0 warnings, 0 section mismatches -------------------------------------------------------------------------------- omap2plus_defconfig (arm, gcc-10) — PASS, 0 errors, 0 warnings, 0 section mismatches -------------------------------------------------------------------------------- tinyconfig (i386, gcc-10) — PASS, 0 errors, 0 warnings, 0 section mismatches -------------------------------------------------------------------------------- tinyconfig (x86_64, gcc-10) — PASS, 0 errors, 0 warnings, 0 section mismatches -------------------------------------------------------------------------------- vexpress_defconfig (arm, gcc-10) — PASS, 0 errors, 0 warnings, 0 section mismatches -------------------------------------------------------------------------------- x86_64_defconfig (x86_64, gcc-10) — PASS, 0 errors, 0 warnings, 0 section mismatches -------------------------------------------------------------------------------- x86_64_defconfig+x86-board (x86_64, gcc-10) — PASS, 0 errors, 0 warnings, 0 section mismatches --- For more info write to <info(a)kernelci.org>
1 year
1
0
0
0
mainline/master baseline: 315 runs, 14 regressions (v6.9-rc4-214-g13a2e429f6446)
by kernelci.org bot
mainline/master baseline: 315 runs, 14 regressions (v6.9-rc4-214-g13a2e429f6446) Regressions Summary ------------------- platform | arch | lab | compiler | defconfig | regressions ------------------------+-------+---------------+----------+------------------------------+------------ bcm2836-rpi-2-b | arm | lab-collabora | gcc-10 | multi_v7_defc...MB2_KERNEL=y | 1 beagle-xm | arm | lab-baylibre | clang-16 | multi_v7_defconfig | 1 beagle-xm | arm | lab-baylibre | gcc-10 | multi_v7_defc...MB2_KERNEL=y | 1 beaglebone-black | arm | lab-cip | gcc-10 | multi_v7_defc...MB2_KERNEL=y | 1 beaglebone-black | arm | lab-cip | gcc-10 | multi_v7_defc...CONFIG_SMP=n | 1 jetson-tk1 | arm | lab-baylibre | gcc-10 | multi_v7_defconfig | 1 k3-j721e-sk | arm64 | lab-baylibre | gcc-10 | defconfig | 1 mt8195-cherry-tomato-r2 | arm64 | lab-collabora | gcc-10 | defconfig+arm64-chromebook | 1 qemu_riscv64 | riscv | lab-broonie | gcc-10 | defconfig+debug | 1 qemu_riscv64 | riscv | lab-collabora | gcc-10 | defconfig+debug | 1 qemu_smp8_riscv64 | riscv | lab-broonie | gcc-10 | defconfig+debug | 1 qemu_smp8_riscv64 | riscv | lab-collabora | gcc-10 | defconfig+debug | 1 r8a7743-iwg20d-q7 | arm | lab-cip | gcc-10 | shmobile_defconfig | 1 rk3288-rock2-square | arm | lab-collabora | clang-16 | multi_v7_defconfig | 1 Details:
https://kernelci.org/test/job/mainline/branch/master/kernel/v6.9-rc4-214-g1…
Test: baseline Tree: mainline Branch: master Describe: v6.9-rc4-214-g13a2e429f6446 URL:
https://git.kernel.org/pub/scm/linux/kernel/git/torvalds/linux.git
SHA: 13a2e429f644691fca70049ea1c75f135957c788 Test Regressions ---------------- platform | arch | lab | compiler | defconfig | regressions ------------------------+-------+---------------+----------+------------------------------+------------ bcm2836-rpi-2-b | arm | lab-collabora | gcc-10 | multi_v7_defc...MB2_KERNEL=y | 1 Details:
https://kernelci.org/test/plan/id/66236c8ef7f5959f274c42da
Results: 0 PASS, 1 FAIL, 0 SKIP Full config: multi_v7_defconfig+CONFIG_THUMB2_KERNEL=y Compiler: gcc-10 (arm-linux-gnueabihf-gcc (Debian 10.2.1-6) 10.2.1 20210110) Plain log:
https://storage.kernelci.org//mainline/master/v6.9-rc4-214-g13a2e429f6446/a…
HTML log:
https://storage.kernelci.org//mainline/master/v6.9-rc4-214-g13a2e429f6446/a…
Rootfs:
http://storage.kernelci.org/images/rootfs/buildroot/buildroot-baseline/2023…
* baseline.login:
https://kernelci.org/test/case/id/66236c8ef7f5959f274c42db
failing since 419 days (last pass: v6.2-10827-g489fa31ea873, first fail: v6.2-11606-g116b41162f8b) platform | arch | lab | compiler | defconfig | regressions ------------------------+-------+---------------+----------+------------------------------+------------ beagle-xm | arm | lab-baylibre | clang-16 | multi_v7_defconfig | 1 Details:
https://kernelci.org/test/plan/id/66236e6cec34e8bd274c4358
Results: 0 PASS, 1 FAIL, 0 SKIP Full config: multi_v7_defconfig Compiler: clang-16 (Debian clang version 16.0.6 (15~deb11u2)) Plain log:
https://storage.kernelci.org//mainline/master/v6.9-rc4-214-g13a2e429f6446/a…
HTML log:
https://storage.kernelci.org//mainline/master/v6.9-rc4-214-g13a2e429f6446/a…
Rootfs:
http://storage.kernelci.org/images/rootfs/buildroot/buildroot-baseline/2023…
* baseline.login:
https://kernelci.org/test/case/id/66236e6cec34e8bd274c4359
failing since 424 days (last pass: v6.2-rc8-151-g925cf0457d7e, first fail: v6.2-340-geca3a04f140a) platform | arch | lab | compiler | defconfig | regressions ------------------------+-------+---------------+----------+------------------------------+------------ beagle-xm | arm | lab-baylibre | gcc-10 | multi_v7_defc...MB2_KERNEL=y | 1 Details:
https://kernelci.org/test/plan/id/66236d614341a5963a4c42db
Results: 0 PASS, 1 FAIL, 0 SKIP Full config: multi_v7_defconfig+CONFIG_THUMB2_KERNEL=y Compiler: gcc-10 (arm-linux-gnueabihf-gcc (Debian 10.2.1-6) 10.2.1 20210110) Plain log:
https://storage.kernelci.org//mainline/master/v6.9-rc4-214-g13a2e429f6446/a…
HTML log:
https://storage.kernelci.org//mainline/master/v6.9-rc4-214-g13a2e429f6446/a…
Rootfs:
http://storage.kernelci.org/images/rootfs/buildroot/buildroot-baseline/2023…
* baseline.login:
https://kernelci.org/test/case/id/66236d614341a5963a4c42dc
failing since 13 days (last pass: v6.9-rc2-387-g6c6e47d69d82, first fail: v6.9-rc2-407-g9520c192e853) platform | arch | lab | compiler | defconfig | regressions ------------------------+-------+---------------+----------+------------------------------+------------ beaglebone-black | arm | lab-cip | gcc-10 | multi_v7_defc...MB2_KERNEL=y | 1 Details:
https://kernelci.org/test/plan/id/66236cf4a6935dc2024c42f3
Results: 3 PASS, 1 FAIL, 0 SKIP Full config: multi_v7_defconfig+CONFIG_THUMB2_KERNEL=y Compiler: gcc-10 (arm-linux-gnueabihf-gcc (Debian 10.2.1-6) 10.2.1 20210110) Plain log:
https://storage.kernelci.org//mainline/master/v6.9-rc4-214-g13a2e429f6446/a…
HTML log:
https://storage.kernelci.org//mainline/master/v6.9-rc4-214-g13a2e429f6446/a…
Rootfs:
http://storage.kernelci.org/images/rootfs/buildroot/buildroot-baseline/2023…
* baseline.dmesg.crit:
https://kernelci.org/test/case/id/66236cf4a6935dc2024c42f8
failing since 0 day (last pass: v6.9-rc4-38-g8cd26fd90c1a, first fail: v6.9-rc4-113-g2668e3ae2ef3) 1 lines 2024-04-20T07:21:10.607078 / # 2024-04-20T07:21:10.612644 2024-04-20T07:21:10.714403 / # # 2024-04-20T07:21:10.719787 # 2024-04-20T07:21:10.820530 / # export SHELL=/bin/sh 2024-04-20T07:21:10.825988 export SHELL=/bin/sh 2024-04-20T07:21:10.926606 / # . /lava-1122368/environment 2024-04-20T07:21:10.932951 . /lava-1122368/environment 2024-04-20T07:21:11.033986 / # /lava-1122368/bin/lava-test-runner /lava-1122368/0 2024-04-20T07:21:11.039000 /lava-1122368/bin/lava-test-runner /lava-1122368/0 ... (9 line(s) more) platform | arch | lab | compiler | defconfig | regressions ------------------------+-------+---------------+----------+------------------------------+------------ beaglebone-black | arm | lab-cip | gcc-10 | multi_v7_defc...CONFIG_SMP=n | 1 Details:
https://kernelci.org/test/plan/id/662377e33a38a9f0a84c42da
Results: 3 PASS, 1 FAIL, 0 SKIP Full config: multi_v7_defconfig+CONFIG_SMP=n Compiler: gcc-10 (arm-linux-gnueabihf-gcc (Debian 10.2.1-6) 10.2.1 20210110) Plain log:
https://storage.kernelci.org//mainline/master/v6.9-rc4-214-g13a2e429f6446/a…
HTML log:
https://storage.kernelci.org//mainline/master/v6.9-rc4-214-g13a2e429f6446/a…
Rootfs:
http://storage.kernelci.org/images/rootfs/buildroot/buildroot-baseline/2023…
* baseline.dmesg.crit:
https://kernelci.org/test/case/id/662377e33a38a9f0a84c42df
new failure (last pass: v6.9-rc4-113-g2668e3ae2ef3) 1 lines 2024-04-20T08:07:50.035869 / # 2024-04-20T08:07:50.044549 2024-04-20T08:07:50.149766 / # # 2024-04-20T08:07:50.156373 # 2024-04-20T08:07:50.301501 / # export SHELL=/bin/sh 2024-04-20T08:07:50.316329 export SHELL=/bin/sh 2024-04-20T08:07:50.418129 / # . /lava-1122433/environment 2024-04-20T08:07:50.428290 . /lava-1122433/environment 2024-04-20T08:07:50.530237 / # /lava-1122433/bin/lava-test-runner /lava-1122433/0 2024-04-20T08:07:50.540186 /lava-1122433/bin/lava-test-runner /lava-1122433/0 ... (9 line(s) more) platform | arch | lab | compiler | defconfig | regressions ------------------------+-------+---------------+----------+------------------------------+------------ jetson-tk1 | arm | lab-baylibre | gcc-10 | multi_v7_defconfig | 1 Details:
https://kernelci.org/test/plan/id/6623744551a435e1704c42ea
Results: 0 PASS, 1 FAIL, 0 SKIP Full config: multi_v7_defconfig Compiler: gcc-10 (arm-linux-gnueabihf-gcc (Debian 10.2.1-6) 10.2.1 20210110) Plain log:
https://storage.kernelci.org//mainline/master/v6.9-rc4-214-g13a2e429f6446/a…
HTML log:
https://storage.kernelci.org//mainline/master/v6.9-rc4-214-g13a2e429f6446/a…
Rootfs:
http://storage.kernelci.org/images/rootfs/buildroot/buildroot-baseline/2023…
* baseline.login:
https://kernelci.org/test/case/id/6623744551a435e1704c42eb
failing since 29 days (last pass: v6.8-5292-gb0546776ad3f, first fail: v6.8-12955-g8e938e3986692) platform | arch | lab | compiler | defconfig | regressions ------------------------+-------+---------------+----------+------------------------------+------------ k3-j721e-sk | arm64 | lab-baylibre | gcc-10 | defconfig | 1 Details:
https://kernelci.org/test/plan/id/66236e850abb30748d4c42f8
Results: 0 PASS, 1 FAIL, 0 SKIP Full config: defconfig Compiler: gcc-10 (aarch64-linux-gnu-gcc (Debian 10.2.1-6) 10.2.1 20210110) Plain log:
https://storage.kernelci.org//mainline/master/v6.9-rc4-214-g13a2e429f6446/a…
HTML log:
https://storage.kernelci.org//mainline/master/v6.9-rc4-214-g13a2e429f6446/a…
Rootfs:
http://storage.kernelci.org/images/rootfs/buildroot/buildroot-baseline/2023…
* baseline.login:
https://kernelci.org/test/case/id/66236e850abb30748d4c42f9
new failure (last pass: v6.9-rc3-23-g2c71fdf02a95b) platform | arch | lab | compiler | defconfig | regressions ------------------------+-------+---------------+----------+------------------------------+------------ mt8195-cherry-tomato-r2 | arm64 | lab-collabora | gcc-10 | defconfig+arm64-chromebook | 1 Details:
https://kernelci.org/test/plan/id/66236e03f2653515b24c42ed
Results: 0 PASS, 1 FAIL, 0 SKIP Full config: defconfig+arm64-chromebook Compiler: gcc-10 (aarch64-linux-gnu-gcc (Debian 10.2.1-6) 10.2.1 20210110) Plain log:
https://storage.kernelci.org//mainline/master/v6.9-rc4-214-g13a2e429f6446/a…
HTML log:
https://storage.kernelci.org//mainline/master/v6.9-rc4-214-g13a2e429f6446/a…
Rootfs:
http://storage.kernelci.org/images/rootfs/buildroot/buildroot-baseline/2023…
* baseline.login:
https://kernelci.org/test/case/id/66236e03f2653515b24c42ee
new failure (last pass: v6.9-rc4-38-g8cd26fd90c1a) platform | arch | lab | compiler | defconfig | regressions ------------------------+-------+---------------+----------+------------------------------+------------ qemu_riscv64 | riscv | lab-broonie | gcc-10 | defconfig+debug | 1 Details:
https://kernelci.org/test/plan/id/6623751f8d5d6716ad4c4303
Results: 0 PASS, 1 FAIL, 0 SKIP Full config: defconfig+debug Compiler: gcc-10 (riscv64-linux-gnu-gcc (Debian 10.2.1-6) 10.2.1 20210110) Plain log:
https://storage.kernelci.org//mainline/master/v6.9-rc4-214-g13a2e429f6446/r…
HTML log:
https://storage.kernelci.org//mainline/master/v6.9-rc4-214-g13a2e429f6446/r…
Rootfs:
http://storage.kernelci.org/images/rootfs/buildroot/buildroot-baseline/2023…
* baseline.login:
https://kernelci.org/test/case/id/6623751f8d5d6716ad4c4304
new failure (last pass: v6.9-rc4-38-g8cd26fd90c1a) platform | arch | lab | compiler | defconfig | regressions ------------------------+-------+---------------+----------+------------------------------+------------ qemu_riscv64 | riscv | lab-collabora | gcc-10 | defconfig+debug | 1 Details:
https://kernelci.org/test/plan/id/662374bfa7ba13ce1c4c42f6
Results: 0 PASS, 1 FAIL, 0 SKIP Full config: defconfig+debug Compiler: gcc-10 (riscv64-linux-gnu-gcc (Debian 10.2.1-6) 10.2.1 20210110) Plain log:
https://storage.kernelci.org//mainline/master/v6.9-rc4-214-g13a2e429f6446/r…
HTML log:
https://storage.kernelci.org//mainline/master/v6.9-rc4-214-g13a2e429f6446/r…
Rootfs:
http://storage.kernelci.org/images/rootfs/buildroot/buildroot-baseline/2023…
* baseline.login:
https://kernelci.org/test/case/id/662374bfa7ba13ce1c4c42f7
new failure (last pass: v6.9-rc4-38-g8cd26fd90c1a) platform | arch | lab | compiler | defconfig | regressions ------------------------+-------+---------------+----------+------------------------------+------------ qemu_smp8_riscv64 | riscv | lab-broonie | gcc-10 | defconfig+debug | 1 Details:
https://kernelci.org/test/plan/id/6623755b6b1685807c4c4317
Results: 0 PASS, 1 FAIL, 0 SKIP Full config: defconfig+debug Compiler: gcc-10 (riscv64-linux-gnu-gcc (Debian 10.2.1-6) 10.2.1 20210110) Plain log:
https://storage.kernelci.org//mainline/master/v6.9-rc4-214-g13a2e429f6446/r…
HTML log:
https://storage.kernelci.org//mainline/master/v6.9-rc4-214-g13a2e429f6446/r…
Rootfs:
http://storage.kernelci.org/images/rootfs/buildroot/buildroot-baseline/2023…
* baseline.login:
https://kernelci.org/test/case/id/6623755b6b1685807c4c4318
new failure (last pass: v6.9-rc4-38-g8cd26fd90c1a) platform | arch | lab | compiler | defconfig | regressions ------------------------+-------+---------------+----------+------------------------------+------------ qemu_smp8_riscv64 | riscv | lab-collabora | gcc-10 | defconfig+debug | 1 Details:
https://kernelci.org/test/plan/id/662374c1cb98827ba24c42f7
Results: 0 PASS, 1 FAIL, 0 SKIP Full config: defconfig+debug Compiler: gcc-10 (riscv64-linux-gnu-gcc (Debian 10.2.1-6) 10.2.1 20210110) Plain log:
https://storage.kernelci.org//mainline/master/v6.9-rc4-214-g13a2e429f6446/r…
HTML log:
https://storage.kernelci.org//mainline/master/v6.9-rc4-214-g13a2e429f6446/r…
Rootfs:
http://storage.kernelci.org/images/rootfs/buildroot/buildroot-baseline/2023…
* baseline.login:
https://kernelci.org/test/case/id/662374c1cb98827ba24c42f8
new failure (last pass: v6.9-rc4-38-g8cd26fd90c1a) platform | arch | lab | compiler | defconfig | regressions ------------------------+-------+---------------+----------+------------------------------+------------ r8a7743-iwg20d-q7 | arm | lab-cip | gcc-10 | shmobile_defconfig | 1 Details:
https://kernelci.org/test/plan/id/6623699d1f622a8bb24c4303
Results: 0 PASS, 1 FAIL, 0 SKIP Full config: shmobile_defconfig Compiler: gcc-10 (arm-linux-gnueabihf-gcc (Debian 10.2.1-6) 10.2.1 20210110) Plain log:
https://storage.kernelci.org//mainline/master/v6.9-rc4-214-g13a2e429f6446/a…
HTML log:
https://storage.kernelci.org//mainline/master/v6.9-rc4-214-g13a2e429f6446/a…
Rootfs:
http://storage.kernelci.org/images/rootfs/buildroot/buildroot-baseline/2023…
* baseline.login:
https://kernelci.org/test/case/id/6623699d1f622a8bb24c4304
failing since 5 days (last pass: v6.9-rc3-355-g7efd0a74039fb, first fail: v6.9-rc3-365-g399f4dae683a7) platform | arch | lab | compiler | defconfig | regressions ------------------------+-------+---------------+----------+------------------------------+------------ rk3288-rock2-square | arm | lab-collabora | clang-16 | multi_v7_defconfig | 1 Details:
https://kernelci.org/test/plan/id/66236f4b054be702324c42f6
Results: 0 PASS, 1 FAIL, 0 SKIP Full config: multi_v7_defconfig Compiler: clang-16 (Debian clang version 16.0.6 (15~deb11u2)) Plain log:
https://storage.kernelci.org//mainline/master/v6.9-rc4-214-g13a2e429f6446/a…
HTML log:
https://storage.kernelci.org//mainline/master/v6.9-rc4-214-g13a2e429f6446/a…
Rootfs:
http://storage.kernelci.org/images/rootfs/buildroot/buildroot-baseline/2023…
* baseline.login:
https://kernelci.org/test/case/id/66236f4b054be702324c42f7
failing since 28 days (last pass: v6.8-5292-gb0546776ad3f, first fail: v6.8-13006-g4f55aa85a874)
1 year
1
0
0
0
stable-rc/queue/6.6 build: 20 builds: 0 failed, 20 passed (v6.6.28-58-g42a6a6e5e5538)
by kernelci.org bot
stable-rc/queue/6.6 build: 20 builds: 0 failed, 20 passed (v6.6.28-58-g42a6a6e5e5538) Full Build Summary:
https://kernelci.org/build/stable-rc/branch/queue%2F6.6/kernel/v6.6.28-58-g…
Tree: stable-rc Branch: queue/6.6 Git Describe: v6.6.28-58-g42a6a6e5e5538 Git Commit: 42a6a6e5e553844443e8e5e289d59f1ffda56dfe Git URL:
https://git.kernel.org/pub/scm/linux/kernel/git/stable/linux-stable-rc.git
Built: 7 unique architectures ================================================================================ Detailed per-defconfig build reports: -------------------------------------------------------------------------------- 32r2el_defconfig (mips, gcc-10) — PASS, 0 errors, 0 warnings, 0 section mismatches -------------------------------------------------------------------------------- allnoconfig (i386, gcc-10) — PASS, 0 errors, 0 warnings, 0 section mismatches -------------------------------------------------------------------------------- allnoconfig (x86_64, gcc-10) — PASS, 0 errors, 0 warnings, 0 section mismatches -------------------------------------------------------------------------------- defconfig (riscv, gcc-10) — PASS, 0 errors, 0 warnings, 0 section mismatches -------------------------------------------------------------------------------- defconfig (arm64, gcc-10) — PASS, 0 errors, 0 warnings, 0 section mismatches -------------------------------------------------------------------------------- defconfig+arm64-chromebook (arm64, gcc-10) — PASS, 0 errors, 0 warnings, 0 section mismatches -------------------------------------------------------------------------------- haps_hs_smp_defconfig (arc, gcc-10) — PASS, 0 errors, 0 warnings, 0 section mismatches -------------------------------------------------------------------------------- i386_defconfig (i386, gcc-10) — PASS, 0 errors, 0 warnings, 0 section mismatches -------------------------------------------------------------------------------- imx_v6_v7_defconfig (arm, gcc-10) — PASS, 0 errors, 0 warnings, 0 section mismatches -------------------------------------------------------------------------------- multi_v5_defconfig (arm, gcc-10) — PASS, 0 errors, 0 warnings, 0 section mismatches -------------------------------------------------------------------------------- multi_v7_defconfig (arm, gcc-10) — PASS, 0 errors, 0 warnings, 0 section mismatches -------------------------------------------------------------------------------- nommu_k210_defconfig (riscv, gcc-10) — PASS, 0 errors, 0 warnings, 0 section mismatches -------------------------------------------------------------------------------- nommu_k210_sdcard_defconfig (riscv, gcc-10) — PASS, 0 errors, 0 warnings, 0 section mismatches -------------------------------------------------------------------------------- omap2plus_defconfig (arm, gcc-10) — PASS, 0 errors, 0 warnings, 0 section mismatches -------------------------------------------------------------------------------- rv32_defconfig (riscv, gcc-10) — PASS, 0 errors, 0 warnings, 0 section mismatches -------------------------------------------------------------------------------- tinyconfig (i386, gcc-10) — PASS, 0 errors, 0 warnings, 0 section mismatches -------------------------------------------------------------------------------- tinyconfig (x86_64, gcc-10) — PASS, 0 errors, 0 warnings, 0 section mismatches -------------------------------------------------------------------------------- vexpress_defconfig (arm, gcc-10) — PASS, 0 errors, 0 warnings, 0 section mismatches -------------------------------------------------------------------------------- x86_64_defconfig (x86_64, gcc-10) — PASS, 0 errors, 0 warnings, 0 section mismatches -------------------------------------------------------------------------------- x86_64_defconfig+x86-board (x86_64, gcc-10) — PASS, 0 errors, 0 warnings, 0 section mismatches --- For more info write to <info(a)kernelci.org>
1 year
1
0
0
0
← Newer
1
...
20
21
22
23
24
25
26
...
69
Older →
Jump to page:
1
2
3
4
5
6
7
8
9
10
11
12
13
14
15
16
17
18
19
20
21
22
23
24
25
26
27
28
29
30
31
32
33
34
35
36
37
38
39
40
41
42
43
44
45
46
47
48
49
50
51
52
53
54
55
56
57
58
59
60
61
62
63
64
65
66
67
68
69
Results per page:
10
25
50
100
200