lists.linaro.org
Sign In
Sign Up
Sign In
Sign Up
Manage this list
×
Keyboard Shortcuts
Thread View
j
: Next unread message
k
: Previous unread message
j a
: Jump to all threads
j l
: Jump to MailingList overview
2025
May
April
March
February
January
2024
December
November
October
September
August
July
June
May
April
March
February
January
2023
December
November
October
September
August
July
June
May
April
March
February
January
2022
December
November
October
September
August
July
June
May
April
March
February
January
2021
December
November
October
September
August
July
June
May
April
March
February
January
2020
December
November
October
September
August
July
June
May
April
March
February
January
2019
December
November
October
September
August
July
June
May
April
March
February
January
2018
December
November
October
September
August
July
June
May
April
March
February
January
2017
December
November
October
September
August
July
June
May
April
March
February
January
2016
December
November
October
September
August
July
June
May
April
March
February
January
2015
December
November
October
September
August
July
June
May
April
March
February
January
2014
December
November
October
September
August
July
June
May
April
March
February
January
2013
December
November
October
September
August
List overview
Download
Kernel-build-reports
November 2019
----- 2025 -----
May 2025
April 2025
March 2025
February 2025
January 2025
----- 2024 -----
December 2024
November 2024
October 2024
September 2024
August 2024
July 2024
June 2024
May 2024
April 2024
March 2024
February 2024
January 2024
----- 2023 -----
December 2023
November 2023
October 2023
September 2023
August 2023
July 2023
June 2023
May 2023
April 2023
March 2023
February 2023
January 2023
----- 2022 -----
December 2022
November 2022
October 2022
September 2022
August 2022
July 2022
June 2022
May 2022
April 2022
March 2022
February 2022
January 2022
----- 2021 -----
December 2021
November 2021
October 2021
September 2021
August 2021
July 2021
June 2021
May 2021
April 2021
March 2021
February 2021
January 2021
----- 2020 -----
December 2020
November 2020
October 2020
September 2020
August 2020
July 2020
June 2020
May 2020
April 2020
March 2020
February 2020
January 2020
----- 2019 -----
December 2019
November 2019
October 2019
September 2019
August 2019
July 2019
June 2019
May 2019
April 2019
March 2019
February 2019
January 2019
----- 2018 -----
December 2018
November 2018
October 2018
September 2018
August 2018
July 2018
June 2018
May 2018
April 2018
March 2018
February 2018
January 2018
----- 2017 -----
December 2017
November 2017
October 2017
September 2017
August 2017
July 2017
June 2017
May 2017
April 2017
March 2017
February 2017
January 2017
----- 2016 -----
December 2016
November 2016
October 2016
September 2016
August 2016
July 2016
June 2016
May 2016
April 2016
March 2016
February 2016
January 2016
----- 2015 -----
December 2015
November 2015
October 2015
September 2015
August 2015
July 2015
June 2015
May 2015
April 2015
March 2015
February 2015
January 2015
----- 2014 -----
December 2014
November 2014
October 2014
September 2014
August 2014
July 2014
June 2014
May 2014
April 2014
March 2014
February 2014
January 2014
----- 2013 -----
December 2013
November 2013
October 2013
September 2013
August 2013
kernel-build-reports@lists.linaro.org
4 participants
1189 discussions
Start a n
N
ew thread
next/master baseline: 150 runs, 3 regressions (next-20191114)
by kernelci.org bot
next/master baseline: 150 runs, 3 regressions (next-20191114) Test results summary -------------------- run | platform | arch | lab | compiler | defconfig | results ----+------------------------------+--------+---------------+----------+------------------------------+-------- 1 | am335x-boneblack | arm | lab-baylibre | gcc-8 | multi_v7_defconfig | 4/5 2 | am335x-boneblack | arm | lab-baylibre | gcc-8 | multi_v7_defc...CONFIG_SMP=n | 4/5 3 | bcm2836-rpi-2-b | arm | lab-collabora | gcc-8 | bcm2835_defconfig | 5/5 4 | bcm2836-rpi-2-b | arm | lab-collabora | gcc-8 | multi_v7_defconfig | 5/5 5 | bcm2836-rpi-2-b | arm | lab-collabora | gcc-8 | multi_v7_defc...CONFIG_SMP=n | 5/5 6 | bcm2837-rpi-3-b | arm | lab-baylibre | gcc-8 | bcm2835_defconfig | 5/5 7 | bcm2837-rpi-3-b | arm64 | lab-baylibre | gcc-8 | defconfig+CON...OMIZE_BASE=y | 4/5 8 | bcm2837-rpi-3-b | arm64 | lab-baylibre | gcc-8 | defconfig | 5/5 9 | da850-lcdk | arm | lab-baylibre | gcc-8 | davinci_all_defconfig | 4/5 10 | da850-lcdk | arm | lab-baylibre | gcc-8 | multi_v5_defconfig | 4/5 11 | exynos4412-odroidx2 | arm | lab-collabora | gcc-8 | exynos_defconfig | 4/5 12 | exynos4412-odroidx2 | arm | lab-collabora | gcc-8 | multi_v7_defconfig | 4/5 13 | exynos4412-odroidx2 | arm | lab-collabora | gcc-8 | multi_v7_defc...CONFIG_SMP=n | 4/5 14 | exynos5422-odroidxu3 | arm | lab-collabora | gcc-8 | exynos_defconfig | 2/2 15 | exynos5422-odroidxu3 | arm | lab-collabora | gcc-8 | multi_v7_defconfig | 5/5 16 | exynos5422-odroidxu3 | arm | lab-collabora | gcc-8 | multi_v7_defc...G_ARM_LPAE=y | 5/5 17 | exynos5422-odroidxu3 | arm | lab-collabora | gcc-8 | multi_v7_defc...CONFIG_SMP=n | 5/5 18 | exynos5800-peach-pi | arm | lab-collabora | gcc-8 | exynos_defconfig | 123/129 19 | exynos5800-peach-pi | arm | lab-collabora | gcc-8 | multi_v7_defconfig | 126/132 20 | exynos5800-peach-pi | arm | lab-collabora | gcc-8 | multi_v7_defc...G_ARM_LPAE=y | 126/132 21 | exynos5800-peach-pi | arm | lab-collabora | gcc-8 | multi_v7_defc...CONFIG_SMP=n | 126/132 22 | hifive-unleashed-a00 | riscv | lab-baylibre | gcc-8 | defconfig | 1/1 23 | hsdk | arc | lab-baylibre | gcc-8 | hsdk_defconfig | 4/5 24 | imx6q-sabrelite | arm | lab-baylibre | gcc-8 | multi_v7_defconfig | 5/5 25 | imx6q-sabrelite | arm | lab-baylibre | gcc-8 | multi_v7_defc...CONFIG_SMP=n | 5/5 26 | imx6q-sabrelite | arm | lab-collabora | gcc-8 | multi_v7_defconfig | 5/5 27 | imx6q-sabrelite | arm | lab-collabora | gcc-8 | multi_v7_defc...CONFIG_SMP=n | 5/5 28 | meson-g12a-u200 | arm64 | lab-baylibre | gcc-8 | defconfig+CON...OMIZE_BASE=y | 5/5 29 | meson-g12a-u200 | arm64 | lab-baylibre | gcc-8 | defconfig | 5/5 30 | meson-g12a-x96-max | arm64 | lab-baylibre | gcc-8 | defconfig+CON...OMIZE_BASE=y | 5/5 31 | meson-g12a-x96-max | arm64 | lab-baylibre | gcc-8 | defconfig | 5/5 32 | meson-g12b-odroid-n2 | arm64 | lab-baylibre | gcc-8 | defconfig+CON...OMIZE_BASE=y | 5/5 33 | meson-g12b-odroid-n2 | arm64 | lab-baylibre | gcc-8 | defconfig | 5/5 34 | meson-gxbb-p200 | arm64 | lab-baylibre | gcc-8 | defconfig+CON...BIG_ENDIAN=y | 5/5 35 | meson-gxbb-p200 | arm64 | lab-baylibre | gcc-8 | defconfig+CON...OMIZE_BASE=y | 5/5 36 | meson-gxbb-p200 | arm64 | lab-baylibre | gcc-8 | defconfig | 5/5 37 | meson-gxl-s805x-libretech-ac | arm64 | lab-baylibre | gcc-8 | defconfig+CON...BIG_ENDIAN=y | 5/5 38 | meson-gxl-s805x-libretech-ac | arm64 | lab-baylibre | gcc-8 | defconfig+CON...OMIZE_BASE=y | 5/5 39 | meson-gxl-s805x-libretech-ac | arm64 | lab-baylibre | gcc-8 | defconfig | 5/5 40 | meson-gxl-s805x-p241 | arm64 | lab-baylibre | gcc-8 | defconfig+CON...BIG_ENDIAN=y | 5/5 41 | meson-gxl-s805x-p241 | arm64 | lab-baylibre | gcc-8 | defconfig+CON...OMIZE_BASE=y | 5/5 42 | meson-gxl-s805x-p241 | arm64 | lab-baylibre | gcc-8 | defconfig | 5/5 43 | meson-gxl-s905d-p230 | arm64 | lab-baylibre | gcc-8 | defconfig+CON...BIG_ENDIAN=y | 0/1 44 | meson-gxl-s905d-p230 | arm64 | lab-baylibre | gcc-8 | defconfig+CON...OMIZE_BASE=y | 5/5 45 | meson-gxl-s905d-p230 | arm64 | lab-baylibre | gcc-8 | defconfig | 5/5 46 | meson-gxl-s905x-khadas-vim | arm64 | lab-baylibre | gcc-8 | defconfig+CON...BIG_ENDIAN=y | 5/5 47 | meson-gxl-s905x-khadas-vim | arm64 | lab-baylibre | gcc-8 | defconfig+CON...OMIZE_BASE=y | 5/5 48 | meson-gxl-s905x-khadas-vim | arm64 | lab-baylibre | gcc-8 | defconfig | 1/1 49 | meson-gxl-s905x-libretech-cc | arm64 | lab-baylibre | gcc-8 | defconfig+CON...BIG_ENDIAN=y | 5/5 50 | meson-gxl-s905x-libretech-cc | arm64 | lab-baylibre | gcc-8 | defconfig+CON...OMIZE_BASE=y | 5/5 51 | meson-gxl-s905x-libretech-cc | arm64 | lab-baylibre | gcc-8 | defconfig | 5/5 52 | meson-gxl-s905x-libretech-cc | arm64 | lab-clabbe | gcc-8 | defconfig+CON...BIG_ENDIAN=y | 5/5 53 | meson-gxl-s905x-libretech-cc | arm64 | lab-clabbe | gcc-8 | defconfig+CON...OMIZE_BASE=y | 5/5 54 | meson-gxl-s905x-libretech-cc | arm64 | lab-clabbe | gcc-8 | defconfig | 5/5 55 | meson-gxm-khadas-vim2 | arm64 | lab-baylibre | gcc-8 | defconfig+CON...BIG_ENDIAN=y | 5/5 56 | meson-gxm-khadas-vim2 | arm64 | lab-baylibre | gcc-8 | defconfig+CON...OMIZE_BASE=y | 5/5 57 | meson-gxm-khadas-vim2 | arm64 | lab-baylibre | gcc-8 | defconfig | 5/5 58 | meson8b-odroidc1 | arm | lab-baylibre | gcc-8 | multi_v7_defconfig | 5/5 59 | meson8b-odroidc1 | arm | lab-baylibre | gcc-8 | multi_v7_defc...CONFIG_SMP=n | 5/5 60 | minnowboard-turbot-E3826 | x86_64 | lab-collabora | gcc-8 | x86_64_defconfig+kvm_guest | 5/5 61 | minnowboard-turbot-E3826 | x86_64 | lab-collabora | gcc-8 | x86_64_defconfig | 5/5 62 | omap4-panda | arm | lab-baylibre | gcc-8 | multi_v7_defconfig | 5/5 63 | omap4-panda | arm | lab-baylibre | gcc-8 | multi_v7_defc...CONFIG_SMP=n | 5/5 64 | omap4-panda | arm | lab-collabora | gcc-8 | multi_v7_defconfig | 5/5 65 | omap4-panda | arm | lab-collabora | gcc-8 | multi_v7_defc...CONFIG_SMP=n | 5/5 66 | ox820-clouden...lug-series-3 | arm | lab-baylibre | gcc-8 | oxnas_v6_defconfig | 5/5 67 | qemu_arm-virt-gicv2 | arm | lab-baylibre | gcc-8 | multi_v7_defconfig | 5/5 68 | qemu_arm-virt-gicv2 | arm | lab-baylibre | gcc-8 | multi_v7_defc...CONFIG_SMP=n | 5/5 69 | qemu_arm-virt-gicv2 | arm | lab-collabora | gcc-8 | multi_v7_defconfig | 1/1 70 | qemu_arm-virt-gicv2 | arm | lab-collabora | gcc-8 | multi_v7_defc...CONFIG_SMP=n | 1/1 71 | qemu_arm-virt-gicv3 | arm | lab-baylibre | gcc-8 | multi_v7_defconfig | 5/5 72 | qemu_arm-virt-gicv3 | arm | lab-baylibre | gcc-8 | multi_v7_defc...CONFIG_SMP=n | 5/5 73 | qemu_arm-virt-gicv3 | arm | lab-collabora | gcc-8 | multi_v7_defconfig | 1/1 74 | qemu_arm-virt-gicv3 | arm | lab-collabora | gcc-8 | multi_v7_defc...CONFIG_SMP=n | 1/1 75 | qemu_arm64-virt-gicv2 | arm64 | lab-baylibre | gcc-8 | defconfig+CON...OMIZE_BASE=y | 5/5 76 | qemu_arm64-virt-gicv2 | arm64 | lab-baylibre | gcc-8 | defconfig | 5/5 77 | qemu_arm64-virt-gicv2 | arm64 | lab-collabora | gcc-8 | defconfig+CON...OMIZE_BASE=y | 5/5 78 | qemu_arm64-virt-gicv2 | arm64 | lab-collabora | gcc-8 | defconfig | 5/5 79 | qemu_arm64-virt-gicv3 | arm64 | lab-baylibre | gcc-8 | defconfig+CON...OMIZE_BASE=y | 5/5 80 | qemu_arm64-virt-gicv3 | arm64 | lab-baylibre | gcc-8 | defconfig | 5/5 81 | qemu_arm64-virt-gicv3 | arm64 | lab-collabora | gcc-8 | defconfig+CON...OMIZE_BASE=y | 5/5 82 | qemu_arm64-virt-gicv3 | arm64 | lab-collabora | gcc-8 | defconfig | 5/5 83 | qemu_i386 | i386 | lab-baylibre | gcc-8 | i386_defconfig | 1/1 84 | qemu_i386 | i386 | lab-collabora | gcc-8 | i386_defconfig | 1/1 85 | qemu_x86_64 | x86_64 | lab-baylibre | gcc-8 | x86_64_defconfig+kvm_guest | 5/5 86 | qemu_x86_64 | x86_64 | lab-baylibre | gcc-8 | x86_64_defconfig | 1/1 87 | qemu_x86_64 | x86_64 | lab-collabora | gcc-8 | x86_64_defconfig+kvm_guest | 5/5 88 | qemu_x86_64 | x86_64 | lab-collabora | gcc-8 | x86_64_defconfig | 1/1 89 | r8a7795-salvator-x | arm64 | lab-baylibre | gcc-8 | defconfig+CON...BIG_ENDIAN=y | 5/5 90 | r8a7795-salvator-x | arm64 | lab-baylibre | gcc-8 | defconfig+CON...OMIZE_BASE=y | 5/5 91 | r8a7795-salvator-x | arm64 | lab-baylibre | gcc-8 | defconfig | 5/5 92 | r8a7796-m3ulcb | arm64 | lab-baylibre | gcc-8 | defconfig+CON...OMIZE_BASE=y | 5/5 93 | r8a7796-m3ulcb | arm64 | lab-baylibre | gcc-8 | defconfig | 5/5 94 | r8a7796-m3ulcb | arm64 | lab-collabora | gcc-8 | defconfig+CON...OMIZE_BASE=y | 5/5 95 | r8a7796-m3ulcb | arm64 | lab-collabora | gcc-8 | defconfig | 5/5 96 | rk3288-rock2-square | arm | lab-collabora | gcc-8 | multi_v7_defconfig | 5/5 97 | rk3288-rock2-square | arm | lab-collabora | gcc-8 | multi_v7_defc...G_ARM_LPAE=y | 5/5 98 | rk3288-rock2-square | arm | lab-collabora | gcc-8 | multi_v7_defc...CONFIG_SMP=n | 5/5 99 | rk3288-veyron-jaq | arm | lab-collabora | gcc-8 | multi_v7_defconfig | 64/65 100 | rk3288-veyron-jaq | arm | lab-collabora | gcc-8 | multi_v7_defc...G_ARM_LPAE=y | 64/65 101 | rk3288-veyron-jaq | arm | lab-collabora | gcc-8 | multi_v7_defc...CONFIG_SMP=n | 63/64 102 | rk3399-gru-kevin | arm64 | lab-collabora | gcc-8 | defconfig+CON...OMIZE_BASE=y | 81/82 103 | rk3399-gru-kevin | arm64 | lab-collabora | gcc-8 | defconfig | 0/1 104 | sun50i-a64-bananapi-m64 | arm64 | lab-clabbe | gcc-8 | defconfig+CON...OMIZE_BASE=y | 5/5 105 | sun50i-a64-bananapi-m64 | arm64 | lab-clabbe | gcc-8 | defconfig | 5/5 106 | sun50i-h5-lib...ch-all-h3-cc | arm64 | lab-baylibre | gcc-8 | defconfig+CON...OMIZE_BASE=y | 5/5 107 | sun50i-h5-lib...ch-all-h3-cc | arm64 | lab-baylibre | gcc-8 | defconfig | 5/5 108 | sun50i-h6-orangepi-one-plus | arm64 | lab-clabbe | gcc-8 | defconfig+CON...OMIZE_BASE=y | 5/5 109 | sun50i-h6-orangepi-one-plus | arm64 | lab-clabbe | gcc-8 | defconfig | 5/5 110 | sun50i-h6-pine-h64 | arm64 | lab-baylibre | gcc-8 | defconfig+CON...OMIZE_BASE=y | 5/5 111 | sun50i-h6-pine-h64 | arm64 | lab-baylibre | gcc-8 | defconfig | 5/5 112 | sun50i-h6-pine-h64 | arm64 | lab-clabbe | gcc-8 | defconfig+CON...OMIZE_BASE=y | 5/5 113 | sun50i-h6-pine-h64 | arm64 | lab-clabbe | gcc-8 | defconfig | 5/5 114 | sun5i-a13-olinuxino-micro | arm | lab-baylibre | gcc-8 | multi_v7_defconfig | 5/5 115 | sun5i-a13-olinuxino-micro | arm | lab-baylibre | gcc-8 | multi_v7_defc...CONFIG_SMP=n | 5/5 116 | sun5i-a13-olinuxino-micro | arm | lab-baylibre | gcc-8 | sunxi_defconfig | 5/5 117 | sun7i-a20-cubieboard2 | arm | lab-baylibre | gcc-8 | multi_v7_defconfig | 5/5 118 | sun7i-a20-cubieboard2 | arm | lab-clabbe | gcc-8 | multi_v7_defconfig | 5/5 119 | sun7i-a20-cubieboard2 | arm | lab-clabbe | gcc-8 | multi_v7_defc...CONFIG_SMP=n | 5/5 120 | sun7i-a20-cubieboard2 | arm | lab-baylibre | gcc-8 | sunxi_defconfig | 5/5 121 | sun7i-a20-cubieboard2 | arm | lab-clabbe | gcc-8 | sunxi_defconfig | 5/5 122 | sun8i-a33-olinuxino | arm | lab-clabbe | gcc-8 | multi_v7_defconfig | 5/5 123 | sun8i-a33-olinuxino | arm | lab-clabbe | gcc-8 | multi_v7_defc...CONFIG_SMP=n | 5/5 124 | sun8i-a33-olinuxino | arm | lab-clabbe | gcc-8 | sunxi_defconfig | 5/5 125 | sun8i-a83t-bananapi-m3 | arm | lab-clabbe | gcc-8 | multi_v7_defconfig | 5/5 126 | sun8i-a83t-bananapi-m3 | arm | lab-clabbe | gcc-8 | multi_v7_defc...CONFIG_SMP=n | 5/5 127 | sun8i-a83t-bananapi-m3 | arm | lab-clabbe | gcc-8 | sunxi_defconfig | 5/5 128 | sun8i-h2-plus...ch-all-h3-cc | arm | lab-baylibre | gcc-8 | multi_v7_defconfig | 5/5 129 | sun8i-h2-plus...ch-all-h3-cc | arm | lab-baylibre | gcc-8 | multi_v7_defc...CONFIG_SMP=n | 5/5 130 | sun8i-h2-plus...ch-all-h3-cc | arm | lab-baylibre | gcc-8 | sunxi_defconfig | 5/5 131 | sun8i-h2-plus-orangepi-r1 | arm | lab-baylibre | gcc-8 | multi_v7_defconfig | 5/5 132 | sun8i-h2-plus-orangepi-r1 | arm | lab-baylibre | gcc-8 | multi_v7_defc...CONFIG_SMP=n | 5/5 133 | sun8i-h2-plus-orangepi-r1 | arm | lab-baylibre | gcc-8 | sunxi_defconfig | 5/5 134 | sun8i-h2-plus-orangepi-zero | arm | lab-baylibre | gcc-8 | multi_v7_defconfig | 5/5 135 | sun8i-h2-plus-orangepi-zero | arm | lab-baylibre | gcc-8 | multi_v7_defc...CONFIG_SMP=n | 5/5 136 | sun8i-h2-plus-orangepi-zero | arm | lab-baylibre | gcc-8 | sunxi_defconfig | 5/5 137 | sun8i-h3-libretech-all-h3-cc | arm | lab-baylibre | gcc-8 | multi_v7_defconfig | 5/5 138 | sun8i-h3-libretech-all-h3-cc | arm | lab-baylibre | gcc-8 | multi_v7_defc...CONFIG_SMP=n | 5/5 139 | sun8i-h3-libretech-all-h3-cc | arm | lab-baylibre | gcc-8 | sunxi_defconfig | 5/5 140 | sun8i-h3-orangepi-pc | arm | lab-clabbe | gcc-8 | multi_v7_defconfig | 5/5 141 | sun8i-h3-orangepi-pc | arm | lab-clabbe | gcc-8 | multi_v7_defc...CONFIG_SMP=n | 5/5 142 | sun8i-h3-orangepi-pc | arm | lab-clabbe | gcc-8 | sunxi_defconfig | 5/5 143 | tegra124-jetson-tk1 | arm | lab-collabora | gcc-8 | multi_v7_defconfig | 5/5 144 | tegra124-jetson-tk1 | arm | lab-collabora | gcc-8 | multi_v7_defc...G_ARM_LPAE=y | 5/5 145 | tegra124-jetson-tk1 | arm | lab-collabora | gcc-8 | multi_v7_defc...CONFIG_SMP=n | 5/5 146 | tegra124-jetson-tk1 | arm | lab-collabora | gcc-8 | tegra_defconfig | 5/5 147 | tegra124-nyan-big | arm | lab-collabora | gcc-8 | multi_v7_defconfig | 5/5 148 | tegra124-nyan-big | arm | lab-collabora | gcc-8 | multi_v7_defc...G_ARM_LPAE=y | 5/5 149 | tegra124-nyan-big | arm | lab-collabora | gcc-8 | multi_v7_defc...CONFIG_SMP=n | 5/5 150 | tegra124-nyan-big | arm | lab-collabora | gcc-8 | tegra_defconfig | 5/5 Test: baseline Tree: next Branch: master Describe: next-20191114 URL:
git://git.kernel.org/pub/scm/linux/kernel/git/next/linux-next.git
SHA: 8466d23e6e677cb58e237d1f35588497b8dd5c5c Test Failures ------------- run | platform | arch | lab | compiler | defconfig | results ----+------------------------------+--------+---------------+----------+------------------------------+-------- 1 | am335x-boneblack | arm | lab-baylibre | gcc-8 | multi_v7_defconfig | 4/5 Results: 4 PASS, 1 FAIL, 0 SKIP Full config: multi_v7_defconfig Compiler: gcc-8 (arm-linux-gnueabihf-gcc (Debian 8.3.0-2) 8.3.0) Plain log:
https://storage.kernelci.org//next/master/next-20191114/arm/multi_v7_defcon…
HTML log:
https://storage.kernelci.org//next/master/next-20191114/arm/multi_v7_defcon…
Rootfs:
https://storage.kernelci.org/images/rootfs/buildroot/kci-2019.02-8-gd700ebb…
dmesg - 3 tests: 2 PASS, 1 FAIL, 0 SKIP * crit: never passed 1 lines run | platform | arch | lab | compiler | defconfig | results ----+------------------------------+--------+---------------+----------+------------------------------+-------- 2 | am335x-boneblack | arm | lab-baylibre | gcc-8 | multi_v7_defc...CONFIG_SMP=n | 4/5 Results: 4 PASS, 1 FAIL, 0 SKIP Full config: multi_v7_defconfig+CONFIG_SMP=n Compiler: gcc-8 (arm-linux-gnueabihf-gcc (Debian 8.3.0-2) 8.3.0) Plain log:
https://storage.kernelci.org//next/master/next-20191114/arm/multi_v7_defcon…
HTML log:
https://storage.kernelci.org//next/master/next-20191114/arm/multi_v7_defcon…
Rootfs:
https://storage.kernelci.org/images/rootfs/buildroot/kci-2019.02-8-gd700ebb…
dmesg - 3 tests: 2 PASS, 1 FAIL, 0 SKIP * crit: never passed 1 lines run | platform | arch | lab | compiler | defconfig | results ----+------------------------------+--------+---------------+----------+------------------------------+-------- 7 | bcm2837-rpi-3-b | arm64 | lab-baylibre | gcc-8 | defconfig+CON...OMIZE_BASE=y | 4/5 Results: 4 PASS, 1 FAIL, 0 SKIP Full config: defconfig+CONFIG_RANDOMIZE_BASE=y Compiler: gcc-8 (aarch64-linux-gnu-gcc (Debian 8.3.0-2) 8.3.0) Plain log:
https://storage.kernelci.org//next/master/next-20191114/arm64/defconfig+CON…
HTML log:
https://storage.kernelci.org//next/master/next-20191114/arm64/defconfig+CON…
Rootfs:
https://storage.kernelci.org/images/rootfs/buildroot/kci-2019.02-8-gd700ebb…
dmesg - 3 tests: 2 PASS, 1 FAIL, 0 SKIP * crit: new failure (last pass: next-20191113) 1 lines run | platform | arch | lab | compiler | defconfig | results ----+------------------------------+--------+---------------+----------+------------------------------+-------- 9 | da850-lcdk | arm | lab-baylibre | gcc-8 | davinci_all_defconfig | 4/5 Results: 4 PASS, 1 FAIL, 0 SKIP Full config: davinci_all_defconfig Compiler: gcc-8 (arm-linux-gnueabihf-gcc (Debian 8.3.0-2) 8.3.0) Plain log:
https://storage.kernelci.org//next/master/next-20191114/arm/davinci_all_def…
HTML log:
https://storage.kernelci.org//next/master/next-20191114/arm/davinci_all_def…
Rootfs:
https://storage.kernelci.org/images/rootfs/buildroot/kci-2019.02-8-gd700ebb…
dmesg - 3 tests: 2 PASS, 1 FAIL, 0 SKIP * alert: never passed 2 lines run | platform | arch | lab | compiler | defconfig | results ----+------------------------------+--------+---------------+----------+------------------------------+-------- 10 | da850-lcdk | arm | lab-baylibre | gcc-8 | multi_v5_defconfig | 4/5 Results: 4 PASS, 1 FAIL, 0 SKIP Full config: multi_v5_defconfig Compiler: gcc-8 (arm-linux-gnueabihf-gcc (Debian 8.3.0-2) 8.3.0) Plain log:
https://storage.kernelci.org//next/master/next-20191114/arm/multi_v5_defcon…
HTML log:
https://storage.kernelci.org//next/master/next-20191114/arm/multi_v5_defcon…
Rootfs:
https://storage.kernelci.org/images/rootfs/buildroot/kci-2019.02-8-gd700ebb…
dmesg - 3 tests: 2 PASS, 1 FAIL, 0 SKIP * alert: never passed 2 lines run | platform | arch | lab | compiler | defconfig | results ----+------------------------------+--------+---------------+----------+------------------------------+-------- 11 | exynos4412-odroidx2 | arm | lab-collabora | gcc-8 | exynos_defconfig | 4/5 Results: 4 PASS, 1 FAIL, 0 SKIP Full config: exynos_defconfig Compiler: gcc-8 (arm-linux-gnueabihf-gcc (Debian 8.3.0-2) 8.3.0) Plain log:
https://storage.kernelci.org//next/master/next-20191114/arm/exynos_defconfi…
HTML log:
https://storage.kernelci.org//next/master/next-20191114/arm/exynos_defconfi…
Rootfs:
https://storage.kernelci.org/images/rootfs/buildroot/kci-2019.02-8-gd700ebb…
dmesg - 3 tests: 2 PASS, 1 FAIL, 0 SKIP * alert: never passed 1 lines run | platform | arch | lab | compiler | defconfig | results ----+------------------------------+--------+---------------+----------+------------------------------+-------- 12 | exynos4412-odroidx2 | arm | lab-collabora | gcc-8 | multi_v7_defconfig | 4/5 Results: 4 PASS, 1 FAIL, 0 SKIP Full config: multi_v7_defconfig Compiler: gcc-8 (arm-linux-gnueabihf-gcc (Debian 8.3.0-2) 8.3.0) Plain log:
https://storage.kernelci.org//next/master/next-20191114/arm/multi_v7_defcon…
HTML log:
https://storage.kernelci.org//next/master/next-20191114/arm/multi_v7_defcon…
Rootfs:
https://storage.kernelci.org/images/rootfs/buildroot/kci-2019.02-8-gd700ebb…
dmesg - 3 tests: 2 PASS, 1 FAIL, 0 SKIP * alert: never passed 1 lines run | platform | arch | lab | compiler | defconfig | results ----+------------------------------+--------+---------------+----------+------------------------------+-------- 13 | exynos4412-odroidx2 | arm | lab-collabora | gcc-8 | multi_v7_defc...CONFIG_SMP=n | 4/5 Results: 4 PASS, 1 FAIL, 0 SKIP Full config: multi_v7_defconfig+CONFIG_SMP=n Compiler: gcc-8 (arm-linux-gnueabihf-gcc (Debian 8.3.0-2) 8.3.0) Plain log:
https://storage.kernelci.org//next/master/next-20191114/arm/multi_v7_defcon…
HTML log:
https://storage.kernelci.org//next/master/next-20191114/arm/multi_v7_defcon…
Rootfs:
https://storage.kernelci.org/images/rootfs/buildroot/kci-2019.02-8-gd700ebb…
dmesg - 3 tests: 2 PASS, 1 FAIL, 0 SKIP * alert: never passed 1 lines run | platform | arch | lab | compiler | defconfig | results ----+------------------------------+--------+---------------+----------+------------------------------+-------- 18 | exynos5800-peach-pi | arm | lab-collabora | gcc-8 | exynos_defconfig | 123/129 Results: 123 PASS, 6 FAIL, 0 SKIP Full config: exynos_defconfig Compiler: gcc-8 (arm-linux-gnueabihf-gcc (Debian 8.3.0-2) 8.3.0) Plain log:
https://storage.kernelci.org//next/master/next-20191114/arm/exynos_defconfi…
HTML log:
https://storage.kernelci.org//next/master/next-20191114/arm/exynos_defconfi…
Rootfs:
https://storage.kernelci.org/images/rootfs/buildroot/kci-2019.02-8-gd700ebb…
bootrr - 128 tests: 122 PASS, 6 FAIL, 0 SKIP * exynos5-subcmu-DISP-probed: never passed * exynos5-subcmu-GSC-probed: never passed * exynos5-subcmu-MFC-probed: never passed * samsung-i2s0-probed: never passed * xhci-hcd_0-probed: never passed * xhci-hcd_1-probed: never passed run | platform | arch | lab | compiler | defconfig | results ----+------------------------------+--------+---------------+----------+------------------------------+-------- 19 | exynos5800-peach-pi | arm | lab-collabora | gcc-8 | multi_v7_defconfig | 126/132 Results: 126 PASS, 6 FAIL, 0 SKIP Full config: multi_v7_defconfig Compiler: gcc-8 (arm-linux-gnueabihf-gcc (Debian 8.3.0-2) 8.3.0) Plain log:
https://storage.kernelci.org//next/master/next-20191114/arm/multi_v7_defcon…
HTML log:
https://storage.kernelci.org//next/master/next-20191114/arm/multi_v7_defcon…
Rootfs:
https://storage.kernelci.org/images/rootfs/buildroot/kci-2019.02-8-gd700ebb…
bootrr - 128 tests: 122 PASS, 6 FAIL, 0 SKIP * exynos5-subcmu-DISP-probed: never passed * exynos5-subcmu-GSC-probed: never passed * exynos5-subcmu-MFC-probed: never passed * samsung-i2s0-probed: never passed * xhci-hcd_0-probed: never passed * xhci-hcd_1-probed: never passed run | platform | arch | lab | compiler | defconfig | results ----+------------------------------+--------+---------------+----------+------------------------------+-------- 20 | exynos5800-peach-pi | arm | lab-collabora | gcc-8 | multi_v7_defc...G_ARM_LPAE=y | 126/132 Results: 126 PASS, 6 FAIL, 0 SKIP Full config: multi_v7_defconfig+CONFIG_EFI=y+CONFIG_ARM_LPAE=y Compiler: gcc-8 (arm-linux-gnueabihf-gcc (Debian 8.3.0-2) 8.3.0) Plain log:
https://storage.kernelci.org//next/master/next-20191114/arm/multi_v7_defcon…
HTML log:
https://storage.kernelci.org//next/master/next-20191114/arm/multi_v7_defcon…
Rootfs:
https://storage.kernelci.org/images/rootfs/buildroot/kci-2019.02-8-gd700ebb…
bootrr - 128 tests: 122 PASS, 6 FAIL, 0 SKIP * exynos5-subcmu-DISP-probed: never passed * exynos5-subcmu-GSC-probed: never passed * exynos5-subcmu-MFC-probed: never passed * samsung-i2s0-probed: never passed * xhci-hcd_0-probed: never passed * xhci-hcd_1-probed: never passed run | platform | arch | lab | compiler | defconfig | results ----+------------------------------+--------+---------------+----------+------------------------------+-------- 21 | exynos5800-peach-pi | arm | lab-collabora | gcc-8 | multi_v7_defc...CONFIG_SMP=n | 126/132 Results: 126 PASS, 6 FAIL, 0 SKIP Full config: multi_v7_defconfig+CONFIG_SMP=n Compiler: gcc-8 (arm-linux-gnueabihf-gcc (Debian 8.3.0-2) 8.3.0) Plain log:
https://storage.kernelci.org//next/master/next-20191114/arm/multi_v7_defcon…
HTML log:
https://storage.kernelci.org//next/master/next-20191114/arm/multi_v7_defcon…
Rootfs:
https://storage.kernelci.org/images/rootfs/buildroot/kci-2019.02-8-gd700ebb…
bootrr - 128 tests: 122 PASS, 6 FAIL, 0 SKIP * exynos5-subcmu-DISP-probed: never passed * exynos5-subcmu-GSC-probed: never passed * exynos5-subcmu-MFC-probed: never passed * samsung-i2s0-probed: never passed * xhci-hcd_0-probed: never passed * xhci-hcd_1-probed: never passed run | platform | arch | lab | compiler | defconfig | results ----+------------------------------+--------+---------------+----------+------------------------------+-------- 43 | meson-gxl-s905d-p230 | arm64 | lab-baylibre | gcc-8 | defconfig+CON...BIG_ENDIAN=y | 0/1 Results: 0 PASS, 1 FAIL, 0 SKIP Full config: defconfig+CONFIG_CPU_BIG_ENDIAN=y Compiler: gcc-8 (aarch64-linux-gnu-gcc (Debian 8.3.0-2) 8.3.0) Plain log:
https://storage.kernelci.org//next/master/next-20191114/arm64/defconfig+CON…
HTML log:
https://storage.kernelci.org//next/master/next-20191114/arm64/defconfig+CON…
Rootfs:
https://storage.kernelci.org/images/rootfs/buildroot/kci-2019.02-8-gd700ebb…
1 tests: 0 PASS, 1 FAIL, 0 SKIP * login: new failure (last pass: next-20191113) run | platform | arch | lab | compiler | defconfig | results ----+------------------------------+--------+---------------+----------+------------------------------+-------- 99 | rk3288-veyron-jaq | arm | lab-collabora | gcc-8 | multi_v7_defconfig | 64/65 Results: 64 PASS, 1 FAIL, 0 SKIP Full config: multi_v7_defconfig Compiler: gcc-8 (arm-linux-gnueabihf-gcc (Debian 8.3.0-2) 8.3.0) Plain log:
https://storage.kernelci.org//next/master/next-20191114/arm/multi_v7_defcon…
HTML log:
https://storage.kernelci.org//next/master/next-20191114/arm/multi_v7_defcon…
Rootfs:
https://storage.kernelci.org/images/rootfs/buildroot/kci-2019.02-8-gd700ebb…
bootrr - 61 tests: 60 PASS, 1 FAIL, 0 SKIP * rk3x-i2c5-probed: never passed run | platform | arch | lab | compiler | defconfig | results ----+------------------------------+--------+---------------+----------+------------------------------+-------- 100 | rk3288-veyron-jaq | arm | lab-collabora | gcc-8 | multi_v7_defc...G_ARM_LPAE=y | 64/65 Results: 64 PASS, 1 FAIL, 0 SKIP Full config: multi_v7_defconfig+CONFIG_EFI=y+CONFIG_ARM_LPAE=y Compiler: gcc-8 (arm-linux-gnueabihf-gcc (Debian 8.3.0-2) 8.3.0) Plain log:
https://storage.kernelci.org//next/master/next-20191114/arm/multi_v7_defcon…
HTML log:
https://storage.kernelci.org//next/master/next-20191114/arm/multi_v7_defcon…
Rootfs:
https://storage.kernelci.org/images/rootfs/buildroot/kci-2019.02-8-gd700ebb…
bootrr - 61 tests: 60 PASS, 1 FAIL, 0 SKIP * rk3x-i2c5-probed: never passed run | platform | arch | lab | compiler | defconfig | results ----+------------------------------+--------+---------------+----------+------------------------------+-------- 101 | rk3288-veyron-jaq | arm | lab-collabora | gcc-8 | multi_v7_defc...CONFIG_SMP=n | 63/64 Results: 63 PASS, 1 FAIL, 0 SKIP Full config: multi_v7_defconfig+CONFIG_SMP=n Compiler: gcc-8 (arm-linux-gnueabihf-gcc (Debian 8.3.0-2) 8.3.0) Plain log:
https://storage.kernelci.org//next/master/next-20191114/arm/multi_v7_defcon…
HTML log:
https://storage.kernelci.org//next/master/next-20191114/arm/multi_v7_defcon…
Rootfs:
https://storage.kernelci.org/images/rootfs/buildroot/kci-2019.02-8-gd700ebb…
bootrr - 61 tests: 60 PASS, 1 FAIL, 0 SKIP * rk3x-i2c5-probed: never passed run | platform | arch | lab | compiler | defconfig | results ----+------------------------------+--------+---------------+----------+------------------------------+-------- 102 | rk3399-gru-kevin | arm64 | lab-collabora | gcc-8 | defconfig+CON...OMIZE_BASE=y | 81/82 Results: 81 PASS, 1 FAIL, 0 SKIP Full config: defconfig+CONFIG_RANDOMIZE_BASE=y Compiler: gcc-8 (aarch64-linux-gnu-gcc (Debian 8.3.0-2) 8.3.0) Plain log:
https://storage.kernelci.org//next/master/next-20191114/arm64/defconfig+CON…
HTML log:
https://storage.kernelci.org//next/master/next-20191114/arm64/defconfig+CON…
Rootfs:
https://storage.kernelci.org/images/rootfs/buildroot/kci-2019.02-8-gd700ebb…
dmesg - 3 tests: 2 PASS, 1 FAIL, 0 SKIP * emerg: never passed 2 lines run | platform | arch | lab | compiler | defconfig | results ----+------------------------------+--------+---------------+----------+------------------------------+-------- 103 | rk3399-gru-kevin | arm64 | lab-collabora | gcc-8 | defconfig | 0/1 Results: 0 PASS, 1 FAIL, 0 SKIP Full config: defconfig Compiler: gcc-8 (aarch64-linux-gnu-gcc (Debian 8.3.0-2) 8.3.0) Plain log:
https://storage.kernelci.org//next/master/next-20191114/arm64/defconfig/gcc…
HTML log:
https://storage.kernelci.org//next/master/next-20191114/arm64/defconfig/gcc…
Rootfs:
https://storage.kernelci.org/images/rootfs/buildroot/kci-2019.02-8-gd700ebb…
1 tests: 0 PASS, 1 FAIL, 0 SKIP * login: failing since 9 days (last pass: next-20191030, first fail: next-20191105)
5 years, 6 months
1
0
0
0
next/master boot: 246 boots: 4 failed, 232 passed with 8 offline, 2 untried/unknown (next-20191114)
by kernelci.org bot
next/master boot: 246 boots: 4 failed, 232 passed with 8 offline, 2 untried/unknown (next-20191114) Full Boot Summary:
https://kernelci.org/boot/all/job/next/branch/master/kernel/next-20191114/
Full Build Summary:
https://kernelci.org/build/next/branch/master/kernel/next-20191114/
Tree: next Branch: master Git Describe: next-20191114 Git Commit: 8466d23e6e677cb58e237d1f35588497b8dd5c5c Git URL:
git://git.kernel.org/pub/scm/linux/kernel/git/next/linux-next.git
Tested: 93 unique boards, 25 SoC families, 28 builds out of 216 Boot Failures Detected: arm64: defconfig: gcc-8: meson-gxl-s805x-libretech-ac: 1 failed lab defconfig+CONFIG_RANDOMIZE_BASE=y: gcc-8: rk3399-gru-kevin: 1 failed lab defconfig+CONFIG_CPU_BIG_ENDIAN=y: gcc-8: meson-gxl-s805x-p241: 1 failed lab Offline Platforms: arm: sunxi_defconfig: gcc-8 sun5i-r8-chip: 1 offline lab sun7i-a20-bananapi: 1 offline lab multi_v7_defconfig: gcc-8 qcom-apq8064-cm-qs600: 1 offline lab sun5i-r8-chip: 1 offline lab sun7i-a20-bananapi: 1 offline lab qcom_defconfig: gcc-8 qcom-apq8064-cm-qs600: 1 offline lab arm64: defconfig: gcc-8 sun50i-a64-pine64-plus: 1 offline lab defconfig+CONFIG_RANDOMIZE_BASE=y: gcc-8 sun50i-a64-pine64-plus: 1 offline lab --- For more info write to <info(a)kernelci.org>
5 years, 6 months
1
0
0
0
thermal/testing baseline: 46 runs, 0 regressions (v5.4-rc6-32-g997a2bce5637)
by kernelci.org bot
thermal/testing baseline: 46 runs, 0 regressions (v5.4-rc6-32-g997a2bce5637) Test results summary -------------------- run | platform | arch | lab | compiler | defconfig | results ----+------------------------------+--------+---------------+----------+--------------------+-------- 1 | am335x-boneblack | arm | lab-baylibre | gcc-8 | multi_v7_defconfig | 4/5 2 | bcm2836-rpi-2-b | arm | lab-collabora | gcc-8 | multi_v7_defconfig | 5/5 3 | bcm2837-rpi-3-b | arm64 | lab-baylibre | gcc-8 | defconfig | 5/5 4 | exynos4412-odroidx2 | arm | lab-collabora | gcc-8 | multi_v7_defconfig | 4/5 5 | exynos5422-odroidxu3 | arm | lab-collabora | gcc-8 | multi_v7_defconfig | 5/5 6 | exynos5800-peach-pi | arm | lab-collabora | gcc-8 | multi_v7_defconfig | 126/132 7 | hifive-unleashed-a00 | riscv | lab-baylibre | gcc-8 | defconfig | 1/1 8 | imx6q-sabrelite | arm | lab-baylibre | gcc-8 | multi_v7_defconfig | 5/5 9 | imx6q-sabrelite | arm | lab-collabora | gcc-8 | multi_v7_defconfig | 5/5 10 | meson-g12a-u200 | arm64 | lab-baylibre | gcc-8 | defconfig | 5/5 11 | meson-g12a-x96-max | arm64 | lab-baylibre | gcc-8 | defconfig | 5/5 12 | meson-g12b-odroid-n2 | arm64 | lab-baylibre | gcc-8 | defconfig | 5/5 13 | meson-gxbb-p200 | arm64 | lab-baylibre | gcc-8 | defconfig | 5/5 14 | meson-gxl-s805x-libretech-ac | arm64 | lab-baylibre | gcc-8 | defconfig | 5/5 15 | meson-gxl-s805x-p241 | arm64 | lab-baylibre | gcc-8 | defconfig | 5/5 16 | meson-gxl-s905d-p230 | arm64 | lab-baylibre | gcc-8 | defconfig | 5/5 17 | meson-gxl-s905x-khadas-vim | arm64 | lab-baylibre | gcc-8 | defconfig | 5/5 18 | meson-gxl-s905x-libretech-cc | arm64 | lab-baylibre | gcc-8 | defconfig | 5/5 19 | meson-gxm-khadas-vim2 | arm64 | lab-baylibre | gcc-8 | defconfig | 5/5 20 | meson8b-odroidc1 | arm | lab-baylibre | gcc-8 | multi_v7_defconfig | 5/5 21 | omap4-panda | arm | lab-baylibre | gcc-8 | multi_v7_defconfig | 5/5 22 | omap4-panda | arm | lab-collabora | gcc-8 | multi_v7_defconfig | 5/5 23 | qemu_arm-virt-gicv2 | arm | lab-baylibre | gcc-8 | multi_v7_defconfig | 5/5 24 | qemu_arm-virt-gicv2 | arm | lab-collabora | gcc-8 | multi_v7_defconfig | 1/1 25 | qemu_arm-virt-gicv3 | arm | lab-baylibre | gcc-8 | multi_v7_defconfig | 5/5 26 | qemu_arm-virt-gicv3 | arm | lab-collabora | gcc-8 | multi_v7_defconfig | 1/1 27 | qemu_arm64-virt-gicv2 | arm64 | lab-baylibre | gcc-8 | defconfig | 5/5 28 | qemu_arm64-virt-gicv2 | arm64 | lab-collabora | gcc-8 | defconfig | 5/5 29 | qemu_arm64-virt-gicv3 | arm64 | lab-baylibre | gcc-8 | defconfig | 5/5 30 | qemu_arm64-virt-gicv3 | arm64 | lab-collabora | gcc-8 | defconfig | 5/5 31 | qemu_x86_64 | x86_64 | lab-baylibre | gcc-8 | x86_64_defconfig | 1/1 32 | qemu_x86_64 | x86_64 | lab-collabora | gcc-8 | x86_64_defconfig | 1/1 33 | r8a7795-salvator-x | arm64 | lab-baylibre | gcc-8 | defconfig | 5/5 34 | r8a7796-m3ulcb | arm64 | lab-baylibre | gcc-8 | defconfig | 5/5 35 | r8a7796-m3ulcb | arm64 | lab-collabora | gcc-8 | defconfig | 5/5 36 | rk3288-rock2-square | arm | lab-collabora | gcc-8 | multi_v7_defconfig | 5/5 37 | rk3399-gru-kevin | arm64 | lab-collabora | gcc-8 | defconfig | 82/82 38 | sun50i-h5-lib...ch-all-h3-cc | arm64 | lab-baylibre | gcc-8 | defconfig | 5/5 39 | sun50i-h6-pine-h64 | arm64 | lab-baylibre | gcc-8 | defconfig | 5/5 40 | sun5i-a13-olinuxino-micro | arm | lab-baylibre | gcc-8 | multi_v7_defconfig | 5/5 41 | sun7i-a20-cubieboard2 | arm | lab-baylibre | gcc-8 | multi_v7_defconfig | 5/5 42 | sun8i-h2-plus...ch-all-h3-cc | arm | lab-baylibre | gcc-8 | multi_v7_defconfig | 5/5 43 | sun8i-h2-plus-orangepi-r1 | arm | lab-baylibre | gcc-8 | multi_v7_defconfig | 5/5 44 | sun8i-h2-plus-orangepi-zero | arm | lab-baylibre | gcc-8 | multi_v7_defconfig | 5/5 45 | sun8i-h3-libretech-all-h3-cc | arm | lab-baylibre | gcc-8 | multi_v7_defconfig | 5/5 46 | tegra124-jetson-tk1 | arm | lab-collabora | gcc-8 | multi_v7_defconfig | 5/5 Test: baseline Tree: thermal Branch: testing Describe: v5.4-rc6-32-g997a2bce5637 URL:
https://git.kernel.org/pub/scm/linux/kernel/git/thermal/linux.git
SHA: 997a2bce56377454c084529dfdfb7864b777c8f6 Test Failures ------------- run | platform | arch | lab | compiler | defconfig | results ----+------------------------------+--------+---------------+----------+--------------------+-------- 1 | am335x-boneblack | arm | lab-baylibre | gcc-8 | multi_v7_defconfig | 4/5 Results: 4 PASS, 1 FAIL, 0 SKIP Full config: multi_v7_defconfig Compiler: gcc-8 (arm-linux-gnueabihf-gcc (Debian 8.3.0-2) 8.3.0) Plain log:
https://storage.kernelci.org//thermal/testing/v5.4-rc6-32-g997a2bce5637/arm…
HTML log:
https://storage.kernelci.org//thermal/testing/v5.4-rc6-32-g997a2bce5637/arm…
Rootfs:
https://storage.kernelci.org/images/rootfs/buildroot/kci-2019.02-8-gd700ebb…
dmesg - 3 tests: 2 PASS, 1 FAIL, 0 SKIP * crit: never passed 1 lines run | platform | arch | lab | compiler | defconfig | results ----+------------------------------+--------+---------------+----------+--------------------+-------- 4 | exynos4412-odroidx2 | arm | lab-collabora | gcc-8 | multi_v7_defconfig | 4/5 Results: 4 PASS, 1 FAIL, 0 SKIP Full config: multi_v7_defconfig Compiler: gcc-8 (arm-linux-gnueabihf-gcc (Debian 8.3.0-2) 8.3.0) Plain log:
https://storage.kernelci.org//thermal/testing/v5.4-rc6-32-g997a2bce5637/arm…
HTML log:
https://storage.kernelci.org//thermal/testing/v5.4-rc6-32-g997a2bce5637/arm…
Rootfs:
https://storage.kernelci.org/images/rootfs/buildroot/kci-2019.02-8-gd700ebb…
dmesg - 3 tests: 2 PASS, 1 FAIL, 0 SKIP * alert: never passed 1 lines run | platform | arch | lab | compiler | defconfig | results ----+------------------------------+--------+---------------+----------+--------------------+-------- 6 | exynos5800-peach-pi | arm | lab-collabora | gcc-8 | multi_v7_defconfig | 126/132 Results: 126 PASS, 6 FAIL, 0 SKIP Full config: multi_v7_defconfig Compiler: gcc-8 (arm-linux-gnueabihf-gcc (Debian 8.3.0-2) 8.3.0) Plain log:
https://storage.kernelci.org//thermal/testing/v5.4-rc6-32-g997a2bce5637/arm…
HTML log:
https://storage.kernelci.org//thermal/testing/v5.4-rc6-32-g997a2bce5637/arm…
Rootfs:
https://storage.kernelci.org/images/rootfs/buildroot/kci-2019.02-8-gd700ebb…
bootrr - 128 tests: 122 PASS, 6 FAIL, 0 SKIP * samsung-i2s0-probed: never passed * xhci-hcd_0-probed: never passed * xhci-hcd_1-probed: never passed * exynos5-subcmu-DISP-probed: never passed * exynos5-subcmu-GSC-probed: never passed * exynos5-subcmu-MFC-probed: never passed
5 years, 6 months
1
0
0
0
thermal/testing boot: 47 boots: 2 failed, 43 passed with 2 untried/unknown (v5.4-rc6-32-g997a2bce5637)
by kernelci.org bot
thermal/testing boot: 47 boots: 2 failed, 43 passed with 2 untried/unknown (v5.4-rc6-32-g997a2bce5637) Full Boot Summary:
https://kernelci.org/boot/all/job/thermal/branch/testing/kernel/v5.4-rc6-32…
Full Build Summary:
https://kernelci.org/build/thermal/branch/testing/kernel/v5.4-rc6-32-g997a2…
Tree: thermal Branch: testing Git Describe: v5.4-rc6-32-g997a2bce5637 Git Commit: 997a2bce56377454c084529dfdfb7864b777c8f6 Git URL:
https://git.kernel.org/pub/scm/linux/kernel/git/thermal/linux.git
Tested: 39 unique boards, 12 SoC families, 3 builds out of 6 Boot Regressions Detected: arm64: defconfig: gcc-8: meson-g12a-sei510: lab-baylibre: new failure (last pass: v5.4-rc1-26-g58681c1db070) meson-g12a-x96-max: lab-baylibre: new failure (last pass: v5.4-rc6-31-ga4e893e802e6) meson-gxl-s805x-p241: lab-baylibre: new failure (last pass: v5.4-rc1-26-g58681c1db070) r8a7795-salvator-x: lab-baylibre: new failure (last pass: v5.4-rc1-26-g474b7f317d59) Boot Failures Detected: arm64: defconfig: gcc-8: meson-g12a-sei510: 1 failed lab meson-g12a-x96-max: 1 failed lab --- For more info write to <info(a)kernelci.org>
5 years, 6 months
1
0
0
0
thermal/testing build: 6 builds: 0 failed, 6 passed, 3 warnings (v5.4-rc6-32-g997a2bce5637)
by kernelci.org bot
thermal/testing build: 6 builds: 0 failed, 6 passed, 3 warnings (v5.4-rc6-32-g997a2bce5637) Full Build Summary:
https://kernelci.org/build/thermal/branch/testing/kernel/v5.4-rc6-32-g997a2…
Tree: thermal Branch: testing Git Describe: v5.4-rc6-32-g997a2bce5637 Git Commit: 997a2bce56377454c084529dfdfb7864b777c8f6 Git URL:
https://git.kernel.org/pub/scm/linux/kernel/git/thermal/linux.git
Built: 6 unique architectures Warnings Detected: arc: nsim_hs_defconfig (gcc-8): 2 warnings arm64: arm: multi_v7_defconfig (gcc-8): 1 warning mips: riscv: x86_64: Warnings summary: 2 <stdin>:1511:2: warning: #warning syscall clone3 not implemented [-Wcpp] 1 WARNING: "return_address" [vmlinux] is a static EXPORT_SYMBOL_GPL ================================================================================ Detailed per-defconfig build reports: -------------------------------------------------------------------------------- 32r2el_defconfig (mips, gcc-8) — PASS, 0 errors, 0 warnings, 0 section mismatches -------------------------------------------------------------------------------- defconfig (riscv, gcc-8) — PASS, 0 errors, 0 warnings, 0 section mismatches -------------------------------------------------------------------------------- defconfig (arm64, gcc-8) — PASS, 0 errors, 0 warnings, 0 section mismatches -------------------------------------------------------------------------------- multi_v7_defconfig (arm, gcc-8) — PASS, 0 errors, 1 warning, 0 section mismatches Warnings: WARNING: "return_address" [vmlinux] is a static EXPORT_SYMBOL_GPL -------------------------------------------------------------------------------- nsim_hs_defconfig (arc, gcc-8) — PASS, 0 errors, 2 warnings, 0 section mismatches Warnings: <stdin>:1511:2: warning: #warning syscall clone3 not implemented [-Wcpp] <stdin>:1511:2: warning: #warning syscall clone3 not implemented [-Wcpp] -------------------------------------------------------------------------------- x86_64_defconfig (x86_64, gcc-8) — PASS, 0 errors, 0 warnings, 0 section mismatches --- For more info write to <info(a)kernelci.org>
5 years, 6 months
1
0
0
0
next 5.4.0-rc7/8466d23e6e67: regressions detected in project next on OE
by Linaro QA
Summary ------------------------------------------------------------------------ kernel: 5.4.0-rc7 git repo:
https://git.kernel.org/pub/scm/linux/kernel/git/next/linux-next.git
git branch: master git commit: 8466d23e6e677cb58e237d1f35588497b8dd5c5c git describe: next-20191114 Test details:
https://qa-reports.linaro.org/lkft/linux-next-oe/build/next-20191114
Regressions (compared to build next-20191113) ------------------------------------------------------------------------ dragonboard-410c: ltp-cve-tests: * cve-2017-1000380 i386: ltp-syscalls-tests: * settimeofday01 * settimeofday02 * stime01 * stime02 qemu_x86_64: ltp-syscalls-tests: * settimeofday01 * settimeofday02 * stime01 * stime02 qemu_arm: kselftest: * epoll_epoll_wakeup_test x86: kselftest-vsyscall-mode-none: * net_fib-onlink-tests.sh * net_so_txtime.sh ltp-syscalls-tests: * settimeofday01 * settimeofday02 * stime01 * stime02 qemu_i386: kselftest: * net_fib-onlink-tests.sh ltp-syscalls-tests: * settimeofday01 * settimeofday02 * stime01 * stime02 Fixes (compared to build next-20191113) ------------------------------------------------------------------------ i386: kselftest: * net_fib-onlink-tests.sh x86: kselftest-vsyscall-mode-native: * net_fib-onlink-tests.sh * net_so_txtime.sh Boards, architectures and test suites: ------------------------------------- dragonboard-410c - arm64 * build - pass: 1, * install-android-platform-tools-r2600 - pass: 34, * kselftest - fail: 37, pass: 13, skip: 1, * libhugetlbfs - pass: 89, skip: 1, xfail: 1 * linux-log-parser - fail: 10, pass: 26, * ltp-cap_bounds-tests - pass: 1, * ltp-commands-tests - pass: 28, skip: 14, * ltp-containers-tests - pass: 80, * ltp-cpuhotplug-tests - pass: 5, skip: 1, * ltp-cve-tests - fail: 1, pass: 28, skip: 11, * ltp-dio-tests - pass: 10, skip: 20, * ltp-fcntl-locktests-tests - pass: 1, * ltp-filecaps-tests - pass: 1, * ltp-fs-tests - pass: 59, skip: 7, xfail: 1 * ltp-fs_bind-tests - pass: 1, * ltp-fs_perms_simple-tests - pass: 18, * ltp-fsx-tests - pass: 1, * ltp-hugetlb-tests - pass: 19, skip: 2, * ltp-io-tests - pass: 2, * ltp-ipc-tests - pass: 8, * ltp-math-tests - pass: 10, * ltp-mm-tests - pass: 54, skip: 19, xfail: 1 * ltp-nptl-tests - pass: 1, * ltp-pty-tests - pass: 4, * ltp-sched-tests - pass: 10, * ltp-securebits-tests - pass: 3, * ltp-syscalls-tests - fail: 1, pass: 1094, skip: 152, xfail: 3 * spectre-meltdown-checker-test - pass: 12, * v4l2-compliance - pass: 43, xfail: 2 hi6220-hikey - arm64 * build - pass: 1, * install-android-platform-tools-r2600 - pass: 18, * linux-log-parser - pass: 38, * ltp-containers-tests - pass: 80, * ltp-cve-tests - pass: 29, skip: 11, * ltp-hugetlb-tests - pass: 20, skip: 1, * ltp-sched-tests - pass: 6, skip: 4, * ltp-syscalls-tests - fail: 1, pass: 1095, skip: 151, xfail: 3 * network-basic-tests - pass: 10, skip: 1, * spectre-meltdown-checker-test - pass: 12, i386 * build - pass: 1, * kselftest - fail: 76, pass: 111, skip: 18, * libhugetlbfs - pass: 1, * linux-log-parser - fail: 19, pass: 21, * ltp-cap_bounds-tests - pass: 1, * ltp-commands-tests - pass: 28, skip: 14, * ltp-containers-tests - pass: 80, * ltp-cpuhotplug-tests - pass: 5, skip: 1, * ltp-cve-tests - fail: 1, pass: 30, skip: 6, xfail: 3 * ltp-dio-tests - pass: 19, skip: 11, * ltp-fcntl-locktests-tests - pass: 1, * ltp-filecaps-tests - pass: 1, * ltp-fs-tests - pass: 62, skip: 5, * ltp-fs_bind-tests - pass: 1, * ltp-fs_perms_simple-tests - pass: 18, * ltp-fsx-tests - pass: 1, * ltp-hugetlb-tests - pass: 19, skip: 2, * ltp-io-tests - pass: 2, * ltp-ipc-tests - pass: 8, * ltp-math-tests - pass: 10, * ltp-mm-tests - pass: 50, skip: 22, xfail: 2 * ltp-nptl-tests - pass: 1, * ltp-open-posix-tests - pass: 1694, skip: 41, xfail: 4 * ltp-pty-tests - pass: 4, * ltp-sched-tests - pass: 6, skip: 4, * ltp-securebits-tests - pass: 3, * ltp-syscalls-tests - fail: 5, pass: 1164, skip: 79, xfail: 1 * network-basic-tests - pass: 10, skip: 1, * spectre-meltdown-checker-test - fail: 4, pass: 3, xfail: 5 * v4l2-compliance - pass: 41, xfail: 2 juno-r2 - arm64 * build - pass: 1, * linux-log-parser - pass: 42, qemu_arm * kselftest - fail: 83, pass: 83, skip: 18, * libhugetlbfs - pass: 87, skip: 1, * linux-log-parser - fail: 17, pass: 17, * ltp-cap_bounds-tests - pass: 1, * ltp-commands-tests - pass: 28, skip: 14, * ltp-containers-tests - pass: 80, * ltp-cpuhotplug-tests - pass: 5, skip: 1, * ltp-cve-tests - fail: 1, pass: 30, skip: 9, * ltp-dio-tests - pass: 18, skip: 11, xfail: 1 * ltp-fcntl-locktests-tests - pass: 1, * ltp-filecaps-tests - pass: 1, * ltp-fs-tests - pass: 60, skip: 7, * ltp-fs_bind-tests - pass: 1, * ltp-fs_perms_simple-tests - pass: 18, * ltp-fsx-tests - pass: 1, * ltp-hugetlb-tests - pass: 20, skip: 1, * ltp-io-tests - pass: 1, xfail: 1 * ltp-ipc-tests - pass: 8, * ltp-math-tests - pass: 10, * ltp-mm-tests - pass: 52, skip: 22, xfail: 1 * ltp-nptl-tests - pass: 1, * ltp-pty-tests - pass: 4, * ltp-sched-tests - pass: 4, skip: 6, * ltp-securebits-tests - pass: 3, * ltp-syscalls-tests - fail: 1, pass: 1138, skip: 110, xfail: 1 * spectre-meltdown-checker-test - pass: 12, * v4l2-compliance - pass: 43, xfail: 2 qemu_arm64 * kselftest - fail: 98, pass: 84, skip: 18, * libhugetlbfs - pass: 90, skip: 1, * linux-log-parser - pass: 34, * ltp-cap_bounds-tests - pass: 1, * ltp-commands-tests - pass: 28, skip: 14, * ltp-containers-tests - pass: 80, * ltp-cpuhotplug-tests - pass: 5, skip: 1, * ltp-cve-tests - pass: 29, skip: 11, * ltp-dio-tests - pass: 19, skip: 11, * ltp-fcntl-locktests-tests - pass: 1, * ltp-filecaps-tests - pass: 1, * ltp-fs-tests - pass: 59, skip: 7, xfail: 1 * ltp-fs_bind-tests - pass: 1, * ltp-fs_perms_simple-tests - pass: 18, * ltp-fsx-tests - pass: 1, * ltp-hugetlb-tests - pass: 21, * ltp-io-tests - pass: 1, xfail: 1 * ltp-ipc-tests - pass: 8, * ltp-math-tests - pass: 10, * ltp-mm-tests - pass: 56, skip: 18, xfail: 1 * ltp-nptl-tests - pass: 1, * ltp-pty-tests - pass: 4, * ltp-sched-tests - pass: 4, skip: 6, * ltp-securebits-tests - pass: 3, * ltp-syscalls-tests - fail: 3, pass: 1080, skip: 165, xfail: 2 * spectre-meltdown-checker-test - pass: 12, * v4l2-compliance - pass: 43, xfail: 2 qemu_i386 * kselftest - fail: 81, pass: 111, skip: 19, * libhugetlbfs - pass: 87, skip: 1, * linux-log-parser - fail: 17, pass: 17, * ltp-cap_bounds-tests - pass: 1, * ltp-commands-tests - pass: 28, skip: 14, * ltp-containers-tests - pass: 80, * ltp-cpuhotplug-tests - pass: 5, skip: 1, * ltp-cve-tests - fail: 1, pass: 31, skip: 6, xfail: 2 * ltp-dio-tests - pass: 19, skip: 11, * ltp-fcntl-locktests-tests - pass: 1, * ltp-filecaps-tests - pass: 1, * ltp-fs-tests - pass: 62, skip: 5, * ltp-fs_bind-tests - pass: 1, * ltp-fs_perms_simple-tests - pass: 18, * ltp-fsx-tests - pass: 1, * ltp-hugetlb-tests - pass: 20, skip: 1, * ltp-io-tests - pass: 1, xfail: 1 * ltp-ipc-tests - pass: 8, * ltp-math-tests - pass: 10, * ltp-mm-tests - pass: 51, skip: 23, xfail: 1 * ltp-nptl-tests - pass: 1, * ltp-pty-tests - pass: 4, * ltp-sched-tests - pass: 10, * ltp-securebits-tests - pass: 3, * ltp-syscalls-tests - fail: 6, pass: 1140, skip: 104, * spectre-meltdown-checker-test - pass: 12, * v4l2-compliance - pass: 42, xfail: 2 qemu_x86_64 * kselftest - fail: 67, pass: 119, skip: 17, * libhugetlbfs - pass: 90, skip: 1, * linux-log-parser - fail: 2, pass: 32, * ltp-cap_bounds-tests - pass: 1, * ltp-commands-tests - pass: 28, skip: 14, * ltp-containers-tests - pass: 80, * ltp-cpuhotplug-tests - pass: 5, skip: 1, * ltp-dio-tests - pass: 19, skip: 11, * ltp-fcntl-locktests-tests - pass: 1, * ltp-filecaps-tests - pass: 1, * ltp-fs-tests - pass: 62, skip: 5, * ltp-fs_bind-tests - pass: 1, * ltp-fs_perms_simple-tests - pass: 18, * ltp-fsx-tests - pass: 1, * ltp-hugetlb-tests - pass: 21, * ltp-io-tests - pass: 1, xfail: 1 * ltp-ipc-tests - pass: 8, * ltp-math-tests - pass: 10, * ltp-mm-tests - pass: 56, skip: 18, xfail: 1 * ltp-nptl-tests - pass: 1, * ltp-pty-tests - pass: 4, * ltp-sched-tests - pass: 10, * ltp-securebits-tests - pass: 3, * ltp-syscalls-tests - fail: 5, pass: 1071, skip: 174, * v4l2-compliance - pass: 42, xfail: 2 x15 - arm * build - pass: 1, * install-android-platform-tools-r2600 - pass: 40, * kselftest - fail: 26, pass: 9, skip: 1, * libhugetlbfs - pass: 87, skip: 1, * linux-log-parser - fail: 20, pass: 22, * ltp-cap_bounds-tests - pass: 1, * ltp-commands-tests - pass: 28, skip: 14, * ltp-containers-tests - pass: 80, * ltp-cve-tests - fail: 1, pass: 30, skip: 9, * ltp-dio-tests - pass: 19, skip: 11, * ltp-filecaps-tests - pass: 1, * ltp-fs-tests - pass: 60, skip: 7, * ltp-fs_bind-tests - pass: 1, * ltp-fs_perms_simple-tests - pass: 18, * ltp-fsx-tests - pass: 1, * ltp-hugetlb-tests - pass: 19, skip: 2, * ltp-io-tests - pass: 2, * ltp-ipc-tests - pass: 8, * ltp-math-tests - pass: 10, * ltp-mm-tests - pass: 51, skip: 22, xfail: 2 * ltp-nptl-tests - pass: 1, * ltp-open-posix-tests - pass: 1694, skip: 41, xfail: 4 * ltp-pty-tests - pass: 4, * ltp-sched-tests - pass: 10, * ltp-securebits-tests - pass: 3, * ltp-syscalls-tests - fail: 1, pass: 1154, skip: 94, xfail: 1 * network-basic-tests - pass: 10, skip: 1, * spectre-meltdown-checker-test - pass: 10, xfail: 2 * v4l2-compliance - pass: 43, xfail: 2 x86_64 * build - pass: 1, * kselftest - fail: 70, pass: 122, skip: 13, * kselftest-vsyscall-mode-native - fail: 70, pass: 119, skip: 11, * kselftest-vsyscall-mode-none - fail: 71, pass: 117, skip: 13, * kvm-unit-tests - fail: 1, pass: 44, skip: 10, * libhugetlbfs - pass: 90, skip: 1, * linux-log-parser - fail: 2, pass: 46, * ltp-cap_bounds-tests - pass: 1, * ltp-commands-tests - pass: 28, skip: 14, * ltp-containers-tests - pass: 80, * ltp-cpuhotplug-tests - pass: 5, skip: 1, * ltp-dio-tests - pass: 18, skip: 11, * ltp-fcntl-locktests-tests - pass: 1, * ltp-filecaps-tests - pass: 1, * ltp-fs-tests - pass: 62, skip: 5, * ltp-fs_bind-tests - pass: 1, * ltp-fs_perms_simple-tests - pass: 18, * ltp-fsx-tests - pass: 1, * ltp-hugetlb-tests - pass: 21, * ltp-io-tests - pass: 2, * ltp-ipc-tests - pass: 8, * ltp-math-tests - pass: 10, * ltp-mm-tests - pass: 56, skip: 18, xfail: 1 * ltp-nptl-tests - pass: 1, * ltp-open-posix-tests - pass: 1693, skip: 42, xfail: 4 * ltp-pty-tests - pass: 4, * ltp-sched-tests - pass: 6, skip: 4, * ltp-securebits-tests - pass: 3, * ltp-syscalls-tests - fail: 4, pass: 1102, skip: 143, xfail: 1 * network-basic-tests - pass: 10, skip: 1, * ssuite - fail: 48, * v4l2-compliance - pass: 42, xfail: 2 -- Linaro QA
https://qa-reports.linaro.org
5 years, 6 months
1
0
0
0
next/master build: 216 builds: 2 failed, 214 passed, 5 errors, 493 warnings (next-20191114)
by kernelci.org bot
next/master build: 216 builds: 2 failed, 214 passed, 5 errors, 493 warnings (next-20191114) Full Build Summary:
https://kernelci.org/build/next/branch/master/kernel/next-20191114/
Tree: next Branch: master Git Describe: next-20191114 Git Commit: 8466d23e6e677cb58e237d1f35588497b8dd5c5c Git URL:
git://git.kernel.org/pub/scm/linux/kernel/git/next/linux-next.git
Built: 7 unique architectures Build Failures Detected: arm: pxa_defconfig: (gcc-8) FAIL mips: cavium_octeon_defconfig: (gcc-8) FAIL Errors and Warnings Detected: arc: allnoconfig (gcc-8): 1 warning axs103_defconfig (gcc-8): 3 warnings axs103_smp_defconfig (gcc-8): 3 warnings haps_hs_defconfig (gcc-8): 2 warnings haps_hs_smp_defconfig (gcc-8): 2 warnings hsdk_defconfig (gcc-8): 3 warnings nsimosci_hs_defconfig (gcc-8): 2 warnings nsimosci_hs_smp_defconfig (gcc-8): 2 warnings tinyconfig (gcc-8): 1 warning vdk_hs38_defconfig (gcc-8): 2 warnings vdk_hs38_smp_defconfig (gcc-8): 2 warnings arm64: allmodconfig (clang-8): 57 warnings allmodconfig (gcc-8): 2 warnings defconfig (gcc-8): 29 warnings arm: allmodconfig (gcc-8): 21 warnings am200epdkit_defconfig (gcc-8): 1 warning aspeed_g4_defconfig (gcc-8): 1 warning aspeed_g5_defconfig (gcc-8): 1 warning at91_dt_defconfig (gcc-8): 3 warnings axm55xx_defconfig (gcc-8): 2 warnings badge4_defconfig (gcc-8): 1 warning bcm2835_defconfig (gcc-8): 1 warning cerfcube_defconfig (gcc-8): 1 warning cm_x2xx_defconfig (gcc-8): 2 warnings cm_x300_defconfig (gcc-8): 3 warnings cns3420vb_defconfig (gcc-8): 1 warning colibri_pxa270_defconfig (gcc-8): 1 warning colibri_pxa300_defconfig (gcc-8): 2 warnings davinci_all_defconfig (gcc-8): 3 warnings dove_defconfig (gcc-8): 2 warnings em_x270_defconfig (gcc-8): 2 warnings ep93xx_defconfig (gcc-8): 2 warnings eseries_pxa_defconfig (gcc-8): 2 warnings exynos_defconfig (gcc-8): 2 warnings ezx_defconfig (gcc-8): 2 warnings h5000_defconfig (gcc-8): 1 warning hisi_defconfig (gcc-8): 1 warning imote2_defconfig (gcc-8): 2 warnings imx_v4_v5_defconfig (gcc-8): 3 warnings imx_v6_v7_defconfig (gcc-8): 2 warnings integrator_defconfig (gcc-8): 1 warning iop32x_defconfig (gcc-8): 1 warning ixp4xx_defconfig (gcc-8): 2 warnings keystone_defconfig (gcc-8): 3 warnings lart_defconfig (gcc-8): 1 warning lpc32xx_defconfig (gcc-8): 2 warnings magician_defconfig (gcc-8): 1 warning milbeaut_m10v_defconfig (gcc-8): 2 warnings mini2440_defconfig (gcc-8): 2 warnings mmp2_defconfig (gcc-8): 2 warnings moxart_defconfig (gcc-8): 1 warning multi_v5_defconfig (gcc-8): 3 warnings multi_v7_defconfig (gcc-8): 3 warnings multi_v7_defconfig (gcc-8): 3 warnings multi_v7_defconfig (gcc-8): 3 warnings multi_v7_defconfig (gcc-8): 3 warnings multi_v7_defconfig (gcc-8): 32 warnings mv78xx0_defconfig (gcc-8): 2 warnings mvebu_v5_defconfig (gcc-8): 2 warnings mvebu_v7_defconfig (gcc-8): 3 warnings mxs_defconfig (gcc-8): 3 warnings nhk8815_defconfig (gcc-8): 2 warnings omap1_defconfig (gcc-8): 2 warnings omap2plus_defconfig (gcc-8): 2 warnings orion5x_defconfig (gcc-8): 2 warnings oxnas_v6_defconfig (gcc-8): 3 warnings palmz72_defconfig (gcc-8): 2 warnings pcm027_defconfig (gcc-8): 2 warnings pleb_defconfig (gcc-8): 1 warning prima2_defconfig (gcc-8): 1 warning pxa168_defconfig (gcc-8): 1 warning pxa3xx_defconfig (gcc-8): 1 warning pxa910_defconfig (gcc-8): 1 warning pxa_defconfig (gcc-8): 1 error qcom_defconfig (gcc-8): 2 warnings realview_defconfig (gcc-8): 1 warning rpc_defconfig (gcc-8): 1 warning s3c2410_defconfig (gcc-8): 1 warning s3c6400_defconfig (gcc-8): 2 warnings s5pv210_defconfig (gcc-8): 2 warnings sama5_defconfig (gcc-8): 3 warnings simpad_defconfig (gcc-8): 1 warning socfpga_defconfig (gcc-8): 1 warning spear13xx_defconfig (gcc-8): 2 warnings spear3xx_defconfig (gcc-8): 1 warning spear6xx_defconfig (gcc-8): 1 warning spitz_defconfig (gcc-8): 1 warning stm32_defconfig (gcc-8): 1 warning sunxi_defconfig (gcc-8): 2 warnings tango4_defconfig (gcc-8): 2 warnings tegra_defconfig (gcc-8): 2 warnings trizeps4_defconfig (gcc-8): 2 warnings u300_defconfig (gcc-8): 1 warning u8500_defconfig (gcc-8): 2 warnings versatile_defconfig (gcc-8): 1 warning vexpress_defconfig (gcc-8): 3 warnings vf610m4_defconfig (gcc-8): 1 warning viper_defconfig (gcc-8): 2 warnings vt8500_v6_v7_defconfig (gcc-8): 1 warning xcep_defconfig (gcc-8): 1 warning zeus_defconfig (gcc-8): 2 warnings zx_defconfig (gcc-8): 1 warning i386: i386_defconfig (gcc-8): 30 warnings mips: 32r2el_defconfig (gcc-8): 2 warnings 32r2el_defconfig (gcc-8): 32 warnings bmips_be_defconfig (gcc-8): 1 warning bmips_stb_defconfig (gcc-8): 1 warning capcella_defconfig (gcc-8): 1 warning cavium_octeon_defconfig (gcc-8): 4 errors, 4 warnings ci20_defconfig (gcc-8): 2 warnings cobalt_defconfig (gcc-8): 1 warning db1xxx_defconfig (gcc-8): 1 warning decstation_64_defconfig (gcc-8): 1 warning decstation_defconfig (gcc-8): 1 warning decstation_r4k_defconfig (gcc-8): 1 warning e55_defconfig (gcc-8): 1 warning fuloong2e_defconfig (gcc-8): 1 warning ip27_defconfig (gcc-8): 1 warning jazz_defconfig (gcc-8): 1 warning lasat_defconfig (gcc-8): 1 warning loongson1b_defconfig (gcc-8): 2 warnings loongson1c_defconfig (gcc-8): 2 warnings malta_defconfig (gcc-8): 1 warning malta_kvm_defconfig (gcc-8): 1 warning malta_kvm_guest_defconfig (gcc-8): 1 warning malta_qemu_32r6_defconfig (gcc-8): 1 warning maltaup_xpa_defconfig (gcc-8): 1 warning markeins_defconfig (gcc-8): 1 warning mips_paravirt_defconfig (gcc-8): 1 warning nlm_xlp_defconfig (gcc-8): 1 warning nlm_xlr_defconfig (gcc-8): 1 warning pic32mzda_defconfig (gcc-8): 1 warning pistachio_defconfig (gcc-8): 2 warnings qi_lb60_defconfig (gcc-8): 2 warnings rbtx49xx_defconfig (gcc-8): 1 warning rm200_defconfig (gcc-8): 1 warning tb0219_defconfig (gcc-8): 1 warning tb0287_defconfig (gcc-8): 1 warning workpad_defconfig (gcc-8): 1 warning riscv: defconfig (gcc-8): 1 warning defconfig (gcc-8): 30 warnings rv32_defconfig (gcc-8): 7 warnings x86_64: allmodconfig (gcc-8): 5 warnings tinyconfig (gcc-8): 1 warning x86_64_defconfig (gcc-8): 29 warnings Errors summary: 1 drivers/staging/octeon/ethernet.c:516:29: error: type of formal parameter 2 is incomplete 1 drivers/staging/octeon/ethernet.c:499:30: error: storage size of 'link_info' isn't known 1 drivers/staging/octeon/ethernet.c:463:30: error: storage size of 'link_info' isn't known 1 drivers/staging/octeon/ethernet.c:177:21: error: dereferencing pointer to incomplete type 'struct cvmx_wqe' 1 arch/arm/mach-pxa/icontrol.c:92:23: error: 'mcp251x_info' undeclared here (not in a function); did you mean 'mcp251x_board_info'? Warnings summary: 104 fs/ext4/super.c:2068:23: warning: unused variable 'sbi' [-Wunused-variable] 64 WARNING: "return_address" [vmlinux] is a static EXPORT_SYMBOL_GPL 36 drivers/mtd/ubi/debug.c:512:6: warning: unused variable 'err' [-Wunused-variable] 20 <stdin>:1511:2: warning: #warning syscall clone3 not implemented [-Wcpp] 16 1 warning generated. 9 drivers/net/phy/mdio-cavium.h:113:48: warning: cast to pointer from integer of different size [-Wint-to-pointer-cast] 5 fs/btrfs/tree-checker.c:230:43: warning: format '%lu' expects argument of type 'long unsigned int', but argument 5 has type 'unsigned int' [-Wformat=] 5 2 warnings generated. 4 drivers/net/phy/mdio-cavium.h:114:37: warning: cast to pointer from integer of different size [-Wint-to-pointer-cast] 2 net/netfilter/nf_flow_table_offload.c:80:21: warning: unsigned conversion from 'int' to '__be16' {aka 'short unsigned int'} changes value from '327680' to '0' [-Woverflow] 2 <stdin>:830:2: warning: #warning syscall fstat64 not implemented [-Wcpp] 2 <stdin>:1127:2: warning: #warning syscall fstatat64 not implemented [-Wcpp] 2 3 warnings generated. 1 {standard input}:134: Warning: macro instruction expanded into multiple instructions 1 warning: same module names found: 1 sound/soc/txx9/txx9aclc.c:54:30: warning: unused variable 'rtd' [-Wunused-variable] 1 security/integrity/platform_certs/load_uefi.c:17:19: warning: 'efi_cert_sha256_guid' defined but not used [-Wunused-variable] 1 security/integrity/platform_certs/load_uefi.c:15:19: warning: 'efi_cert_x509_sha256_guid' defined but not used [-Wunused-variable] 1 security/integrity/platform_certs/load_uefi.c:14:19: warning: 'efi_cert_x509_guid' defined but not used [-Wunused-variable] 1 net/nfc/hci/llc_shdlc.c:687:34: warning: variable 'connect_wq' is uninitialized when used within its own initialization [-Wuninitialized] 1 net/nfc/hci/command.c:59:34: warning: variable 'ew_wq' is uninitialized when used within its own initialization [-Wuninitialized] 1 net/netfilter/nf_flow_table_offload.c:80:34: warning: implicit conversion from 'int' to '__be16' (aka 'unsigned short') changes value from 327680 to 0 [-Wconstant-conversion] 1 net/netfilter/nf_flow_table_offload.c:290:2: warning: variable 'offset' is used uninitialized whenever switch default is taken [-Wsometimes-uninitialized] 1 net/netfilter/nf_flow_table_offload.c:279:12: note: initialize the variable 'offset' to silence this warning 1 net/netfilter/nf_flow_table_offload.c:264:2: warning: variable 'offset' is used uninitialized whenever switch default is taken [-Wsometimes-uninitialized] 1 net/netfilter/nf_flow_table_offload.c:253:12: note: initialize the variable 'offset' to silence this warning 1 mm/shmem.c:2737:35: warning: variable 'shmem_falloc_waitq' is uninitialized when used within its own initialization [-Wuninitialized] 1 lib/cpumask.c:302:1: warning: the frame size of 5280 bytes is larger than 2048 bytes [-Wframe-larger-than=] 1 include/linux/kern_levels.h:5:18: warning: format '%ld' expects argument of type 'long int', but argument 5 has type 'size_t' {aka 'unsigned int'} [-Wformat=] 1 fs/proc/proc_sysctl.c:705:35: warning: variable 'wq' is uninitialized when used within its own initialization [-Wuninitialized] 1 fs/proc/base.c:1894:35: warning: variable 'wq' is uninitialized when used within its own initialization [-Wuninitialized] 1 fs/nfs/dir.c:448:34: warning: variable 'wq' is uninitialized when used within its own initialization [-Wuninitialized] 1 fs/nfs/dir.c:1499:34: warning: variable 'wq' is uninitialized when used within its own initialization [-Wuninitialized] 1 fs/namei.c:3132:34: warning: variable 'wq' is uninitialized when used within its own initialization [-Wuninitialized] 1 fs/namei.c:1644:34: warning: variable 'wq' is uninitialized when used within its own initialization [-Wuninitialized] 1 fs/fuse/readdir.c:161:34: warning: variable 'wq' is uninitialized when used within its own initialization [-Wuninitialized] 1 fs/cifs/readdir.c:83:34: warning: variable 'wq' is uninitialized when used within its own initialization [-Wuninitialized] 1 fs/afs/dir_silly.c:205:34: warning: variable 'wq' is uninitialized when used within its own initialization [-Wuninitialized] 1 drivers/staging/octeon/octeon-ethernet.h:94:12: warning: 'union cvmx_helper_link_info' declared inside parameter list will not be visible outside of this definition or declaration 1 drivers/staging/octeon/ethernet.c:499:30: warning: unused variable 'link_info' [-Wunused-variable] 1 drivers/staging/octeon/ethernet.c:463:30: warning: unused variable 'link_info' [-Wunused-variable] 1 drivers/scsi/lpfc/lpfc_sli.c:11909:34: warning: variable 'done_q' is uninitialized when used within its own initialization [-Wuninitialized] 1 drivers/scsi/lpfc/lpfc_scsi.c:4726:34: warning: variable 'waitq' is uninitialized when used within its own initialization [-Wuninitialized] 1 drivers/scsi/bfa/bfad_im.c:378:34: warning: variable 'wq' is uninitialized when used within its own initialization [-Wuninitialized] 1 drivers/scsi/bfa/bfad_im.c:301:34: warning: variable 'wq' is uninitialized when used within its own initialization [-Wuninitialized] 1 drivers/net/usb/lan78xx.c:2665:34: warning: variable 'unlink_wakeup' is uninitialized when used within its own initialization [-Wuninitialized] 1 drivers/net/phy/mdio-octeon.c:48:3: warning: cast from pointer to integer of different size [-Wpointer-to-int-cast] 1 drivers/misc/mic/vop/vop_vringh.c:399:34: warning: variable 'wake' is uninitialized when used within its own initialization [-Wuninitialized] 1 drivers/misc/mic/vop/vop_vringh.c:155:34: warning: variable 'wake' is uninitialized when used within its own initialization [-Wuninitialized] 1 drivers/gpu/host1x/syncpt.c:208:34: warning: variable 'wq' is uninitialized when used within its own initialization [-Wuninitialized] 1 drivers/gpu/drm/amd/amdgpu/../display/dc/bios/command_table2.c:303:53: warning: suggest braces around initialization of subobject [-Wmissing-braces] 1 drivers/gpu/drm/amd/amdgpu/../display/dc/bios/command_table2.c:112:62: warning: suggest braces around initialization of subobject [-Wmissing-braces] 1 drivers/gpu/drm/amd/amdgpu/../display/dc/bios/bios_parser2.c:297:41: warning: suggest braces around initialization of subobject [-Wmissing-braces] 1 drivers/bus/fsl-mc/fsl-mc-bus.c:720:37: warning: suggest braces around initialization of subobject [-Wmissing-braces] 1 drivers/bus/fsl-mc/fsl-mc-bus.c:719:37: warning: suggest braces around initialization of subobject [-Wmissing-braces] 1 drivers/bus/fsl-mc/fsl-mc-bus.c:718:43: warning: suggest braces around initialization of subobject [-Wmissing-braces] 1 drivers/bluetooth/bluecard_cs.c:282:36: warning: variable 'wq' is uninitialized when used within its own initialization [-Wuninitialized] 1 drivers/android/binderfs.c:657:41: warning: suggest braces around initialization of subobject [-Wmissing-braces] 1 /tmp/ccjYtX2y.s:18191: Warning: using r15 results in unpredictable behaviour 1 /tmp/ccjYtX2y.s:18119: Warning: using r15 results in unpredictable behaviour 1 .config:1169:warning: override: UNWINDER_GUESS changes choice state 1 ./.tmp.config.pR1cKPLo28:3385:warning: override: reassigning to symbol USER_NS 1 ./.tmp.config.pR1cKPLo28:3368:warning: override: reassigning to symbol ANDROID 1 ./.tmp.config.pR1cKPLo28:3367:warning: override: reassigning to symbol STAGING 1 ./.tmp.config.pR1cKPLo28:3363:warning: override: reassigning to symbol SECURITYFS 1 ./.tmp.config.pR1cKPLo28:3343:warning: override: reassigning to symbol IPV6_GRE 1 ./.tmp.config.pR1cKPLo28:3337:warning: override: reassigning to symbol NET_CLS_FLOWER 1 ./.tmp.config.pR1cKPLo28:3328:warning: override: reassigning to symbol IPV6 1 ./.tmp.config.pR1cKPLo28:3326:warning: override: reassigning to symbol NET_SCH_INGRESS 1 ./.tmp.config.pR1cKPLo28:3325:warning: override: reassigning to symbol NET_SCHED 1 ./.tmp.config.pR1cKPLo28:3324:warning: override: reassigning to symbol NET_CLS_ACT 1 ./.tmp.config.pR1cKPLo28:3322:warning: override: reassigning to symbol CGROUP_BPF 1 ./.tmp.config.pR1cKPLo28:3321:warning: override: reassigning to symbol TEST_BPF 1 ./.tmp.config.pR1cKPLo28:3318:warning: override: reassigning to symbol BPF_SYSCALL 1 ./.tmp.config.pR1cKPLo28:3311:warning: override: reassigning to symbol ANDROID 1 ./.tmp.config.pR1cKPLo28:3301:warning: override: reassigning to symbol NOTIFIER_ERROR_INJECTION 1 ./.tmp.config.pR1cKPLo28:3290:warning: override: reassigning to symbol USER_NS 1 ./.tmp.config.pR1cKPLo28:3182:warning: override: reassigning to symbol NET_NS 1 ./.tmp.config.pR1cKPLo28:3178:warning: override: reassigning to symbol USER_NS 1 ./.tmp.config.pR1cKPLo28:3152:warning: override: reassigning to symbol NET_ACT_GACT 1 ./.tmp.config.pR1cKPLo28:3131:warning: override: reassigning to symbol NET_SCH_INGRESS 1 ./.tmp.config.pR1cKPLo28:3123:warning: override: reassigning to symbol NF_NAT 1 ./.tmp.config.pR1cKPLo28:3119:warning: override: reassigning to symbol NF_CONNTRACK 1 ./.tmp.config.pR1cKPLo28:3064:warning: override: reassigning to symbol VLAN_8021Q 1 ./.tmp.config.pR1cKPLo28:3063:warning: override: reassigning to symbol BRIDGE 1 ./.tmp.config.pR1cKPLo28:3059:warning: override: reassigning to symbol VETH 1 ./.tmp.config.pR1cKPLo28:3058:warning: override: reassigning to symbol IPV6_MULTIPLE_TABLES 1 ./.tmp.config.pR1cKPLo28:3056:warning: override: reassigning to symbol NET_L3_MASTER_DEV 1 ./.tmp.config.pR1cKPLo28:3055:warning: override: reassigning to symbol NET_VRF 1 ./.tmp.config.pR1cKPLo28:3052:warning: override: reassigning to symbol BPF_SYSCALL 1 ./.tmp.config.hScPJ1bbf8:4007:warning: override: reassigning to symbol USER_NS 1 ./.tmp.config.hScPJ1bbf8:3990:warning: override: reassigning to symbol ANDROID 1 ./.tmp.config.hScPJ1bbf8:3989:warning: override: reassigning to symbol STAGING 1 ./.tmp.config.hScPJ1bbf8:3985:warning: override: reassigning to symbol SECURITYFS 1 ./.tmp.config.hScPJ1bbf8:3965:warning: override: reassigning to symbol IPV6_GRE 1 ./.tmp.config.hScPJ1bbf8:3959:warning: override: reassigning to symbol NET_CLS_FLOWER 1 ./.tmp.config.hScPJ1bbf8:3950:warning: override: reassigning to symbol IPV6 1 ./.tmp.config.hScPJ1bbf8:3948:warning: override: reassigning to symbol NET_SCH_INGRESS 1 ./.tmp.config.hScPJ1bbf8:3947:warning: override: reassigning to symbol NET_SCHED 1 ./.tmp.config.hScPJ1bbf8:3946:warning: override: reassigning to symbol NET_CLS_ACT 1 ./.tmp.config.hScPJ1bbf8:3944:warning: override: reassigning to symbol CGROUP_BPF 1 ./.tmp.config.hScPJ1bbf8:3943:warning: override: reassigning to symbol TEST_BPF 1 ./.tmp.config.hScPJ1bbf8:3940:warning: override: reassigning to symbol BPF_SYSCALL 1 ./.tmp.config.hScPJ1bbf8:3933:warning: override: reassigning to symbol ANDROID 1 ./.tmp.config.hScPJ1bbf8:3923:warning: override: reassigning to symbol NOTIFIER_ERROR_INJECTION 1 ./.tmp.config.hScPJ1bbf8:3912:warning: override: reassigning to symbol USER_NS 1 ./.tmp.config.hScPJ1bbf8:3804:warning: override: reassigning to symbol NET_NS 1 ./.tmp.config.hScPJ1bbf8:3800:warning: override: reassigning to symbol USER_NS 1 ./.tmp.config.hScPJ1bbf8:3774:warning: override: reassigning to symbol NET_ACT_GACT 1 ./.tmp.config.hScPJ1bbf8:3753:warning: override: reassigning to symbol NET_SCH_INGRESS 1 ./.tmp.config.hScPJ1bbf8:3745:warning: override: reassigning to symbol NF_NAT 1 ./.tmp.config.hScPJ1bbf8:3741:warning: override: reassigning to symbol NF_CONNTRACK 1 ./.tmp.config.hScPJ1bbf8:3686:warning: override: reassigning to symbol VLAN_8021Q 1 ./.tmp.config.hScPJ1bbf8:3685:warning: override: reassigning to symbol BRIDGE 1 ./.tmp.config.hScPJ1bbf8:3681:warning: override: reassigning to symbol VETH 1 ./.tmp.config.hScPJ1bbf8:3680:warning: override: reassigning to symbol IPV6_MULTIPLE_TABLES 1 ./.tmp.config.hScPJ1bbf8:3678:warning: override: reassigning to symbol NET_L3_MASTER_DEV 1 ./.tmp.config.hScPJ1bbf8:3677:warning: override: reassigning to symbol NET_VRF 1 ./.tmp.config.hScPJ1bbf8:3674:warning: override: reassigning to symbol BPF_SYSCALL 1 ./.tmp.config.aCODHAWXRn:4843:warning: override: reassigning to symbol USER_NS 1 ./.tmp.config.aCODHAWXRn:4826:warning: override: reassigning to symbol ANDROID 1 ./.tmp.config.aCODHAWXRn:4825:warning: override: reassigning to symbol STAGING 1 ./.tmp.config.aCODHAWXRn:4821:warning: override: reassigning to symbol SECURITYFS 1 ./.tmp.config.aCODHAWXRn:4801:warning: override: reassigning to symbol IPV6_GRE 1 ./.tmp.config.aCODHAWXRn:4795:warning: override: reassigning to symbol NET_CLS_FLOWER 1 ./.tmp.config.aCODHAWXRn:4786:warning: override: reassigning to symbol IPV6 1 ./.tmp.config.aCODHAWXRn:4784:warning: override: reassigning to symbol NET_SCH_INGRESS 1 ./.tmp.config.aCODHAWXRn:4783:warning: override: reassigning to symbol NET_SCHED 1 ./.tmp.config.aCODHAWXRn:4782:warning: override: reassigning to symbol NET_CLS_ACT 1 ./.tmp.config.aCODHAWXRn:4780:warning: override: reassigning to symbol CGROUP_BPF 1 ./.tmp.config.aCODHAWXRn:4779:warning: override: reassigning to symbol TEST_BPF 1 ./.tmp.config.aCODHAWXRn:4776:warning: override: reassigning to symbol BPF_SYSCALL 1 ./.tmp.config.aCODHAWXRn:4769:warning: override: reassigning to symbol ANDROID 1 ./.tmp.config.aCODHAWXRn:4759:warning: override: reassigning to symbol NOTIFIER_ERROR_INJECTION 1 ./.tmp.config.aCODHAWXRn:4748:warning: override: reassigning to symbol USER_NS 1 ./.tmp.config.aCODHAWXRn:4640:warning: override: reassigning to symbol NET_NS 1 ./.tmp.config.aCODHAWXRn:4636:warning: override: reassigning to symbol USER_NS 1 ./.tmp.config.aCODHAWXRn:4610:warning: override: reassigning to symbol NET_ACT_GACT 1 ./.tmp.config.aCODHAWXRn:4589:warning: override: reassigning to symbol NET_SCH_INGRESS 1 ./.tmp.config.aCODHAWXRn:4581:warning: override: reassigning to symbol NF_NAT 1 ./.tmp.config.aCODHAWXRn:4577:warning: override: reassigning to symbol NF_CONNTRACK 1 ./.tmp.config.aCODHAWXRn:4522:warning: override: reassigning to symbol VLAN_8021Q 1 ./.tmp.config.aCODHAWXRn:4521:warning: override: reassigning to symbol BRIDGE 1 ./.tmp.config.aCODHAWXRn:4517:warning: override: reassigning to symbol VETH 1 ./.tmp.config.aCODHAWXRn:4516:warning: override: reassigning to symbol IPV6_MULTIPLE_TABLES 1 ./.tmp.config.aCODHAWXRn:4514:warning: override: reassigning to symbol NET_L3_MASTER_DEV 1 ./.tmp.config.aCODHAWXRn:4513:warning: override: reassigning to symbol NET_VRF 1 ./.tmp.config.aCODHAWXRn:4510:warning: override: reassigning to symbol BPF_SYSCALL 1 ./.tmp.config.VbD7Pa1Q9O:4906:warning: override: reassigning to symbol USER_NS 1 ./.tmp.config.VbD7Pa1Q9O:4889:warning: override: reassigning to symbol ANDROID 1 ./.tmp.config.VbD7Pa1Q9O:4888:warning: override: reassigning to symbol STAGING 1 ./.tmp.config.VbD7Pa1Q9O:4884:warning: override: reassigning to symbol SECURITYFS 1 ./.tmp.config.VbD7Pa1Q9O:4864:warning: override: reassigning to symbol IPV6_GRE 1 ./.tmp.config.VbD7Pa1Q9O:4858:warning: override: reassigning to symbol NET_CLS_FLOWER 1 ./.tmp.config.VbD7Pa1Q9O:4849:warning: override: reassigning to symbol IPV6 1 ./.tmp.config.VbD7Pa1Q9O:4847:warning: override: reassigning to symbol NET_SCH_INGRESS 1 ./.tmp.config.VbD7Pa1Q9O:4846:warning: override: reassigning to symbol NET_SCHED 1 ./.tmp.config.VbD7Pa1Q9O:4845:warning: override: reassigning to symbol NET_CLS_ACT 1 ./.tmp.config.VbD7Pa1Q9O:4843:warning: override: reassigning to symbol CGROUP_BPF 1 ./.tmp.config.VbD7Pa1Q9O:4842:warning: override: reassigning to symbol TEST_BPF 1 ./.tmp.config.VbD7Pa1Q9O:4839:warning: override: reassigning to symbol BPF_SYSCALL 1 ./.tmp.config.VbD7Pa1Q9O:4832:warning: override: reassigning to symbol ANDROID 1 ./.tmp.config.VbD7Pa1Q9O:4822:warning: override: reassigning to symbol NOTIFIER_ERROR_INJECTION 1 ./.tmp.config.VbD7Pa1Q9O:4811:warning: override: reassigning to symbol USER_NS 1 ./.tmp.config.VbD7Pa1Q9O:4703:warning: override: reassigning to symbol NET_NS 1 ./.tmp.config.VbD7Pa1Q9O:4699:warning: override: reassigning to symbol USER_NS 1 ./.tmp.config.VbD7Pa1Q9O:4673:warning: override: reassigning to symbol NET_ACT_GACT 1 ./.tmp.config.VbD7Pa1Q9O:4652:warning: override: reassigning to symbol NET_SCH_INGRESS 1 ./.tmp.config.VbD7Pa1Q9O:4644:warning: override: reassigning to symbol NF_NAT 1 ./.tmp.config.VbD7Pa1Q9O:4640:warning: override: reassigning to symbol NF_CONNTRACK 1 ./.tmp.config.VbD7Pa1Q9O:4585:warning: override: reassigning to symbol VLAN_8021Q 1 ./.tmp.config.VbD7Pa1Q9O:4584:warning: override: reassigning to symbol BRIDGE 1 ./.tmp.config.VbD7Pa1Q9O:4580:warning: override: reassigning to symbol VETH 1 ./.tmp.config.VbD7Pa1Q9O:4579:warning: override: reassigning to symbol IPV6_MULTIPLE_TABLES 1 ./.tmp.config.VbD7Pa1Q9O:4577:warning: override: reassigning to symbol NET_L3_MASTER_DEV 1 ./.tmp.config.VbD7Pa1Q9O:4576:warning: override: reassigning to symbol NET_VRF 1 ./.tmp.config.VbD7Pa1Q9O:4573:warning: override: reassigning to symbol BPF_SYSCALL 1 ./.tmp.config.CThNBwBDaB:8624:warning: override: reassigning to symbol USER_NS 1 ./.tmp.config.CThNBwBDaB:8607:warning: override: reassigning to symbol ANDROID 1 ./.tmp.config.CThNBwBDaB:8606:warning: override: reassigning to symbol STAGING 1 ./.tmp.config.CThNBwBDaB:8602:warning: override: reassigning to symbol SECURITYFS 1 ./.tmp.config.CThNBwBDaB:8582:warning: override: reassigning to symbol IPV6_GRE 1 ./.tmp.config.CThNBwBDaB:8576:warning: override: reassigning to symbol NET_CLS_FLOWER 1 ./.tmp.config.CThNBwBDaB:8567:warning: override: reassigning to symbol IPV6 1 ./.tmp.config.CThNBwBDaB:8565:warning: override: reassigning to symbol NET_SCH_INGRESS 1 ./.tmp.config.CThNBwBDaB:8564:warning: override: reassigning to symbol NET_SCHED 1 ./.tmp.config.CThNBwBDaB:8563:warning: override: reassigning to symbol NET_CLS_ACT 1 ./.tmp.config.CThNBwBDaB:8561:warning: override: reassigning to symbol CGROUP_BPF 1 ./.tmp.config.CThNBwBDaB:8560:warning: override: reassigning to symbol TEST_BPF 1 ./.tmp.config.CThNBwBDaB:8557:warning: override: reassigning to symbol BPF_SYSCALL 1 ./.tmp.config.CThNBwBDaB:8550:warning: override: reassigning to symbol ANDROID 1 ./.tmp.config.CThNBwBDaB:8540:warning: override: reassigning to symbol NOTIFIER_ERROR_INJECTION 1 ./.tmp.config.CThNBwBDaB:8529:warning: override: reassigning to symbol USER_NS 1 ./.tmp.config.CThNBwBDaB:8421:warning: override: reassigning to symbol NET_NS 1 ./.tmp.config.CThNBwBDaB:8417:warning: override: reassigning to symbol USER_NS 1 ./.tmp.config.CThNBwBDaB:8391:warning: override: reassigning to symbol NET_ACT_GACT 1 ./.tmp.config.CThNBwBDaB:8370:warning: override: reassigning to symbol NET_SCH_INGRESS 1 ./.tmp.config.CThNBwBDaB:8362:warning: override: reassigning to symbol NF_NAT 1 ./.tmp.config.CThNBwBDaB:8358:warning: override: reassigning to symbol NF_CONNTRACK 1 ./.tmp.config.CThNBwBDaB:8303:warning: override: reassigning to symbol VLAN_8021Q 1 ./.tmp.config.CThNBwBDaB:8302:warning: override: reassigning to symbol BRIDGE 1 ./.tmp.config.CThNBwBDaB:8298:warning: override: reassigning to symbol VETH 1 ./.tmp.config.CThNBwBDaB:8297:warning: override: reassigning to symbol IPV6_MULTIPLE_TABLES 1 ./.tmp.config.CThNBwBDaB:8295:warning: override: reassigning to symbol NET_L3_MASTER_DEV 1 ./.tmp.config.CThNBwBDaB:8294:warning: override: reassigning to symbol NET_VRF 1 ./.tmp.config.CThNBwBDaB:8291:warning: override: reassigning to symbol BPF_SYSCALL 1 ./.tmp.config.2ZvoqwlOPL:8021:warning: override: reassigning to symbol USER_NS 1 ./.tmp.config.2ZvoqwlOPL:8004:warning: override: reassigning to symbol ANDROID 1 ./.tmp.config.2ZvoqwlOPL:8003:warning: override: reassigning to symbol STAGING 1 ./.tmp.config.2ZvoqwlOPL:7999:warning: override: reassigning to symbol SECURITYFS 1 ./.tmp.config.2ZvoqwlOPL:7979:warning: override: reassigning to symbol IPV6_GRE 1 ./.tmp.config.2ZvoqwlOPL:7973:warning: override: reassigning to symbol NET_CLS_FLOWER 1 ./.tmp.config.2ZvoqwlOPL:7964:warning: override: reassigning to symbol IPV6 1 ./.tmp.config.2ZvoqwlOPL:7962:warning: override: reassigning to symbol NET_SCH_INGRESS 1 ./.tmp.config.2ZvoqwlOPL:7961:warning: override: reassigning to symbol NET_SCHED 1 ./.tmp.config.2ZvoqwlOPL:7960:warning: override: reassigning to symbol NET_CLS_ACT 1 ./.tmp.config.2ZvoqwlOPL:7958:warning: override: reassigning to symbol CGROUP_BPF 1 ./.tmp.config.2ZvoqwlOPL:7957:warning: override: reassigning to symbol TEST_BPF 1 ./.tmp.config.2ZvoqwlOPL:7954:warning: override: reassigning to symbol BPF_SYSCALL 1 ./.tmp.config.2ZvoqwlOPL:7947:warning: override: reassigning to symbol ANDROID 1 ./.tmp.config.2ZvoqwlOPL:7937:warning: override: reassigning to symbol NOTIFIER_ERROR_INJECTION 1 ./.tmp.config.2ZvoqwlOPL:7926:warning: override: reassigning to symbol USER_NS 1 ./.tmp.config.2ZvoqwlOPL:7818:warning: override: reassigning to symbol NET_NS 1 ./.tmp.config.2ZvoqwlOPL:7814:warning: override: reassigning to symbol USER_NS 1 ./.tmp.config.2ZvoqwlOPL:7788:warning: override: reassigning to symbol NET_ACT_GACT 1 ./.tmp.config.2ZvoqwlOPL:7767:warning: override: reassigning to symbol NET_SCH_INGRESS 1 ./.tmp.config.2ZvoqwlOPL:7759:warning: override: reassigning to symbol NF_NAT 1 ./.tmp.config.2ZvoqwlOPL:7755:warning: override: reassigning to symbol NF_CONNTRACK 1 ./.tmp.config.2ZvoqwlOPL:7700:warning: override: reassigning to symbol VLAN_8021Q 1 ./.tmp.config.2ZvoqwlOPL:7699:warning: override: reassigning to symbol BRIDGE 1 ./.tmp.config.2ZvoqwlOPL:7695:warning: override: reassigning to symbol VETH 1 ./.tmp.config.2ZvoqwlOPL:7694:warning: override: reassigning to symbol IPV6_MULTIPLE_TABLES 1 ./.tmp.config.2ZvoqwlOPL:7692:warning: override: reassigning to symbol NET_L3_MASTER_DEV 1 ./.tmp.config.2ZvoqwlOPL:7691:warning: override: reassigning to symbol NET_VRF 1 ./.tmp.config.2ZvoqwlOPL:7688:warning: override: reassigning to symbol BPF_SYSCALL Section mismatches summary: 5 WARNING: vmlinux.o(.text.unlikely+0x8c4): Section mismatch in reference from the function free_memmap() to the function .meminit.text:memblock_free() 3 WARNING: vmlinux.o(.text.unlikely+0x84c): Section mismatch in reference from the function free_memmap() to the function .meminit.text:memblock_free() 3 WARNING: vmlinux.o(.text.unlikely+0x840): Section mismatch in reference from the function free_memmap() to the function .meminit.text:memblock_free() 1 WARNING: vmlinux.o(.text.unlikely+0x8e4): Section mismatch in reference from the function free_memmap() to the function .meminit.text:memblock_free() 1 WARNING: vmlinux.o(.text.unlikely+0x7c8): Section mismatch in reference from the function free_memmap() to the function .meminit.text:memblock_free() 1 WARNING: vmlinux.o(.text.unlikely+0x710): Section mismatch in reference from the function free_memmap() to the function .meminit.text:memblock_free() 1 WARNING: vmlinux.o(.text.unlikely+0x3980): Section mismatch in reference from the function pmax_setup_memory_region() to the function .init.text:add_memory_region() 1 WARNING: vmlinux.o(.text.unlikely+0x363c): Section mismatch in reference from the function pmax_setup_memory_region() to the function .init.text:add_memory_region() ================================================================================ Detailed per-defconfig build reports: -------------------------------------------------------------------------------- 32r2el_defconfig (mips, gcc-8) — PASS, 0 errors, 2 warnings, 0 section mismatches Warnings: fs/ext4/super.c:2068:23: warning: unused variable 'sbi' [-Wunused-variable] drivers/mtd/ubi/debug.c:512:6: warning: unused variable 'err' [-Wunused-variable] -------------------------------------------------------------------------------- 32r2el_defconfig+kselftest (mips, gcc-8) — PASS, 0 errors, 32 warnings, 0 section mismatches Warnings: ./.tmp.config.hScPJ1bbf8:3674:warning: override: reassigning to symbol BPF_SYSCALL ./.tmp.config.hScPJ1bbf8:3677:warning: override: reassigning to symbol NET_VRF ./.tmp.config.hScPJ1bbf8:3678:warning: override: reassigning to symbol NET_L3_MASTER_DEV ./.tmp.config.hScPJ1bbf8:3680:warning: override: reassigning to symbol IPV6_MULTIPLE_TABLES ./.tmp.config.hScPJ1bbf8:3681:warning: override: reassigning to symbol VETH ./.tmp.config.hScPJ1bbf8:3685:warning: override: reassigning to symbol BRIDGE ./.tmp.config.hScPJ1bbf8:3686:warning: override: reassigning to symbol VLAN_8021Q ./.tmp.config.hScPJ1bbf8:3741:warning: override: reassigning to symbol NF_CONNTRACK ./.tmp.config.hScPJ1bbf8:3745:warning: override: reassigning to symbol NF_NAT ./.tmp.config.hScPJ1bbf8:3753:warning: override: reassigning to symbol NET_SCH_INGRESS ./.tmp.config.hScPJ1bbf8:3774:warning: override: reassigning to symbol NET_ACT_GACT ./.tmp.config.hScPJ1bbf8:3800:warning: override: reassigning to symbol USER_NS ./.tmp.config.hScPJ1bbf8:3804:warning: override: reassigning to symbol NET_NS ./.tmp.config.hScPJ1bbf8:3912:warning: override: reassigning to symbol USER_NS ./.tmp.config.hScPJ1bbf8:3923:warning: override: reassigning to symbol NOTIFIER_ERROR_INJECTION ./.tmp.config.hScPJ1bbf8:3933:warning: override: reassigning to symbol ANDROID ./.tmp.config.hScPJ1bbf8:3940:warning: override: reassigning to symbol BPF_SYSCALL ./.tmp.config.hScPJ1bbf8:3943:warning: override: reassigning to symbol TEST_BPF ./.tmp.config.hScPJ1bbf8:3944:warning: override: reassigning to symbol CGROUP_BPF ./.tmp.config.hScPJ1bbf8:3946:warning: override: reassigning to symbol NET_CLS_ACT ./.tmp.config.hScPJ1bbf8:3947:warning: override: reassigning to symbol NET_SCHED ./.tmp.config.hScPJ1bbf8:3948:warning: override: reassigning to symbol NET_SCH_INGRESS ./.tmp.config.hScPJ1bbf8:3950:warning: override: reassigning to symbol IPV6 ./.tmp.config.hScPJ1bbf8:3959:warning: override: reassigning to symbol NET_CLS_FLOWER ./.tmp.config.hScPJ1bbf8:3965:warning: override: reassigning to symbol IPV6_GRE ./.tmp.config.hScPJ1bbf8:3985:warning: override: reassigning to symbol SECURITYFS ./.tmp.config.hScPJ1bbf8:3989:warning: override: reassigning to symbol STAGING ./.tmp.config.hScPJ1bbf8:3990:warning: override: reassigning to symbol ANDROID ./.tmp.config.hScPJ1bbf8:4007:warning: override: reassigning to symbol USER_NS fs/btrfs/tree-checker.c:230:43: warning: format '%lu' expects argument of type 'long unsigned int', but argument 5 has type 'unsigned int' [-Wformat=] fs/ext4/super.c:2068:23: warning: unused variable 'sbi' [-Wunused-variable] drivers/mtd/ubi/debug.c:512:6: warning: unused variable 'err' [-Wunused-variable] -------------------------------------------------------------------------------- allmodconfig (arm64, clang-8) — PASS, 0 errors, 57 warnings, 0 section mismatches Warnings: drivers/android/binderfs.c:657:41: warning: suggest braces around initialization of subobject [-Wmissing-braces] 1 warning generated. mm/shmem.c:2737:35: warning: variable 'shmem_falloc_waitq' is uninitialized when used within its own initialization [-Wuninitialized] 1 warning generated. drivers/bus/fsl-mc/fsl-mc-bus.c:718:43: warning: suggest braces around initialization of subobject [-Wmissing-braces] drivers/bus/fsl-mc/fsl-mc-bus.c:719:37: warning: suggest braces around initialization of subobject [-Wmissing-braces] drivers/bus/fsl-mc/fsl-mc-bus.c:720:37: warning: suggest braces around initialization of subobject [-Wmissing-braces] 3 warnings generated. fs/proc/base.c:1894:35: warning: variable 'wq' is uninitialized when used within its own initialization [-Wuninitialized] 1 warning generated. fs/proc/proc_sysctl.c:705:35: warning: variable 'wq' is uninitialized when used within its own initialization [-Wuninitialized] 1 warning generated. fs/namei.c:1644:34: warning: variable 'wq' is uninitialized when used within its own initialization [-Wuninitialized] fs/namei.c:3132:34: warning: variable 'wq' is uninitialized when used within its own initialization [-Wuninitialized] 2 warnings generated. fs/afs/dir_silly.c:205:34: warning: variable 'wq' is uninitialized when used within its own initialization [-Wuninitialized] 1 warning generated. drivers/bluetooth/bluecard_cs.c:282:36: warning: variable 'wq' is uninitialized when used within its own initialization [-Wuninitialized] 1 warning generated. fs/cifs/readdir.c:83:34: warning: variable 'wq' is uninitialized when used within its own initialization [-Wuninitialized] 1 warning generated. drivers/gpu/host1x/syncpt.c:208:34: warning: variable 'wq' is uninitialized when used within its own initialization [-Wuninitialized] 1 warning generated. fs/fuse/readdir.c:161:34: warning: variable 'wq' is uninitialized when used within its own initialization [-Wuninitialized] 1 warning generated. fs/nfs/dir.c:448:34: warning: variable 'wq' is uninitialized when used within its own initialization [-Wuninitialized] fs/nfs/dir.c:1499:34: warning: variable 'wq' is uninitialized when used within its own initialization [-Wuninitialized] 2 warnings generated. net/nfc/hci/command.c:59:34: warning: variable 'ew_wq' is uninitialized when used within its own initialization [-Wuninitialized] 1 warning generated. net/nfc/hci/llc_shdlc.c:687:34: warning: variable 'connect_wq' is uninitialized when used within its own initialization [-Wuninitialized] 1 warning generated. drivers/misc/mic/vop/vop_vringh.c:155:34: warning: variable 'wake' is uninitialized when used within its own initialization [-Wuninitialized] drivers/misc/mic/vop/vop_vringh.c:399:34: warning: variable 'wake' is uninitialized when used within its own initialization [-Wuninitialized] 2 warnings generated. drivers/mtd/ubi/debug.c:512:6: warning: unused variable 'err' [-Wunused-variable] 1 warning generated. drivers/scsi/bfa/bfad_im.c:301:34: warning: variable 'wq' is uninitialized when used within its own initialization [-Wuninitialized] drivers/scsi/bfa/bfad_im.c:378:34: warning: variable 'wq' is uninitialized when used within its own initialization [-Wuninitialized] 2 warnings generated. drivers/net/usb/lan78xx.c:2665:34: warning: variable 'unlink_wakeup' is uninitialized when used within its own initialization [-Wuninitialized] 1 warning generated. net/netfilter/nf_flow_table_offload.c:80:34: warning: implicit conversion from 'int' to '__be16' (aka 'unsigned short') changes value from 327680 to 0 [-Wconstant-conversion] net/netfilter/nf_flow_table_offload.c:264:2: warning: variable 'offset' is used uninitialized whenever switch default is taken [-Wsometimes-uninitialized] net/netfilter/nf_flow_table_offload.c:253:12: note: initialize the variable 'offset' to silence this warning net/netfilter/nf_flow_table_offload.c:290:2: warning: variable 'offset' is used uninitialized whenever switch default is taken [-Wsometimes-uninitialized] net/netfilter/nf_flow_table_offload.c:279:12: note: initialize the variable 'offset' to silence this warning 3 warnings generated. drivers/scsi/lpfc/lpfc_sli.c:11909:34: warning: variable 'done_q' is uninitialized when used within its own initialization [-Wuninitialized] 1 warning generated. drivers/scsi/lpfc/lpfc_scsi.c:4726:34: warning: variable 'waitq' is uninitialized when used within its own initialization [-Wuninitialized] 1 warning generated. drivers/gpu/drm/amd/amdgpu/../display/dc/bios/command_table2.c:112:62: warning: suggest braces around initialization of subobject [-Wmissing-braces] drivers/gpu/drm/amd/amdgpu/../display/dc/bios/command_table2.c:303:53: warning: suggest braces around initialization of subobject [-Wmissing-braces] 2 warnings generated. drivers/gpu/drm/amd/amdgpu/../display/dc/bios/bios_parser2.c:297:41: warning: suggest braces around initialization of subobject [-Wmissing-braces] 1 warning generated. -------------------------------------------------------------------------------- allmodconfig (x86_64, gcc-8) — PASS, 0 errors, 5 warnings, 0 section mismatches Warnings: security/integrity/platform_certs/load_uefi.c:17:19: warning: 'efi_cert_sha256_guid' defined but not used [-Wunused-variable] security/integrity/platform_certs/load_uefi.c:15:19: warning: 'efi_cert_x509_sha256_guid' defined but not used [-Wunused-variable] security/integrity/platform_certs/load_uefi.c:14:19: warning: 'efi_cert_x509_guid' defined but not used [-Wunused-variable] lib/cpumask.c:302:1: warning: the frame size of 5280 bytes is larger than 2048 bytes [-Wframe-larger-than=] drivers/mtd/ubi/debug.c:512:6: warning: unused variable 'err' [-Wunused-variable] -------------------------------------------------------------------------------- allmodconfig (arm64, gcc-8) — PASS, 0 errors, 2 warnings, 0 section mismatches Warnings: drivers/mtd/ubi/debug.c:512:6: warning: unused variable 'err' [-Wunused-variable] net/netfilter/nf_flow_table_offload.c:80:21: warning: unsigned conversion from 'int' to '__be16' {aka 'short unsigned int'} changes value from '327680' to '0' [-Woverflow] -------------------------------------------------------------------------------- allmodconfig (arm, gcc-8) — PASS, 0 errors, 21 warnings, 0 section mismatches Warnings: /tmp/ccjYtX2y.s:18119: Warning: using r15 results in unpredictable behaviour /tmp/ccjYtX2y.s:18191: Warning: using r15 results in unpredictable behaviour fs/btrfs/tree-checker.c:230:43: warning: format '%lu' expects argument of type 'long unsigned int', but argument 5 has type 'unsigned int' [-Wformat=] drivers/mtd/ubi/debug.c:512:6: warning: unused variable 'err' [-Wunused-variable] net/netfilter/nf_flow_table_offload.c:80:21: warning: unsigned conversion from 'int' to '__be16' {aka 'short unsigned int'} changes value from '327680' to '0' [-Woverflow] drivers/net/phy/mdio-cavium.h:114:37: warning: cast to pointer from integer of different size [-Wint-to-pointer-cast] drivers/net/phy/mdio-cavium.h:113:48: warning: cast to pointer from integer of different size [-Wint-to-pointer-cast] drivers/net/phy/mdio-cavium.h:113:48: warning: cast to pointer from integer of different size [-Wint-to-pointer-cast] drivers/net/phy/mdio-cavium.h:113:48: warning: cast to pointer from integer of different size [-Wint-to-pointer-cast] drivers/net/phy/mdio-cavium.h:114:37: warning: cast to pointer from integer of different size [-Wint-to-pointer-cast] drivers/net/phy/mdio-cavium.h:113:48: warning: cast to pointer from integer of different size [-Wint-to-pointer-cast] drivers/net/phy/mdio-cavium.h:114:37: warning: cast to pointer from integer of different size [-Wint-to-pointer-cast] drivers/net/phy/mdio-cavium.h:113:48: warning: cast to pointer from integer of different size [-Wint-to-pointer-cast] drivers/net/phy/mdio-cavium.h:113:48: warning: cast to pointer from integer of different size [-Wint-to-pointer-cast] drivers/net/phy/mdio-cavium.h:114:37: warning: cast to pointer from integer of different size [-Wint-to-pointer-cast] drivers/net/phy/mdio-octeon.c:48:3: warning: cast from pointer to integer of different size [-Wpointer-to-int-cast] drivers/net/phy/mdio-cavium.h:113:48: warning: cast to pointer from integer of different size [-Wint-to-pointer-cast] drivers/net/phy/mdio-cavium.h:113:48: warning: cast to pointer from integer of different size [-Wint-to-pointer-cast] drivers/net/phy/mdio-cavium.h:113:48: warning: cast to pointer from integer of different size [-Wint-to-pointer-cast] include/linux/kern_levels.h:5:18: warning: format '%ld' expects argument of type 'long int', but argument 5 has type 'size_t' {aka 'unsigned int'} [-Wformat=] warning: same module names found: -------------------------------------------------------------------------------- allnoconfig (arc, gcc-8) — PASS, 0 errors, 1 warning, 0 section mismatches Warnings: <stdin>:1511:2: warning: #warning syscall clone3 not implemented [-Wcpp] -------------------------------------------------------------------------------- allnoconfig (arm64, gcc-8) — PASS, 0 errors, 0 warnings, 0 section mismatches -------------------------------------------------------------------------------- allnoconfig (arm, gcc-8) — PASS, 0 errors, 0 warnings, 0 section mismatches -------------------------------------------------------------------------------- allnoconfig (riscv, gcc-8) — PASS, 0 errors, 0 warnings, 0 section mismatches -------------------------------------------------------------------------------- allnoconfig (mips, gcc-8) — PASS, 0 errors, 0 warnings, 0 section mismatches -------------------------------------------------------------------------------- allnoconfig (arm64, clang-8) — PASS, 0 errors, 0 warnings, 0 section mismatches -------------------------------------------------------------------------------- allnoconfig (i386, gcc-8) — PASS, 0 errors, 0 warnings, 0 section mismatches -------------------------------------------------------------------------------- allnoconfig (x86_64, gcc-8) — PASS, 0 errors, 0 warnings, 0 section mismatches -------------------------------------------------------------------------------- am200epdkit_defconfig (arm, gcc-8) — PASS, 0 errors, 1 warning, 0 section mismatches Warnings: WARNING: "return_address" [vmlinux] is a static EXPORT_SYMBOL_GPL -------------------------------------------------------------------------------- ar7_defconfig (mips, gcc-8) — PASS, 0 errors, 0 warnings, 0 section mismatches -------------------------------------------------------------------------------- aspeed_g4_defconfig (arm, gcc-8) — PASS, 0 errors, 1 warning, 0 section mismatches Warnings: drivers/mtd/ubi/debug.c:512:6: warning: unused variable 'err' [-Wunused-variable] -------------------------------------------------------------------------------- aspeed_g5_defconfig (arm, gcc-8) — PASS, 0 errors, 1 warning, 0 section mismatches Warnings: drivers/mtd/ubi/debug.c:512:6: warning: unused variable 'err' [-Wunused-variable] -------------------------------------------------------------------------------- assabet_defconfig (arm, gcc-8) — PASS, 0 errors, 0 warnings, 0 section mismatches Section mismatches: WARNING: vmlinux.o(.text.unlikely+0x8c4): Section mismatch in reference from the function free_memmap() to the function .meminit.text:memblock_free() -------------------------------------------------------------------------------- at91_dt_defconfig (arm, gcc-8) — PASS, 0 errors, 3 warnings, 0 section mismatches Warnings: fs/ext4/super.c:2068:23: warning: unused variable 'sbi' [-Wunused-variable] drivers/mtd/ubi/debug.c:512:6: warning: unused variable 'err' [-Wunused-variable] WARNING: "return_address" [vmlinux] is a static EXPORT_SYMBOL_GPL -------------------------------------------------------------------------------- ath25_defconfig (mips, gcc-8) — PASS, 0 errors, 0 warnings, 0 section mismatches -------------------------------------------------------------------------------- ath79_defconfig (mips, gcc-8) — PASS, 0 errors, 0 warnings, 0 section mismatches -------------------------------------------------------------------------------- axm55xx_defconfig (arm, gcc-8) — PASS, 0 errors, 2 warnings, 0 section mismatches Warnings: fs/ext4/super.c:2068:23: warning: unused variable 'sbi' [-Wunused-variable] WARNING: "return_address" [vmlinux] is a static EXPORT_SYMBOL_GPL -------------------------------------------------------------------------------- axs103_defconfig (arc, gcc-8) — PASS, 0 errors, 3 warnings, 0 section mismatches Warnings: <stdin>:1511:2: warning: #warning syscall clone3 not implemented [-Wcpp] fs/ext4/super.c:2068:23: warning: unused variable 'sbi' [-Wunused-variable] <stdin>:1511:2: warning: #warning syscall clone3 not implemented [-Wcpp] -------------------------------------------------------------------------------- axs103_smp_defconfig (arc, gcc-8) — PASS, 0 errors, 3 warnings, 0 section mismatches Warnings: <stdin>:1511:2: warning: #warning syscall clone3 not implemented [-Wcpp] fs/ext4/super.c:2068:23: warning: unused variable 'sbi' [-Wunused-variable] <stdin>:1511:2: warning: #warning syscall clone3 not implemented [-Wcpp] -------------------------------------------------------------------------------- badge4_defconfig (arm, gcc-8) — PASS, 0 errors, 1 warning, 0 section mismatches Warnings: fs/ext4/super.c:2068:23: warning: unused variable 'sbi' [-Wunused-variable] Section mismatches: WARNING: vmlinux.o(.text.unlikely+0x84c): Section mismatch in reference from the function free_memmap() to the function .meminit.text:memblock_free() -------------------------------------------------------------------------------- bcm2835_defconfig (arm, gcc-8) — PASS, 0 errors, 1 warning, 0 section mismatches Warnings: fs/ext4/super.c:2068:23: warning: unused variable 'sbi' [-Wunused-variable] -------------------------------------------------------------------------------- bcm47xx_defconfig (mips, gcc-8) — PASS, 0 errors, 0 warnings, 0 section mismatches -------------------------------------------------------------------------------- bcm63xx_defconfig (mips, gcc-8) — PASS, 0 errors, 0 warnings, 0 section mismatches -------------------------------------------------------------------------------- bigsur_defconfig (mips, gcc-8) — PASS, 0 errors, 0 warnings, 0 section mismatches -------------------------------------------------------------------------------- bmips_be_defconfig (mips, gcc-8) — PASS, 0 errors, 1 warning, 0 section mismatches Warnings: fs/ext4/super.c:2068:23: warning: unused variable 'sbi' [-Wunused-variable] -------------------------------------------------------------------------------- bmips_stb_defconfig (mips, gcc-8) — PASS, 0 errors, 1 warning, 0 section mismatches Warnings: fs/ext4/super.c:2068:23: warning: unused variable 'sbi' [-Wunused-variable] -------------------------------------------------------------------------------- capcella_defconfig (mips, gcc-8) — PASS, 0 errors, 1 warning, 0 section mismatches Warnings: fs/ext4/super.c:2068:23: warning: unused variable 'sbi' [-Wunused-variable] -------------------------------------------------------------------------------- cavium_octeon_defconfig (mips, gcc-8) — FAIL, 4 errors, 4 warnings, 0 section mismatches Errors: drivers/staging/octeon/ethernet.c:177:21: error: dereferencing pointer to incomplete type 'struct cvmx_wqe' drivers/staging/octeon/ethernet.c:463:30: error: storage size of 'link_info' isn't known drivers/staging/octeon/ethernet.c:499:30: error: storage size of 'link_info' isn't known drivers/staging/octeon/ethernet.c:516:29: error: type of formal parameter 2 is incomplete Warnings: fs/ext4/super.c:2068:23: warning: unused variable 'sbi' [-Wunused-variable] drivers/staging/octeon/octeon-ethernet.h:94:12: warning: 'union cvmx_helper_link_info' declared inside parameter list will not be visible outside of this definition or declaration drivers/staging/octeon/ethernet.c:463:30: warning: unused variable 'link_info' [-Wunused-variable] drivers/staging/octeon/ethernet.c:499:30: warning: unused variable 'link_info' [-Wunused-variable] -------------------------------------------------------------------------------- cerfcube_defconfig (arm, gcc-8) — PASS, 0 errors, 1 warning, 0 section mismatches Warnings: fs/ext4/super.c:2068:23: warning: unused variable 'sbi' [-Wunused-variable] Section mismatches: WARNING: vmlinux.o(.text.unlikely+0x84c): Section mismatch in reference from the function free_memmap() to the function .meminit.text:memblock_free() -------------------------------------------------------------------------------- ci20_defconfig (mips, gcc-8) — PASS, 0 errors, 2 warnings, 0 section mismatches Warnings: fs/ext4/super.c:2068:23: warning: unused variable 'sbi' [-Wunused-variable] drivers/mtd/ubi/debug.c:512:6: warning: unused variable 'err' [-Wunused-variable] -------------------------------------------------------------------------------- clps711x_defconfig (arm, gcc-8) — PASS, 0 errors, 0 warnings, 0 section mismatches -------------------------------------------------------------------------------- cm_x2xx_defconfig (arm, gcc-8) — PASS, 0 errors, 2 warnings, 0 section mismatches Warnings: fs/ext4/super.c:2068:23: warning: unused variable 'sbi' [-Wunused-variable] WARNING: "return_address" [vmlinux] is a static EXPORT_SYMBOL_GPL -------------------------------------------------------------------------------- cm_x300_defconfig (arm, gcc-8) — PASS, 0 errors, 3 warnings, 0 section mismatches Warnings: fs/ext4/super.c:2068:23: warning: unused variable 'sbi' [-Wunused-variable] drivers/mtd/ubi/debug.c:512:6: warning: unused variable 'err' [-Wunused-variable] WARNING: "return_address" [vmlinux] is a static EXPORT_SYMBOL_GPL -------------------------------------------------------------------------------- cns3420vb_defconfig (arm, gcc-8) — PASS, 0 errors, 1 warning, 0 section mismatches Warnings: WARNING: "return_address" [vmlinux] is a static EXPORT_SYMBOL_GPL -------------------------------------------------------------------------------- cobalt_defconfig (mips, gcc-8) — PASS, 0 errors, 1 warning, 0 section mismatches Warnings: fs/ext4/super.c:2068:23: warning: unused variable 'sbi' [-Wunused-variable] -------------------------------------------------------------------------------- colibri_pxa270_defconfig (arm, gcc-8) — PASS, 0 errors, 1 warning, 0 section mismatches Warnings: WARNING: "return_address" [vmlinux] is a static EXPORT_SYMBOL_GPL -------------------------------------------------------------------------------- colibri_pxa300_defconfig (arm, gcc-8) — PASS, 0 errors, 2 warnings, 0 section mismatches Warnings: fs/ext4/super.c:2068:23: warning: unused variable 'sbi' [-Wunused-variable] WARNING: "return_address" [vmlinux] is a static EXPORT_SYMBOL_GPL -------------------------------------------------------------------------------- collie_defconfig (arm, gcc-8) — PASS, 0 errors, 0 warnings, 0 section mismatches Section mismatches: WARNING: vmlinux.o(.text.unlikely+0x840): Section mismatch in reference from the function free_memmap() to the function .meminit.text:memblock_free() -------------------------------------------------------------------------------- corgi_defconfig (arm, gcc-8) — PASS, 0 errors, 0 warnings, 0 section mismatches -------------------------------------------------------------------------------- davinci_all_defconfig (arm, gcc-8) — PASS, 0 errors, 3 warnings, 0 section mismatches Warnings: fs/ext4/super.c:2068:23: warning: unused variable 'sbi' [-Wunused-variable] WARNING: "return_address" [vmlinux] is a static EXPORT_SYMBOL_GPL drivers/mtd/ubi/debug.c:512:6: warning: unused variable 'err' [-Wunused-variable] -------------------------------------------------------------------------------- db1xxx_defconfig (mips, gcc-8) — PASS, 0 errors, 1 warning, 0 section mismatches Warnings: fs/ext4/super.c:2068:23: warning: unused variable 'sbi' [-Wunused-variable] -------------------------------------------------------------------------------- decstation_64_defconfig (mips, gcc-8) — PASS, 0 errors, 1 warning, 0 section mismatches Warnings: fs/ext4/super.c:2068:23: warning: unused variable 'sbi' [-Wunused-variable] -------------------------------------------------------------------------------- decstation_defconfig (mips, gcc-8) — PASS, 0 errors, 1 warning, 0 section mismatches Warnings: fs/ext4/super.c:2068:23: warning: unused variable 'sbi' [-Wunused-variable] Section mismatches: WARNING: vmlinux.o(.text.unlikely+0x3980): Section mismatch in reference from the function pmax_setup_memory_region() to the function .init.text:add_memory_region() -------------------------------------------------------------------------------- decstation_r4k_defconfig (mips, gcc-8) — PASS, 0 errors, 1 warning, 0 section mismatches Warnings: fs/ext4/super.c:2068:23: warning: unused variable 'sbi' [-Wunused-variable] Section mismatches: WARNING: vmlinux.o(.text.unlikely+0x363c): Section mismatch in reference from the function pmax_setup_memory_region() to the function .init.text:add_memory_region() -------------------------------------------------------------------------------- defconfig (riscv, gcc-8) — PASS, 0 errors, 1 warning, 0 section mismatches Warnings: fs/ext4/super.c:2068:23: warning: unused variable 'sbi' [-Wunused-variable] -------------------------------------------------------------------------------- defconfig (arm64, gcc-8) — PASS, 0 errors, 0 warnings, 0 section mismatches -------------------------------------------------------------------------------- defconfig (arm64, clang-8) — PASS, 0 errors, 0 warnings, 0 section mismatches -------------------------------------------------------------------------------- defconfig+CONFIG_CPU_BIG_ENDIAN=y (arm64, gcc-8) — PASS, 0 errors, 0 warnings, 0 section mismatches -------------------------------------------------------------------------------- defconfig+CONFIG_RANDOMIZE_BASE=y (arm64, gcc-8) — PASS, 0 errors, 0 warnings, 0 section mismatches -------------------------------------------------------------------------------- defconfig+kselftest (riscv, gcc-8) — PASS, 0 errors, 30 warnings, 0 section mismatches Warnings: ./.tmp.config.pR1cKPLo28:3052:warning: override: reassigning to symbol BPF_SYSCALL ./.tmp.config.pR1cKPLo28:3055:warning: override: reassigning to symbol NET_VRF ./.tmp.config.pR1cKPLo28:3056:warning: override: reassigning to symbol NET_L3_MASTER_DEV ./.tmp.config.pR1cKPLo28:3058:warning: override: reassigning to symbol IPV6_MULTIPLE_TABLES ./.tmp.config.pR1cKPLo28:3059:warning: override: reassigning to symbol VETH ./.tmp.config.pR1cKPLo28:3063:warning: override: reassigning to symbol BRIDGE ./.tmp.config.pR1cKPLo28:3064:warning: override: reassigning to symbol VLAN_8021Q ./.tmp.config.pR1cKPLo28:3119:warning: override: reassigning to symbol NF_CONNTRACK ./.tmp.config.pR1cKPLo28:3123:warning: override: reassigning to symbol NF_NAT ./.tmp.config.pR1cKPLo28:3131:warning: override: reassigning to symbol NET_SCH_INGRESS ./.tmp.config.pR1cKPLo28:3152:warning: override: reassigning to symbol NET_ACT_GACT ./.tmp.config.pR1cKPLo28:3178:warning: override: reassigning to symbol USER_NS ./.tmp.config.pR1cKPLo28:3182:warning: override: reassigning to symbol NET_NS ./.tmp.config.pR1cKPLo28:3290:warning: override: reassigning to symbol USER_NS ./.tmp.config.pR1cKPLo28:3301:warning: override: reassigning to symbol NOTIFIER_ERROR_INJECTION ./.tmp.config.pR1cKPLo28:3311:warning: override: reassigning to symbol ANDROID ./.tmp.config.pR1cKPLo28:3318:warning: override: reassigning to symbol BPF_SYSCALL ./.tmp.config.pR1cKPLo28:3321:warning: override: reassigning to symbol TEST_BPF ./.tmp.config.pR1cKPLo28:3322:warning: override: reassigning to symbol CGROUP_BPF ./.tmp.config.pR1cKPLo28:3324:warning: override: reassigning to symbol NET_CLS_ACT ./.tmp.config.pR1cKPLo28:3325:warning: override: reassigning to symbol NET_SCHED ./.tmp.config.pR1cKPLo28:3326:warning: override: reassigning to symbol NET_SCH_INGRESS ./.tmp.config.pR1cKPLo28:3328:warning: override: reassigning to symbol IPV6 ./.tmp.config.pR1cKPLo28:3337:warning: override: reassigning to symbol NET_CLS_FLOWER ./.tmp.config.pR1cKPLo28:3343:warning: override: reassigning to symbol IPV6_GRE ./.tmp.config.pR1cKPLo28:3363:warning: override: reassigning to symbol SECURITYFS ./.tmp.config.pR1cKPLo28:3367:warning: override: reassigning to symbol STAGING ./.tmp.config.pR1cKPLo28:3368:warning: override: reassigning to symbol ANDROID ./.tmp.config.pR1cKPLo28:3385:warning: override: reassigning to symbol USER_NS fs/ext4/super.c:2068:23: warning: unused variable 'sbi' [-Wunused-variable] -------------------------------------------------------------------------------- defconfig+kselftest (arm64, gcc-8) — PASS, 0 errors, 29 warnings, 0 section mismatches Warnings: ./.tmp.config.2ZvoqwlOPL:7688:warning: override: reassigning to symbol BPF_SYSCALL ./.tmp.config.2ZvoqwlOPL:7691:warning: override: reassigning to symbol NET_VRF ./.tmp.config.2ZvoqwlOPL:7692:warning: override: reassigning to symbol NET_L3_MASTER_DEV ./.tmp.config.2ZvoqwlOPL:7694:warning: override: reassigning to symbol IPV6_MULTIPLE_TABLES ./.tmp.config.2ZvoqwlOPL:7695:warning: override: reassigning to symbol VETH ./.tmp.config.2ZvoqwlOPL:7699:warning: override: reassigning to symbol BRIDGE ./.tmp.config.2ZvoqwlOPL:7700:warning: override: reassigning to symbol VLAN_8021Q ./.tmp.config.2ZvoqwlOPL:7755:warning: override: reassigning to symbol NF_CONNTRACK ./.tmp.config.2ZvoqwlOPL:7759:warning: override: reassigning to symbol NF_NAT ./.tmp.config.2ZvoqwlOPL:7767:warning: override: reassigning to symbol NET_SCH_INGRESS ./.tmp.config.2ZvoqwlOPL:7788:warning: override: reassigning to symbol NET_ACT_GACT ./.tmp.config.2ZvoqwlOPL:7814:warning: override: reassigning to symbol USER_NS ./.tmp.config.2ZvoqwlOPL:7818:warning: override: reassigning to symbol NET_NS ./.tmp.config.2ZvoqwlOPL:7926:warning: override: reassigning to symbol USER_NS ./.tmp.config.2ZvoqwlOPL:7937:warning: override: reassigning to symbol NOTIFIER_ERROR_INJECTION ./.tmp.config.2ZvoqwlOPL:7947:warning: override: reassigning to symbol ANDROID ./.tmp.config.2ZvoqwlOPL:7954:warning: override: reassigning to symbol BPF_SYSCALL ./.tmp.config.2ZvoqwlOPL:7957:warning: override: reassigning to symbol TEST_BPF ./.tmp.config.2ZvoqwlOPL:7958:warning: override: reassigning to symbol CGROUP_BPF ./.tmp.config.2ZvoqwlOPL:7960:warning: override: reassigning to symbol NET_CLS_ACT ./.tmp.config.2ZvoqwlOPL:7961:warning: override: reassigning to symbol NET_SCHED ./.tmp.config.2ZvoqwlOPL:7962:warning: override: reassigning to symbol NET_SCH_INGRESS ./.tmp.config.2ZvoqwlOPL:7964:warning: override: reassigning to symbol IPV6 ./.tmp.config.2ZvoqwlOPL:7973:warning: override: reassigning to symbol NET_CLS_FLOWER ./.tmp.config.2ZvoqwlOPL:7979:warning: override: reassigning to symbol IPV6_GRE ./.tmp.config.2ZvoqwlOPL:7999:warning: override: reassigning to symbol SECURITYFS ./.tmp.config.2ZvoqwlOPL:8003:warning: override: reassigning to symbol STAGING ./.tmp.config.2ZvoqwlOPL:8004:warning: override: reassigning to symbol ANDROID ./.tmp.config.2ZvoqwlOPL:8021:warning: override: reassigning to symbol USER_NS -------------------------------------------------------------------------------- dove_defconfig (arm, gcc-8) — PASS, 0 errors, 2 warnings, 0 section mismatches Warnings: fs/ext4/super.c:2068:23: warning: unused variable 'sbi' [-Wunused-variable] WARNING: "return_address" [vmlinux] is a static EXPORT_SYMBOL_GPL -------------------------------------------------------------------------------- e55_defconfig (mips, gcc-8) — PASS, 0 errors, 1 warning, 0 section mismatches Warnings: fs/ext4/super.c:2068:23: warning: unused variable 'sbi' [-Wunused-variable] -------------------------------------------------------------------------------- ebsa110_defconfig (arm, gcc-8) — PASS, 0 errors, 0 warnings, 0 section mismatches -------------------------------------------------------------------------------- efm32_defconfig (arm, gcc-8) — PASS, 0 errors, 0 warnings, 0 section mismatches -------------------------------------------------------------------------------- em_x270_defconfig (arm, gcc-8) — PASS, 0 errors, 2 warnings, 0 section mismatches Warnings: fs/ext4/super.c:2068:23: warning: unused variable 'sbi' [-Wunused-variable] WARNING: "return_address" [vmlinux] is a static EXPORT_SYMBOL_GPL -------------------------------------------------------------------------------- ep93xx_defconfig (arm, gcc-8) — PASS, 0 errors, 2 warnings, 0 section mismatches Warnings: fs/ext4/super.c:2068:23: warning: unused variable 'sbi' [-Wunused-variable] WARNING: "return_address" [vmlinux] is a static EXPORT_SYMBOL_GPL Section mismatches: WARNING: vmlinux.o(.text.unlikely+0x710): Section mismatch in reference from the function free_memmap() to the function .meminit.text:memblock_free() -------------------------------------------------------------------------------- eseries_pxa_defconfig (arm, gcc-8) — PASS, 0 errors, 2 warnings, 0 section mismatches Warnings: WARNING: "return_address" [vmlinux] is a static EXPORT_SYMBOL_GPL fs/ext4/super.c:2068:23: warning: unused variable 'sbi' [-Wunused-variable] -------------------------------------------------------------------------------- exynos_defconfig (arm, gcc-8) — PASS, 0 errors, 2 warnings, 0 section mismatches Warnings: fs/ext4/super.c:2068:23: warning: unused variable 'sbi' [-Wunused-variable] WARNING: "return_address" [vmlinux] is a static EXPORT_SYMBOL_GPL -------------------------------------------------------------------------------- ezx_defconfig (arm, gcc-8) — PASS, 0 errors, 2 warnings, 0 section mismatches Warnings: WARNING: "return_address" [vmlinux] is a static EXPORT_SYMBOL_GPL fs/ext4/super.c:2068:23: warning: unused variable 'sbi' [-Wunused-variable] -------------------------------------------------------------------------------- footbridge_defconfig (arm, gcc-8) — PASS, 0 errors, 0 warnings, 0 section mismatches -------------------------------------------------------------------------------- fuloong2e_defconfig (mips, gcc-8) — PASS, 0 errors, 1 warning, 0 section mismatches Warnings: fs/ext4/super.c:2068:23: warning: unused variable 'sbi' [-Wunused-variable] -------------------------------------------------------------------------------- gcw0_defconfig (mips, gcc-8) — PASS, 0 errors, 0 warnings, 0 section mismatches -------------------------------------------------------------------------------- gemini_defconfig (arm, gcc-8) — PASS, 0 errors, 0 warnings, 0 section mismatches -------------------------------------------------------------------------------- gpr_defconfig (mips, gcc-8) — PASS, 0 errors, 0 warnings, 0 section mismatches -------------------------------------------------------------------------------- h3600_defconfig (arm, gcc-8) — PASS, 0 errors, 0 warnings, 0 section mismatches Section mismatches: WARNING: vmlinux.o(.text.unlikely+0x840): Section mismatch in reference from the function free_memmap() to the function .meminit.text:memblock_free() -------------------------------------------------------------------------------- h5000_defconfig (arm, gcc-8) — PASS, 0 errors, 1 warning, 0 section mismatches Warnings: WARNING: "return_address" [vmlinux] is a static EXPORT_SYMBOL_GPL -------------------------------------------------------------------------------- hackkit_defconfig (arm, gcc-8) — PASS, 0 errors, 0 warnings, 0 section mismatches Section mismatches: WARNING: vmlinux.o(.text.unlikely+0x8c4): Section mismatch in reference from the function free_memmap() to the function .meminit.text:memblock_free() -------------------------------------------------------------------------------- haps_hs_defconfig (arc, gcc-8) — PASS, 0 errors, 2 warnings, 0 section mismatches Warnings: <stdin>:1511:2: warning: #warning syscall clone3 not implemented [-Wcpp] <stdin>:1511:2: warning: #warning syscall clone3 not implemented [-Wcpp] -------------------------------------------------------------------------------- haps_hs_smp_defconfig (arc, gcc-8) — PASS, 0 errors, 2 warnings, 0 section mismatches Warnings: <stdin>:1511:2: warning: #warning syscall clone3 not implemented [-Wcpp] <stdin>:1511:2: warning: #warning syscall clone3 not implemented [-Wcpp] -------------------------------------------------------------------------------- hisi_defconfig (arm, gcc-8) — PASS, 0 errors, 1 warning, 0 section mismatches Warnings: fs/ext4/super.c:2068:23: warning: unused variable 'sbi' [-Wunused-variable] -------------------------------------------------------------------------------- hsdk_defconfig (arc, gcc-8) — PASS, 0 errors, 3 warnings, 0 section mismatches Warnings: <stdin>:1511:2: warning: #warning syscall clone3 not implemented [-Wcpp] fs/ext4/super.c:2068:23: warning: unused variable 'sbi' [-Wunused-variable] <stdin>:1511:2: warning: #warning syscall clone3 not implemented [-Wcpp] -------------------------------------------------------------------------------- i386_defconfig (i386, gcc-8) — PASS, 0 errors, 0 warnings, 0 section mismatches -------------------------------------------------------------------------------- i386_defconfig+kselftest (i386, gcc-8) — PASS, 0 errors, 30 warnings, 0 section mismatches Warnings: ./.tmp.config.aCODHAWXRn:4510:warning: override: reassigning to symbol BPF_SYSCALL ./.tmp.config.aCODHAWXRn:4513:warning: override: reassigning to symbol NET_VRF ./.tmp.config.aCODHAWXRn:4514:warning: override: reassigning to symbol NET_L3_MASTER_DEV ./.tmp.config.aCODHAWXRn:4516:warning: override: reassigning to symbol IPV6_MULTIPLE_TABLES ./.tmp.config.aCODHAWXRn:4517:warning: override: reassigning to symbol VETH ./.tmp.config.aCODHAWXRn:4521:warning: override: reassigning to symbol BRIDGE ./.tmp.config.aCODHAWXRn:4522:warning: override: reassigning to symbol VLAN_8021Q ./.tmp.config.aCODHAWXRn:4577:warning: override: reassigning to symbol NF_CONNTRACK ./.tmp.config.aCODHAWXRn:4581:warning: override: reassigning to symbol NF_NAT ./.tmp.config.aCODHAWXRn:4589:warning: override: reassigning to symbol NET_SCH_INGRESS ./.tmp.config.aCODHAWXRn:4610:warning: override: reassigning to symbol NET_ACT_GACT ./.tmp.config.aCODHAWXRn:4636:warning: override: reassigning to symbol USER_NS ./.tmp.config.aCODHAWXRn:4640:warning: override: reassigning to symbol NET_NS ./.tmp.config.aCODHAWXRn:4748:warning: override: reassigning to symbol USER_NS ./.tmp.config.aCODHAWXRn:4759:warning: override: reassigning to symbol NOTIFIER_ERROR_INJECTION ./.tmp.config.aCODHAWXRn:4769:warning: override: reassigning to symbol ANDROID ./.tmp.config.aCODHAWXRn:4776:warning: override: reassigning to symbol BPF_SYSCALL ./.tmp.config.aCODHAWXRn:4779:warning: override: reassigning to symbol TEST_BPF ./.tmp.config.aCODHAWXRn:4780:warning: override: reassigning to symbol CGROUP_BPF ./.tmp.config.aCODHAWXRn:4782:warning: override: reassigning to symbol NET_CLS_ACT ./.tmp.config.aCODHAWXRn:4783:warning: override: reassigning to symbol NET_SCHED ./.tmp.config.aCODHAWXRn:4784:warning: override: reassigning to symbol NET_SCH_INGRESS ./.tmp.config.aCODHAWXRn:4786:warning: override: reassigning to symbol IPV6 ./.tmp.config.aCODHAWXRn:4795:warning: override: reassigning to symbol NET_CLS_FLOWER ./.tmp.config.aCODHAWXRn:4801:warning: override: reassigning to symbol IPV6_GRE ./.tmp.config.aCODHAWXRn:4821:warning: override: reassigning to symbol SECURITYFS ./.tmp.config.aCODHAWXRn:4825:warning: override: reassigning to symbol STAGING ./.tmp.config.aCODHAWXRn:4826:warning: override: reassigning to symbol ANDROID ./.tmp.config.aCODHAWXRn:4843:warning: override: reassigning to symbol USER_NS fs/btrfs/tree-checker.c:230:43: warning: format '%lu' expects argument of type 'long unsigned int', but argument 5 has type 'unsigned int' [-Wformat=] -------------------------------------------------------------------------------- imote2_defconfig (arm, gcc-8) — PASS, 0 errors, 2 warnings, 0 section mismatches Warnings: WARNING: "return_address" [vmlinux] is a static EXPORT_SYMBOL_GPL fs/ext4/super.c:2068:23: warning: unused variable 'sbi' [-Wunused-variable] -------------------------------------------------------------------------------- imx_v4_v5_defconfig (arm, gcc-8) — PASS, 0 errors, 3 warnings, 0 section mismatches Warnings: fs/ext4/super.c:2068:23: warning: unused variable 'sbi' [-Wunused-variable] drivers/mtd/ubi/debug.c:512:6: warning: unused variable 'err' [-Wunused-variable] WARNING: "return_address" [vmlinux] is a static EXPORT_SYMBOL_GPL -------------------------------------------------------------------------------- imx_v6_v7_defconfig (arm, gcc-8) — PASS, 0 errors, 2 warnings, 0 section mismatches Warnings: drivers/mtd/ubi/debug.c:512:6: warning: unused variable 'err' [-Wunused-variable] WARNING: "return_address" [vmlinux] is a static EXPORT_SYMBOL_GPL -------------------------------------------------------------------------------- integrator_defconfig (arm, gcc-8) — PASS, 0 errors, 1 warning, 0 section mismatches Warnings: WARNING: "return_address" [vmlinux] is a static EXPORT_SYMBOL_GPL -------------------------------------------------------------------------------- iop32x_defconfig (arm, gcc-8) — PASS, 0 errors, 1 warning, 0 section mismatches Warnings: fs/ext4/super.c:2068:23: warning: unused variable 'sbi' [-Wunused-variable] -------------------------------------------------------------------------------- ip22_defconfig (mips, gcc-8) — PASS, 0 errors, 0 warnings, 0 section mismatches -------------------------------------------------------------------------------- ip27_defconfig (mips, gcc-8) — PASS, 0 errors, 1 warning, 0 section mismatches Warnings: fs/ext4/super.c:2068:23: warning: unused variable 'sbi' [-Wunused-variable] -------------------------------------------------------------------------------- ip28_defconfig (mips, gcc-8) — PASS, 0 errors, 0 warnings, 0 section mismatches -------------------------------------------------------------------------------- ip32_defconfig (mips, gcc-8) — PASS, 0 errors, 0 warnings, 0 section mismatches -------------------------------------------------------------------------------- ixp4xx_defconfig (arm, gcc-8) — PASS, 0 errors, 2 warnings, 0 section mismatches Warnings: fs/ext4/super.c:2068:23: warning: unused variable 'sbi' [-Wunused-variable] WARNING: "return_address" [vmlinux] is a static EXPORT_SYMBOL_GPL -------------------------------------------------------------------------------- jazz_defconfig (mips, gcc-8) — PASS, 0 errors, 1 warning, 0 section mismatches Warnings: fs/ext4/super.c:2068:23: warning: unused variable 'sbi' [-Wunused-variable] -------------------------------------------------------------------------------- jmr3927_defconfig (mips, gcc-8) — PASS, 0 errors, 0 warnings, 0 section mismatches -------------------------------------------------------------------------------- jornada720_defconfig (arm, gcc-8) — PASS, 0 errors, 0 warnings, 0 section mismatches Section mismatches: WARNING: vmlinux.o(.text.unlikely+0x7c8): Section mismatch in reference from the function free_memmap() to the function .meminit.text:memblock_free() -------------------------------------------------------------------------------- keystone_defconfig (arm, gcc-8) — PASS, 0 errors, 3 warnings, 0 section mismatches Warnings: fs/ext4/super.c:2068:23: warning: unused variable 'sbi' [-Wunused-variable] drivers/mtd/ubi/debug.c:512:6: warning: unused variable 'err' [-Wunused-variable] WARNING: "return_address" [vmlinux] is a static EXPORT_SYMBOL_GPL -------------------------------------------------------------------------------- lart_defconfig (arm, gcc-8) — PASS, 0 errors, 1 warning, 0 section mismatches Warnings: fs/ext4/super.c:2068:23: warning: unused variable 'sbi' [-Wunused-variable] Section mismatches: WARNING: vmlinux.o(.text.unlikely+0x8c4): Section mismatch in reference from the function free_memmap() to the function .meminit.text:memblock_free() -------------------------------------------------------------------------------- lasat_defconfig (mips, gcc-8) — PASS, 0 errors, 1 warning, 0 section mismatches Warnings: fs/ext4/super.c:2068:23: warning: unused variable 'sbi' [-Wunused-variable] -------------------------------------------------------------------------------- lemote2f_defconfig (mips, gcc-8) — PASS, 0 errors, 0 warnings, 0 section mismatches -------------------------------------------------------------------------------- loongson1b_defconfig (mips, gcc-8) — PASS, 0 errors, 2 warnings, 0 section mismatches Warnings: fs/ext4/super.c:2068:23: warning: unused variable 'sbi' [-Wunused-variable] drivers/mtd/ubi/debug.c:512:6: warning: unused variable 'err' [-Wunused-variable] -------------------------------------------------------------------------------- loongson1c_defconfig (mips, gcc-8) — PASS, 0 errors, 2 warnings, 0 section mismatches Warnings: fs/ext4/super.c:2068:23: warning: unused variable 'sbi' [-Wunused-variable] drivers/mtd/ubi/debug.c:512:6: warning: unused variable 'err' [-Wunused-variable] -------------------------------------------------------------------------------- loongson3_defconfig (mips, gcc-8) — PASS, 0 errors, 0 warnings, 0 section mismatches -------------------------------------------------------------------------------- lpc18xx_defconfig (arm, gcc-8) — PASS, 0 errors, 0 warnings, 0 section mismatches -------------------------------------------------------------------------------- lpc32xx_defconfig (arm, gcc-8) — PASS, 0 errors, 2 warnings, 0 section mismatches Warnings: drivers/mtd/ubi/debug.c:512:6: warning: unused variable 'err' [-Wunused-variable] WARNING: "return_address" [vmlinux] is a static EXPORT_SYMBOL_GPL -------------------------------------------------------------------------------- lpd270_defconfig (arm, gcc-8) — PASS, 0 errors, 0 warnings, 0 section mismatches -------------------------------------------------------------------------------- lubbock_defconfig (arm, gcc-8) — PASS, 0 errors, 0 warnings, 0 section mismatches -------------------------------------------------------------------------------- magician_defconfig (arm, gcc-8) — PASS, 0 errors, 1 warning, 0 section mismatches Warnings: WARNING: "return_address" [vmlinux] is a static EXPORT_SYMBOL_GPL -------------------------------------------------------------------------------- mainstone_defconfig (arm, gcc-8) — PASS, 0 errors, 0 warnings, 0 section mismatches -------------------------------------------------------------------------------- malta_defconfig (mips, gcc-8) — PASS, 0 errors, 1 warning, 0 section mismatches Warnings: drivers/mtd/ubi/debug.c:512:6: warning: unused variable 'err' [-Wunused-variable] -------------------------------------------------------------------------------- malta_kvm_defconfig (mips, gcc-8) — PASS, 0 errors, 1 warning, 0 section mismatches Warnings: drivers/mtd/ubi/debug.c:512:6: warning: unused variable 'err' [-Wunused-variable] -------------------------------------------------------------------------------- malta_kvm_guest_defconfig (mips, gcc-8) — PASS, 0 errors, 1 warning, 0 section mismatches Warnings: drivers/mtd/ubi/debug.c:512:6: warning: unused variable 'err' [-Wunused-variable] -------------------------------------------------------------------------------- malta_qemu_32r6_defconfig (mips, gcc-8) — PASS, 0 errors, 1 warning, 0 section mismatches Warnings: {standard input}:134: Warning: macro instruction expanded into multiple instructions -------------------------------------------------------------------------------- maltaaprp_defconfig (mips, gcc-8) — PASS, 0 errors, 0 warnings, 0 section mismatches -------------------------------------------------------------------------------- maltasmvp_defconfig (mips, gcc-8) — PASS, 0 errors, 0 warnings, 0 section mismatches -------------------------------------------------------------------------------- maltasmvp_eva_defconfig (mips, gcc-8) — PASS, 0 errors, 0 warnings, 0 section mismatches -------------------------------------------------------------------------------- maltaup_defconfig (mips, gcc-8) — PASS, 0 errors, 0 warnings, 0 section mismatches -------------------------------------------------------------------------------- maltaup_xpa_defconfig (mips, gcc-8) — PASS, 0 errors, 1 warning, 0 section mismatches Warnings: drivers/mtd/ubi/debug.c:512:6: warning: unused variable 'err' [-Wunused-variable] -------------------------------------------------------------------------------- markeins_defconfig (mips, gcc-8) — PASS, 0 errors, 1 warning, 0 section mismatches Warnings: fs/ext4/super.c:2068:23: warning: unused variable 'sbi' [-Wunused-variable] -------------------------------------------------------------------------------- milbeaut_m10v_defconfig (arm, gcc-8) — PASS, 0 errors, 2 warnings, 0 section mismatches Warnings: fs/ext4/super.c:2068:23: warning: unused variable 'sbi' [-Wunused-variable] WARNING: "return_address" [vmlinux] is a static EXPORT_SYMBOL_GPL -------------------------------------------------------------------------------- mini2440_defconfig (arm, gcc-8) — PASS, 0 errors, 2 warnings, 0 section mismatches Warnings: fs/ext4/super.c:2068:23: warning: unused variable 'sbi' [-Wunused-variable] WARNING: "return_address" [vmlinux] is a static EXPORT_SYMBOL_GPL -------------------------------------------------------------------------------- mips_paravirt_defconfig (mips, gcc-8) — PASS, 0 errors, 1 warning, 0 section mismatches Warnings: fs/ext4/super.c:2068:23: warning: unused variable 'sbi' [-Wunused-variable] -------------------------------------------------------------------------------- mmp2_defconfig (arm, gcc-8) — PASS, 0 errors, 2 warnings, 0 section mismatches Warnings: fs/ext4/super.c:2068:23: warning: unused variable 'sbi' [-Wunused-variable] WARNING: "return_address" [vmlinux] is a static EXPORT_SYMBOL_GPL -------------------------------------------------------------------------------- moxart_defconfig (arm, gcc-8) — PASS, 0 errors, 1 warning, 0 section mismatches Warnings: fs/ext4/super.c:2068:23: warning: unused variable 'sbi' [-Wunused-variable] -------------------------------------------------------------------------------- mpc30x_defconfig (mips, gcc-8) — PASS, 0 errors, 0 warnings, 0 section mismatches -------------------------------------------------------------------------------- mps2_defconfig (arm, gcc-8) — PASS, 0 errors, 0 warnings, 0 section mismatches -------------------------------------------------------------------------------- msp71xx_defconfig (mips, gcc-8) — PASS, 0 errors, 0 warnings, 0 section mismatches -------------------------------------------------------------------------------- mtx1_defconfig (mips, gcc-8) — PASS, 0 errors, 0 warnings, 0 section mismatches -------------------------------------------------------------------------------- multi_v4t_defconfig (arm, gcc-8) — PASS, 0 errors, 0 warnings, 0 section mismatches -------------------------------------------------------------------------------- multi_v5_defconfig (arm, gcc-8) — PASS, 0 errors, 3 warnings, 0 section mismatches Warnings: fs/ext4/super.c:2068:23: warning: unused variable 'sbi' [-Wunused-variable] drivers/mtd/ubi/debug.c:512:6: warning: unused variable 'err' [-Wunused-variable] WARNING: "return_address" [vmlinux] is a static EXPORT_SYMBOL_GPL -------------------------------------------------------------------------------- multi_v7_defconfig (arm, gcc-8) — PASS, 0 errors, 3 warnings, 0 section mismatches Warnings: fs/ext4/super.c:2068:23: warning: unused variable 'sbi' [-Wunused-variable] drivers/mtd/ubi/debug.c:512:6: warning: unused variable 'err' [-Wunused-variable] WARNING: "return_address" [vmlinux] is a static EXPORT_SYMBOL_GPL -------------------------------------------------------------------------------- multi_v7_defconfig+CONFIG_CPU_BIG_ENDIAN=y (arm, gcc-8) — PASS, 0 errors, 3 warnings, 0 section mismatches Warnings: fs/ext4/super.c:2068:23: warning: unused variable 'sbi' [-Wunused-variable] drivers/mtd/ubi/debug.c:512:6: warning: unused variable 'err' [-Wunused-variable] WARNING: "return_address" [vmlinux] is a static EXPORT_SYMBOL_GPL -------------------------------------------------------------------------------- multi_v7_defconfig+CONFIG_EFI=y+CONFIG_ARM_LPAE=y (arm, gcc-8) — PASS, 0 errors, 3 warnings, 0 section mismatches Warnings: fs/ext4/super.c:2068:23: warning: unused variable 'sbi' [-Wunused-variable] drivers/mtd/ubi/debug.c:512:6: warning: unused variable 'err' [-Wunused-variable] WARNING: "return_address" [vmlinux] is a static EXPORT_SYMBOL_GPL -------------------------------------------------------------------------------- multi_v7_defconfig+CONFIG_SMP=n (arm, gcc-8) — PASS, 0 errors, 3 warnings, 0 section mismatches Warnings: fs/ext4/super.c:2068:23: warning: unused variable 'sbi' [-Wunused-variable] drivers/mtd/ubi/debug.c:512:6: warning: unused variable 'err' [-Wunused-variable] WARNING: "return_address" [vmlinux] is a static EXPORT_SYMBOL_GPL -------------------------------------------------------------------------------- multi_v7_defconfig+kselftest (arm, gcc-8) — PASS, 0 errors, 32 warnings, 0 section mismatches Warnings: ./.tmp.config.CThNBwBDaB:8291:warning: override: reassigning to symbol BPF_SYSCALL ./.tmp.config.CThNBwBDaB:8294:warning: override: reassigning to symbol NET_VRF ./.tmp.config.CThNBwBDaB:8295:warning: override: reassigning to symbol NET_L3_MASTER_DEV ./.tmp.config.CThNBwBDaB:8297:warning: override: reassigning to symbol IPV6_MULTIPLE_TABLES ./.tmp.config.CThNBwBDaB:8298:warning: override: reassigning to symbol VETH ./.tmp.config.CThNBwBDaB:8302:warning: override: reassigning to symbol BRIDGE ./.tmp.config.CThNBwBDaB:8303:warning: override: reassigning to symbol VLAN_8021Q ./.tmp.config.CThNBwBDaB:8358:warning: override: reassigning to symbol NF_CONNTRACK ./.tmp.config.CThNBwBDaB:8362:warning: override: reassigning to symbol NF_NAT ./.tmp.config.CThNBwBDaB:8370:warning: override: reassigning to symbol NET_SCH_INGRESS ./.tmp.config.CThNBwBDaB:8391:warning: override: reassigning to symbol NET_ACT_GACT ./.tmp.config.CThNBwBDaB:8417:warning: override: reassigning to symbol USER_NS ./.tmp.config.CThNBwBDaB:8421:warning: override: reassigning to symbol NET_NS ./.tmp.config.CThNBwBDaB:8529:warning: override: reassigning to symbol USER_NS ./.tmp.config.CThNBwBDaB:8540:warning: override: reassigning to symbol NOTIFIER_ERROR_INJECTION ./.tmp.config.CThNBwBDaB:8550:warning: override: reassigning to symbol ANDROID ./.tmp.config.CThNBwBDaB:8557:warning: override: reassigning to symbol BPF_SYSCALL ./.tmp.config.CThNBwBDaB:8560:warning: override: reassigning to symbol TEST_BPF ./.tmp.config.CThNBwBDaB:8561:warning: override: reassigning to symbol CGROUP_BPF ./.tmp.config.CThNBwBDaB:8563:warning: override: reassigning to symbol NET_CLS_ACT ./.tmp.config.CThNBwBDaB:8564:warning: override: reassigning to symbol NET_SCHED ./.tmp.config.CThNBwBDaB:8565:warning: override: reassigning to symbol NET_SCH_INGRESS ./.tmp.config.CThNBwBDaB:8567:warning: override: reassigning to symbol IPV6 ./.tmp.config.CThNBwBDaB:8576:warning: override: reassigning to symbol NET_CLS_FLOWER ./.tmp.config.CThNBwBDaB:8582:warning: override: reassigning to symbol IPV6_GRE ./.tmp.config.CThNBwBDaB:8602:warning: override: reassigning to symbol SECURITYFS ./.tmp.config.CThNBwBDaB:8606:warning: override: reassigning to symbol STAGING ./.tmp.config.CThNBwBDaB:8607:warning: override: reassigning to symbol ANDROID ./.tmp.config.CThNBwBDaB:8624:warning: override: reassigning to symbol USER_NS fs/ext4/super.c:2068:23: warning: unused variable 'sbi' [-Wunused-variable] drivers/mtd/ubi/debug.c:512:6: warning: unused variable 'err' [-Wunused-variable] fs/btrfs/tree-checker.c:230:43: warning: format '%lu' expects argument of type 'long unsigned int', but argument 5 has type 'unsigned int' [-Wformat=] -------------------------------------------------------------------------------- mv78xx0_defconfig (arm, gcc-8) — PASS, 0 errors, 2 warnings, 0 section mismatches Warnings: fs/ext4/super.c:2068:23: warning: unused variable 'sbi' [-Wunused-variable] WARNING: "return_address" [vmlinux] is a static EXPORT_SYMBOL_GPL -------------------------------------------------------------------------------- mvebu_v5_defconfig (arm, gcc-8) — PASS, 0 errors, 2 warnings, 0 section mismatches Warnings: fs/ext4/super.c:2068:23: warning: unused variable 'sbi' [-Wunused-variable] WARNING: "return_address" [vmlinux] is a static EXPORT_SYMBOL_GPL -------------------------------------------------------------------------------- mvebu_v7_defconfig (arm, gcc-8) — PASS, 0 errors, 3 warnings, 0 section mismatches Warnings: fs/ext4/super.c:2068:23: warning: unused variable 'sbi' [-Wunused-variable] drivers/mtd/ubi/debug.c:512:6: warning: unused variable 'err' [-Wunused-variable] WARNING: "return_address" [vmlinux] is a static EXPORT_SYMBOL_GPL -------------------------------------------------------------------------------- mxs_defconfig (arm, gcc-8) — PASS, 0 errors, 3 warnings, 0 section mismatches Warnings: fs/ext4/super.c:2068:23: warning: unused variable 'sbi' [-Wunused-variable] drivers/mtd/ubi/debug.c:512:6: warning: unused variable 'err' [-Wunused-variable] WARNING: "return_address" [vmlinux] is a static EXPORT_SYMBOL_GPL -------------------------------------------------------------------------------- neponset_defconfig (arm, gcc-8) — PASS, 0 errors, 0 warnings, 0 section mismatches Section mismatches: WARNING: vmlinux.o(.text.unlikely+0x8c4): Section mismatch in reference from the function free_memmap() to the function .meminit.text:memblock_free() -------------------------------------------------------------------------------- netwinder_defconfig (arm, gcc-8) — PASS, 0 errors, 0 warnings, 0 section mismatches -------------------------------------------------------------------------------- nhk8815_defconfig (arm, gcc-8) — PASS, 0 errors, 2 warnings, 0 section mismatches Warnings: fs/ext4/super.c:2068:23: warning: unused variable 'sbi' [-Wunused-variable] WARNING: "return_address" [vmlinux] is a static EXPORT_SYMBOL_GPL -------------------------------------------------------------------------------- nlm_xlp_defconfig (mips, gcc-8) — PASS, 0 errors, 1 warning, 0 section mismatches Warnings: fs/ext4/super.c:2068:23: warning: unused variable 'sbi' [-Wunused-variable] -------------------------------------------------------------------------------- nlm_xlr_defconfig (mips, gcc-8) — PASS, 0 errors, 1 warning, 0 section mismatches Warnings: fs/btrfs/tree-checker.c:230:43: warning: format '%lu' expects argument of type 'long unsigned int', but argument 5 has type 'unsigned int' [-Wformat=] -------------------------------------------------------------------------------- nsimosci_hs_defconfig (arc, gcc-8) — PASS, 0 errors, 2 warnings, 0 section mismatches Warnings: <stdin>:1511:2: warning: #warning syscall clone3 not implemented [-Wcpp] <stdin>:1511:2: warning: #warning syscall clone3 not implemented [-Wcpp] -------------------------------------------------------------------------------- nsimosci_hs_smp_defconfig (arc, gcc-8) — PASS, 0 errors, 2 warnings, 0 section mismatches Warnings: <stdin>:1511:2: warning: #warning syscall clone3 not implemented [-Wcpp] <stdin>:1511:2: warning: #warning syscall clone3 not implemented [-Wcpp] -------------------------------------------------------------------------------- omap1_defconfig (arm, gcc-8) — PASS, 0 errors, 2 warnings, 0 section mismatches Warnings: fs/ext4/super.c:2068:23: warning: unused variable 'sbi' [-Wunused-variable] WARNING: "return_address" [vmlinux] is a static EXPORT_SYMBOL_GPL -------------------------------------------------------------------------------- omap2plus_defconfig (arm, gcc-8) — PASS, 0 errors, 2 warnings, 0 section mismatches Warnings: drivers/mtd/ubi/debug.c:512:6: warning: unused variable 'err' [-Wunused-variable] WARNING: "return_address" [vmlinux] is a static EXPORT_SYMBOL_GPL -------------------------------------------------------------------------------- omega2p_defconfig (mips, gcc-8) — PASS, 0 errors, 0 warnings, 0 section mismatches -------------------------------------------------------------------------------- orion5x_defconfig (arm, gcc-8) — PASS, 0 errors, 2 warnings, 0 section mismatches Warnings: fs/ext4/super.c:2068:23: warning: unused variable 'sbi' [-Wunused-variable] WARNING: "return_address" [vmlinux] is a static EXPORT_SYMBOL_GPL -------------------------------------------------------------------------------- oxnas_v6_defconfig (arm, gcc-8) — PASS, 0 errors, 3 warnings, 0 section mismatches Warnings: fs/ext4/super.c:2068:23: warning: unused variable 'sbi' [-Wunused-variable] drivers/mtd/ubi/debug.c:512:6: warning: unused variable 'err' [-Wunused-variable] WARNING: "return_address" [vmlinux] is a static EXPORT_SYMBOL_GPL -------------------------------------------------------------------------------- palmz72_defconfig (arm, gcc-8) — PASS, 0 errors, 2 warnings, 0 section mismatches Warnings: fs/ext4/super.c:2068:23: warning: unused variable 'sbi' [-Wunused-variable] WARNING: "return_address" [vmlinux] is a static EXPORT_SYMBOL_GPL -------------------------------------------------------------------------------- pcm027_defconfig (arm, gcc-8) — PASS, 0 errors, 2 warnings, 0 section mismatches Warnings: WARNING: "return_address" [vmlinux] is a static EXPORT_SYMBOL_GPL fs/ext4/super.c:2068:23: warning: unused variable 'sbi' [-Wunused-variable] -------------------------------------------------------------------------------- pic32mzda_defconfig (mips, gcc-8) — PASS, 0 errors, 1 warning, 0 section mismatches Warnings: fs/ext4/super.c:2068:23: warning: unused variable 'sbi' [-Wunused-variable] -------------------------------------------------------------------------------- pistachio_defconfig (mips, gcc-8) — PASS, 0 errors, 2 warnings, 0 section mismatches Warnings: fs/ext4/super.c:2068:23: warning: unused variable 'sbi' [-Wunused-variable] drivers/mtd/ubi/debug.c:512:6: warning: unused variable 'err' [-Wunused-variable] -------------------------------------------------------------------------------- pleb_defconfig (arm, gcc-8) — PASS, 0 errors, 1 warning, 0 section mismatches Warnings: fs/ext4/super.c:2068:23: warning: unused variable 'sbi' [-Wunused-variable] Section mismatches: WARNING: vmlinux.o(.text.unlikely+0x840): Section mismatch in reference from the function free_memmap() to the function .meminit.text:memblock_free() -------------------------------------------------------------------------------- pnx8335_stb225_defconfig (mips, gcc-8) — PASS, 0 errors, 0 warnings, 0 section mismatches -------------------------------------------------------------------------------- prima2_defconfig (arm, gcc-8) — PASS, 0 errors, 1 warning, 0 section mismatches Warnings: WARNING: "return_address" [vmlinux] is a static EXPORT_SYMBOL_GPL -------------------------------------------------------------------------------- pxa168_defconfig (arm, gcc-8) — PASS, 0 errors, 1 warning, 0 section mismatches Warnings: WARNING: "return_address" [vmlinux] is a static EXPORT_SYMBOL_GPL -------------------------------------------------------------------------------- pxa255-idp_defconfig (arm, gcc-8) — PASS, 0 errors, 0 warnings, 0 section mismatches -------------------------------------------------------------------------------- pxa3xx_defconfig (arm, gcc-8) — PASS, 0 errors, 1 warning, 0 section mismatches Warnings: WARNING: "return_address" [vmlinux] is a static EXPORT_SYMBOL_GPL -------------------------------------------------------------------------------- pxa910_defconfig (arm, gcc-8) — PASS, 0 errors, 1 warning, 0 section mismatches Warnings: WARNING: "return_address" [vmlinux] is a static EXPORT_SYMBOL_GPL -------------------------------------------------------------------------------- pxa_defconfig (arm, gcc-8) — FAIL, 1 error, 0 warnings, 0 section mismatches Errors: arch/arm/mach-pxa/icontrol.c:92:23: error: 'mcp251x_info' undeclared here (not in a function); did you mean 'mcp251x_board_info'? -------------------------------------------------------------------------------- qcom_defconfig (arm, gcc-8) — PASS, 0 errors, 2 warnings, 0 section mismatches Warnings: fs/ext4/super.c:2068:23: warning: unused variable 'sbi' [-Wunused-variable] WARNING: "return_address" [vmlinux] is a static EXPORT_SYMBOL_GPL -------------------------------------------------------------------------------- qi_lb60_defconfig (mips, gcc-8) — PASS, 0 errors, 2 warnings, 0 section mismatches Warnings: fs/ext4/super.c:2068:23: warning: unused variable 'sbi' [-Wunused-variable] drivers/mtd/ubi/debug.c:512:6: warning: unused variable 'err' [-Wunused-variable] -------------------------------------------------------------------------------- rb532_defconfig (mips, gcc-8) — PASS, 0 errors, 0 warnings, 0 section mismatches -------------------------------------------------------------------------------- rbtx49xx_defconfig (mips, gcc-8) — PASS, 0 errors, 1 warning, 0 section mismatches Warnings: sound/soc/txx9/txx9aclc.c:54:30: warning: unused variable 'rtd' [-Wunused-variable] -------------------------------------------------------------------------------- realview_defconfig (arm, gcc-8) — PASS, 0 errors, 1 warning, 0 section mismatches Warnings: WARNING: "return_address" [vmlinux] is a static EXPORT_SYMBOL_GPL -------------------------------------------------------------------------------- rm200_defconfig (mips, gcc-8) — PASS, 0 errors, 1 warning, 0 section mismatches Warnings: fs/ext4/super.c:2068:23: warning: unused variable 'sbi' [-Wunused-variable] -------------------------------------------------------------------------------- rpc_defconfig (arm, gcc-8) — PASS, 0 errors, 1 warning, 0 section mismatches Warnings: fs/ext4/super.c:2068:23: warning: unused variable 'sbi' [-Wunused-variable] Section mismatches: WARNING: vmlinux.o(.text.unlikely+0x8e4): Section mismatch in reference from the function free_memmap() to the function .meminit.text:memblock_free() -------------------------------------------------------------------------------- rt305x_defconfig (mips, gcc-8) — PASS, 0 errors, 0 warnings, 0 section mismatches -------------------------------------------------------------------------------- rv32_defconfig (riscv, gcc-8) — PASS, 0 errors, 7 warnings, 0 section mismatches Warnings: <stdin>:830:2: warning: #warning syscall fstat64 not implemented [-Wcpp] <stdin>:1127:2: warning: #warning syscall fstatat64 not implemented [-Wcpp] <stdin>:1511:2: warning: #warning syscall clone3 not implemented [-Wcpp] fs/ext4/super.c:2068:23: warning: unused variable 'sbi' [-Wunused-variable] <stdin>:830:2: warning: #warning syscall fstat64 not implemented [-Wcpp] <stdin>:1127:2: warning: #warning syscall fstatat64 not implemented [-Wcpp] <stdin>:1511:2: warning: #warning syscall clone3 not implemented [-Wcpp] -------------------------------------------------------------------------------- s3c2410_defconfig (arm, gcc-8) — PASS, 0 errors, 1 warning, 0 section mismatches Warnings: fs/ext4/super.c:2068:23: warning: unused variable 'sbi' [-Wunused-variable] -------------------------------------------------------------------------------- s3c6400_defconfig (arm, gcc-8) — PASS, 0 errors, 2 warnings, 0 section mismatches Warnings: fs/ext4/super.c:2068:23: warning: unused variable 'sbi' [-Wunused-variable] WARNING: "return_address" [vmlinux] is a static EXPORT_SYMBOL_GPL -------------------------------------------------------------------------------- s5pv210_defconfig (arm, gcc-8) — PASS, 0 errors, 2 warnings, 0 section mismatches Warnings: fs/ext4/super.c:2068:23: warning: unused variable 'sbi' [-Wunused-variable] WARNING: "return_address" [vmlinux] is a static EXPORT_SYMBOL_GPL -------------------------------------------------------------------------------- sama5_defconfig (arm, gcc-8) — PASS, 0 errors, 3 warnings, 0 section mismatches Warnings: fs/ext4/super.c:2068:23: warning: unused variable 'sbi' [-Wunused-variable] drivers/mtd/ubi/debug.c:512:6: warning: unused variable 'err' [-Wunused-variable] WARNING: "return_address" [vmlinux] is a static EXPORT_SYMBOL_GPL -------------------------------------------------------------------------------- sb1250_swarm_defconfig (mips, gcc-8) — PASS, 0 errors, 0 warnings, 0 section mismatches -------------------------------------------------------------------------------- shannon_defconfig (arm, gcc-8) — PASS, 0 errors, 0 warnings, 0 section mismatches Section mismatches: WARNING: vmlinux.o(.text.unlikely+0x8c4): Section mismatch in reference from the function free_memmap() to the function .meminit.text:memblock_free() -------------------------------------------------------------------------------- shmobile_defconfig (arm, gcc-8) — PASS, 0 errors, 0 warnings, 0 section mismatches -------------------------------------------------------------------------------- simpad_defconfig (arm, gcc-8) — PASS, 0 errors, 1 warning, 0 section mismatches Warnings: fs/ext4/super.c:2068:23: warning: unused variable 'sbi' [-Wunused-variable] Section mismatches: WARNING: vmlinux.o(.text.unlikely+0x84c): Section mismatch in reference from the function free_memmap() to the function .meminit.text:memblock_free() -------------------------------------------------------------------------------- socfpga_defconfig (arm, gcc-8) — PASS, 0 errors, 1 warning, 0 section mismatches Warnings: fs/ext4/super.c:2068:23: warning: unused variable 'sbi' [-Wunused-variable] -------------------------------------------------------------------------------- spear13xx_defconfig (arm, gcc-8) — PASS, 0 errors, 2 warnings, 0 section mismatches Warnings: fs/ext4/super.c:2068:23: warning: unused variable 'sbi' [-Wunused-variable] WARNING: "return_address" [vmlinux] is a static EXPORT_SYMBOL_GPL -------------------------------------------------------------------------------- spear3xx_defconfig (arm, gcc-8) — PASS, 0 errors, 1 warning, 0 section mismatches Warnings: fs/ext4/super.c:2068:23: warning: unused variable 'sbi' [-Wunused-variable] -------------------------------------------------------------------------------- spear6xx_defconfig (arm, gcc-8) — PASS, 0 errors, 1 warning, 0 section mismatches Warnings: fs/ext4/super.c:2068:23: warning: unused variable 'sbi' [-Wunused-variable] -------------------------------------------------------------------------------- spitz_defconfig (arm, gcc-8) — PASS, 0 errors, 1 warning, 0 section mismatches Warnings: fs/ext4/super.c:2068:23: warning: unused variable 'sbi' [-Wunused-variable] -------------------------------------------------------------------------------- stm32_defconfig (arm, gcc-8) — PASS, 0 errors, 1 warning, 0 section mismatches Warnings: fs/ext4/super.c:2068:23: warning: unused variable 'sbi' [-Wunused-variable] -------------------------------------------------------------------------------- sunxi_defconfig (arm, gcc-8) — PASS, 0 errors, 2 warnings, 0 section mismatches Warnings: fs/ext4/super.c:2068:23: warning: unused variable 'sbi' [-Wunused-variable] WARNING: "return_address" [vmlinux] is a static EXPORT_SYMBOL_GPL -------------------------------------------------------------------------------- tango4_defconfig (arm, gcc-8) — PASS, 0 errors, 2 warnings, 0 section mismatches Warnings: fs/ext4/super.c:2068:23: warning: unused variable 'sbi' [-Wunused-variable] WARNING: "return_address" [vmlinux] is a static EXPORT_SYMBOL_GPL -------------------------------------------------------------------------------- tb0219_defconfig (mips, gcc-8) — PASS, 0 errors, 1 warning, 0 section mismatches Warnings: fs/ext4/super.c:2068:23: warning: unused variable 'sbi' [-Wunused-variable] -------------------------------------------------------------------------------- tb0226_defconfig (mips, gcc-8) — PASS, 0 errors, 0 warnings, 0 section mismatches -------------------------------------------------------------------------------- tb0287_defconfig (mips, gcc-8) — PASS, 0 errors, 1 warning, 0 section mismatches Warnings: fs/ext4/super.c:2068:23: warning: unused variable 'sbi' [-Wunused-variable] -------------------------------------------------------------------------------- tct_hammer_defconfig (arm, gcc-8) — PASS, 0 errors, 0 warnings, 0 section mismatches -------------------------------------------------------------------------------- tegra_defconfig (arm, gcc-8) — PASS, 0 errors, 2 warnings, 0 section mismatches Warnings: fs/ext4/super.c:2068:23: warning: unused variable 'sbi' [-Wunused-variable] WARNING: "return_address" [vmlinux] is a static EXPORT_SYMBOL_GPL -------------------------------------------------------------------------------- tinyconfig (i386, gcc-8) — PASS, 0 errors, 0 warnings, 0 section mismatches -------------------------------------------------------------------------------- tinyconfig (arm64, gcc-8) — PASS, 0 errors, 0 warnings, 0 section mismatches -------------------------------------------------------------------------------- tinyconfig (x86_64, gcc-8) — PASS, 0 errors, 1 warning, 0 section mismatches Warnings: .config:1169:warning: override: UNWINDER_GUESS changes choice state -------------------------------------------------------------------------------- tinyconfig (arm, gcc-8) — PASS, 0 errors, 0 warnings, 0 section mismatches -------------------------------------------------------------------------------- tinyconfig (mips, gcc-8) — PASS, 0 errors, 0 warnings, 0 section mismatches -------------------------------------------------------------------------------- tinyconfig (riscv, gcc-8) — PASS, 0 errors, 0 warnings, 0 section mismatches -------------------------------------------------------------------------------- tinyconfig (arc, gcc-8) — PASS, 0 errors, 1 warning, 0 section mismatches Warnings: <stdin>:1511:2: warning: #warning syscall clone3 not implemented [-Wcpp] -------------------------------------------------------------------------------- trizeps4_defconfig (arm, gcc-8) — PASS, 0 errors, 2 warnings, 0 section mismatches Warnings: fs/ext4/super.c:2068:23: warning: unused variable 'sbi' [-Wunused-variable] WARNING: "return_address" [vmlinux] is a static EXPORT_SYMBOL_GPL -------------------------------------------------------------------------------- u300_defconfig (arm, gcc-8) — PASS, 0 errors, 1 warning, 0 section mismatches Warnings: WARNING: "return_address" [vmlinux] is a static EXPORT_SYMBOL_GPL -------------------------------------------------------------------------------- u8500_defconfig (arm, gcc-8) — PASS, 0 errors, 2 warnings, 0 section mismatches Warnings: fs/ext4/super.c:2068:23: warning: unused variable 'sbi' [-Wunused-variable] WARNING: "return_address" [vmlinux] is a static EXPORT_SYMBOL_GPL -------------------------------------------------------------------------------- vdk_hs38_defconfig (arc, gcc-8) — PASS, 0 errors, 2 warnings, 0 section mismatches Warnings: <stdin>:1511:2: warning: #warning syscall clone3 not implemented [-Wcpp] fs/ext4/super.c:2068:23: warning: unused variable 'sbi' [-Wunused-variable] -------------------------------------------------------------------------------- vdk_hs38_smp_defconfig (arc, gcc-8) — PASS, 0 errors, 2 warnings, 0 section mismatches Warnings: <stdin>:1511:2: warning: #warning syscall clone3 not implemented [-Wcpp] fs/ext4/super.c:2068:23: warning: unused variable 'sbi' [-Wunused-variable] -------------------------------------------------------------------------------- versatile_defconfig (arm, gcc-8) — PASS, 0 errors, 1 warning, 0 section mismatches Warnings: WARNING: "return_address" [vmlinux] is a static EXPORT_SYMBOL_GPL -------------------------------------------------------------------------------- vexpress_defconfig (arm, gcc-8) — PASS, 0 errors, 3 warnings, 0 section mismatches Warnings: fs/ext4/super.c:2068:23: warning: unused variable 'sbi' [-Wunused-variable] drivers/mtd/ubi/debug.c:512:6: warning: unused variable 'err' [-Wunused-variable] WARNING: "return_address" [vmlinux] is a static EXPORT_SYMBOL_GPL -------------------------------------------------------------------------------- vf610m4_defconfig (arm, gcc-8) — PASS, 0 errors, 1 warning, 0 section mismatches Warnings: fs/ext4/super.c:2068:23: warning: unused variable 'sbi' [-Wunused-variable] -------------------------------------------------------------------------------- viper_defconfig (arm, gcc-8) — PASS, 0 errors, 2 warnings, 0 section mismatches Warnings: WARNING: "return_address" [vmlinux] is a static EXPORT_SYMBOL_GPL fs/ext4/super.c:2068:23: warning: unused variable 'sbi' [-Wunused-variable] -------------------------------------------------------------------------------- vocore2_defconfig (mips, gcc-8) — PASS, 0 errors, 0 warnings, 0 section mismatches -------------------------------------------------------------------------------- vt8500_v6_v7_defconfig (arm, gcc-8) — PASS, 0 errors, 1 warning, 0 section mismatches Warnings: fs/ext4/super.c:2068:23: warning: unused variable 'sbi' [-Wunused-variable] -------------------------------------------------------------------------------- workpad_defconfig (mips, gcc-8) — PASS, 0 errors, 1 warning, 0 section mismatches Warnings: fs/ext4/super.c:2068:23: warning: unused variable 'sbi' [-Wunused-variable] -------------------------------------------------------------------------------- x86_64_defconfig (x86_64, gcc-8) — PASS, 0 errors, 0 warnings, 0 section mismatches -------------------------------------------------------------------------------- x86_64_defconfig+kselftest (x86_64, gcc-8) — PASS, 0 errors, 29 warnings, 0 section mismatches Warnings: ./.tmp.config.VbD7Pa1Q9O:4573:warning: override: reassigning to symbol BPF_SYSCALL ./.tmp.config.VbD7Pa1Q9O:4576:warning: override: reassigning to symbol NET_VRF ./.tmp.config.VbD7Pa1Q9O:4577:warning: override: reassigning to symbol NET_L3_MASTER_DEV ./.tmp.config.VbD7Pa1Q9O:4579:warning: override: reassigning to symbol IPV6_MULTIPLE_TABLES ./.tmp.config.VbD7Pa1Q9O:4580:warning: override: reassigning to symbol VETH ./.tmp.config.VbD7Pa1Q9O:4584:warning: override: reassigning to symbol BRIDGE ./.tmp.config.VbD7Pa1Q9O:4585:warning: override: reassigning to symbol VLAN_8021Q ./.tmp.config.VbD7Pa1Q9O:4640:warning: override: reassigning to symbol NF_CONNTRACK ./.tmp.config.VbD7Pa1Q9O:4644:warning: override: reassigning to symbol NF_NAT ./.tmp.config.VbD7Pa1Q9O:4652:warning: override: reassigning to symbol NET_SCH_INGRESS ./.tmp.config.VbD7Pa1Q9O:4673:warning: override: reassigning to symbol NET_ACT_GACT ./.tmp.config.VbD7Pa1Q9O:4699:warning: override: reassigning to symbol USER_NS ./.tmp.config.VbD7Pa1Q9O:4703:warning: override: reassigning to symbol NET_NS ./.tmp.config.VbD7Pa1Q9O:4811:warning: override: reassigning to symbol USER_NS ./.tmp.config.VbD7Pa1Q9O:4822:warning: override: reassigning to symbol NOTIFIER_ERROR_INJECTION ./.tmp.config.VbD7Pa1Q9O:4832:warning: override: reassigning to symbol ANDROID ./.tmp.config.VbD7Pa1Q9O:4839:warning: override: reassigning to symbol BPF_SYSCALL ./.tmp.config.VbD7Pa1Q9O:4842:warning: override: reassigning to symbol TEST_BPF ./.tmp.config.VbD7Pa1Q9O:4843:warning: override: reassigning to symbol CGROUP_BPF ./.tmp.config.VbD7Pa1Q9O:4845:warning: override: reassigning to symbol NET_CLS_ACT ./.tmp.config.VbD7Pa1Q9O:4846:warning: override: reassigning to symbol NET_SCHED ./.tmp.config.VbD7Pa1Q9O:4847:warning: override: reassigning to symbol NET_SCH_INGRESS ./.tmp.config.VbD7Pa1Q9O:4849:warning: override: reassigning to symbol IPV6 ./.tmp.config.VbD7Pa1Q9O:4858:warning: override: reassigning to symbol NET_CLS_FLOWER ./.tmp.config.VbD7Pa1Q9O:4864:warning: override: reassigning to symbol IPV6_GRE ./.tmp.config.VbD7Pa1Q9O:4884:warning: override: reassigning to symbol SECURITYFS ./.tmp.config.VbD7Pa1Q9O:4888:warning: override: reassigning to symbol STAGING ./.tmp.config.VbD7Pa1Q9O:4889:warning: override: reassigning to symbol ANDROID ./.tmp.config.VbD7Pa1Q9O:4906:warning: override: reassigning to symbol USER_NS -------------------------------------------------------------------------------- x86_64_defconfig+kvm_guest (x86_64, gcc-8) — PASS, 0 errors, 0 warnings, 0 section mismatches -------------------------------------------------------------------------------- xcep_defconfig (arm, gcc-8) — PASS, 0 errors, 1 warning, 0 section mismatches Warnings: WARNING: "return_address" [vmlinux] is a static EXPORT_SYMBOL_GPL -------------------------------------------------------------------------------- xway_defconfig (mips, gcc-8) — PASS, 0 errors, 0 warnings, 0 section mismatches -------------------------------------------------------------------------------- zeus_defconfig (arm, gcc-8) — PASS, 0 errors, 2 warnings, 0 section mismatches Warnings: fs/ext4/super.c:2068:23: warning: unused variable 'sbi' [-Wunused-variable] WARNING: "return_address" [vmlinux] is a static EXPORT_SYMBOL_GPL -------------------------------------------------------------------------------- zx_defconfig (arm, gcc-8) — PASS, 0 errors, 1 warning, 0 section mismatches Warnings: fs/ext4/super.c:2068:23: warning: unused variable 'sbi' [-Wunused-variable] --- For more info write to <info(a)kernelci.org>
5 years, 6 months
1
0
0
0
soc/for-next baseline: 134 runs, 4 regressions (v5.4-rc2-1161-g2b3cbb21ceaf)
by kernelci.org bot
soc/for-next baseline: 134 runs, 4 regressions (v5.4-rc2-1161-g2b3cbb21ceaf) Test results summary -------------------- run | platform | arch | lab | compiler | defconfig | results ----+------------------------------+--------+---------------+----------+------------------------------+-------- 1 | am335x-boneblack | arm | lab-baylibre | gcc-8 | multi_v7_defconfig | 4/5 2 | am335x-boneblack | arm | lab-baylibre | gcc-8 | multi_v7_defc...CONFIG_SMP=n | 4/5 3 | am335x-boneblack | arm | lab-baylibre | gcc-8 | omap2plus_defconfig | 4/5 4 | bcm2836-rpi-2-b | arm | lab-collabora | gcc-8 | bcm2835_defconfig | 0/1 5 | bcm2836-rpi-2-b | arm | lab-collabora | gcc-8 | multi_v7_defconfig | 5/5 6 | bcm2836-rpi-2-b | arm | lab-collabora | gcc-8 | multi_v7_defc...CONFIG_SMP=n | 5/5 7 | bcm2837-rpi-3-b | arm | lab-baylibre | gcc-8 | bcm2835_defconfig | 0/1 8 | bcm2837-rpi-3-b | arm64 | lab-baylibre | gcc-8 | defconfig+CON...OMIZE_BASE=y | 5/5 9 | bcm2837-rpi-3-b | arm64 | lab-baylibre | gcc-8 | defconfig | 4/5 10 | da850-lcdk | arm | lab-baylibre | gcc-8 | davinci_all_defconfig | 4/5 11 | da850-lcdk | arm | lab-baylibre | gcc-8 | multi_v5_defconfig | 4/5 12 | exynos4412-odroidx2 | arm | lab-collabora | gcc-8 | exynos_defconfig | 4/5 13 | exynos4412-odroidx2 | arm | lab-collabora | gcc-8 | multi_v7_defconfig | 4/5 14 | exynos4412-odroidx2 | arm | lab-collabora | gcc-8 | multi_v7_defc...CONFIG_SMP=n | 4/5 15 | exynos5422-odroidxu3 | arm | lab-baylibre | gcc-8 | exynos_defconfig | 2/2 16 | exynos5422-odroidxu3 | arm | lab-collabora | gcc-8 | exynos_defconfig | 2/2 17 | exynos5422-odroidxu3 | arm | lab-baylibre | gcc-8 | multi_v7_defconfig | 1/1 18 | exynos5422-odroidxu3 | arm | lab-baylibre | gcc-8 | multi_v7_defc...G_ARM_LPAE=y | 5/5 19 | exynos5422-odroidxu3 | arm | lab-baylibre | gcc-8 | multi_v7_defc...CONFIG_SMP=n | 5/5 20 | exynos5422-odroidxu3 | arm | lab-collabora | gcc-8 | multi_v7_defconfig | 5/5 21 | exynos5422-odroidxu3 | arm | lab-collabora | gcc-8 | multi_v7_defc...G_ARM_LPAE=y | 5/5 22 | exynos5422-odroidxu3 | arm | lab-collabora | gcc-8 | multi_v7_defc...CONFIG_SMP=n | 5/5 23 | exynos5800-peach-pi | arm | lab-collabora | gcc-8 | exynos_defconfig | 126/132 24 | exynos5800-peach-pi | arm | lab-collabora | gcc-8 | multi_v7_defconfig | 126/132 25 | exynos5800-peach-pi | arm | lab-collabora | gcc-8 | multi_v7_defc...G_ARM_LPAE=y | 126/132 26 | exynos5800-peach-pi | arm | lab-collabora | gcc-8 | multi_v7_defc...CONFIG_SMP=n | 126/132 27 | hifive-unleashed-a00 | riscv | lab-baylibre | gcc-8 | defconfig | 1/1 28 | hsdk | arc | lab-baylibre | gcc-8 | hsdk_defconfig | 4/5 29 | imx6q-sabrelite | arm | lab-baylibre | gcc-8 | multi_v7_defconfig | 5/5 30 | imx6q-sabrelite | arm | lab-baylibre | gcc-8 | multi_v7_defc...CONFIG_SMP=n | 5/5 31 | imx6q-sabrelite | arm | lab-collabora | gcc-8 | multi_v7_defconfig | 5/5 32 | imx6q-sabrelite | arm | lab-collabora | gcc-8 | multi_v7_defc...CONFIG_SMP=n | 5/5 33 | meson-g12a-sei510 | arm64 | lab-baylibre | gcc-8 | defconfig+CON...OMIZE_BASE=y | 5/5 34 | meson-g12a-u200 | arm64 | lab-baylibre | gcc-8 | defconfig+CON...OMIZE_BASE=y | 5/5 35 | meson-g12a-u200 | arm64 | lab-baylibre | gcc-8 | defconfig | 5/5 36 | meson-g12a-x96-max | arm64 | lab-baylibre | gcc-8 | defconfig+CON...OMIZE_BASE=y | 5/5 37 | meson-g12a-x96-max | arm64 | lab-baylibre | gcc-8 | defconfig | 5/5 38 | meson-g12b-odroid-n2 | arm64 | lab-baylibre | gcc-8 | defconfig+CON...OMIZE_BASE=y | 5/5 39 | meson-g12b-odroid-n2 | arm64 | lab-baylibre | gcc-8 | defconfig | 5/5 40 | meson-gxbb-p200 | arm64 | lab-baylibre | gcc-8 | defconfig+CON...BIG_ENDIAN=y | 5/5 41 | meson-gxbb-p200 | arm64 | lab-baylibre | gcc-8 | defconfig+CON...OMIZE_BASE=y | 5/5 42 | meson-gxbb-p200 | arm64 | lab-baylibre | gcc-8 | defconfig | 5/5 43 | meson-gxl-s805x-libretech-ac | arm64 | lab-baylibre | gcc-8 | defconfig+CON...BIG_ENDIAN=y | 5/5 44 | meson-gxl-s805x-libretech-ac | arm64 | lab-baylibre | gcc-8 | defconfig+CON...OMIZE_BASE=y | 5/5 45 | meson-gxl-s805x-p241 | arm64 | lab-baylibre | gcc-8 | defconfig+CON...BIG_ENDIAN=y | 5/5 46 | meson-gxl-s805x-p241 | arm64 | lab-baylibre | gcc-8 | defconfig+CON...OMIZE_BASE=y | 5/5 47 | meson-gxl-s905d-p230 | arm64 | lab-baylibre | gcc-8 | defconfig+CON...OMIZE_BASE=y | 5/5 48 | meson-gxl-s905d-p230 | arm64 | lab-baylibre | gcc-8 | defconfig+CON...BIG_ENDIAN=y | 5/5 49 | meson-gxl-s905d-p230 | arm64 | lab-baylibre | gcc-8 | defconfig | 5/5 50 | meson-gxl-s905x-khadas-vim | arm64 | lab-baylibre | gcc-8 | defconfig+CON...BIG_ENDIAN=y | 5/5 51 | meson-gxl-s905x-khadas-vim | arm64 | lab-baylibre | gcc-8 | defconfig+CON...OMIZE_BASE=y | 1/1 52 | meson-gxl-s905x-khadas-vim | arm64 | lab-baylibre | gcc-8 | defconfig | 4/4 53 | meson-gxl-s905x-libretech-cc | arm64 | lab-baylibre | gcc-8 | defconfig+CON...BIG_ENDIAN=y | 5/5 54 | meson-gxl-s905x-libretech-cc | arm64 | lab-baylibre | gcc-8 | defconfig+CON...OMIZE_BASE=y | 5/5 55 | meson-gxl-s905x-libretech-cc | arm64 | lab-baylibre | gcc-8 | defconfig | 5/5 56 | meson-gxm-khadas-vim2 | arm64 | lab-baylibre | gcc-8 | defconfig+CON...BIG_ENDIAN=y | 5/5 57 | meson-gxm-khadas-vim2 | arm64 | lab-baylibre | gcc-8 | defconfig+CON...OMIZE_BASE=y | 5/5 58 | meson-gxm-khadas-vim2 | arm64 | lab-baylibre | gcc-8 | defconfig | 5/5 59 | meson8b-odroidc1 | arm | lab-baylibre | gcc-8 | multi_v7_defconfig | 5/5 60 | meson8b-odroidc1 | arm | lab-baylibre | gcc-8 | multi_v7_defc...CONFIG_SMP=n | 5/5 61 | minnowboard-turbot-E3826 | x86_64 | lab-collabora | gcc-8 | x86_64_defconfig+kvm_guest | 5/5 62 | minnowboard-turbot-E3826 | x86_64 | lab-collabora | gcc-8 | x86_64_defconfig | 5/5 63 | omap4-panda | arm | lab-baylibre | gcc-8 | multi_v7_defconfig | 5/5 64 | omap4-panda | arm | lab-baylibre | gcc-8 | multi_v7_defc...CONFIG_SMP=n | 5/5 65 | omap4-panda | arm | lab-collabora | gcc-8 | multi_v7_defconfig | 5/5 66 | omap4-panda | arm | lab-collabora | gcc-8 | multi_v7_defc...CONFIG_SMP=n | 5/5 67 | ox820-clouden...lug-series-3 | arm | lab-baylibre | gcc-8 | oxnas_v6_defconfig | 5/5 68 | qemu_arm-virt-gicv2 | arm | lab-baylibre | gcc-8 | multi_v7_defconfig | 5/5 69 | qemu_arm-virt-gicv2 | arm | lab-baylibre | gcc-8 | multi_v7_defc...CONFIG_SMP=n | 5/5 70 | qemu_arm-virt-gicv2 | arm | lab-collabora | gcc-8 | multi_v7_defconfig | 1/1 71 | qemu_arm-virt-gicv2 | arm | lab-collabora | gcc-8 | multi_v7_defc...CONFIG_SMP=n | 1/1 72 | qemu_arm-virt-gicv3 | arm | lab-baylibre | gcc-8 | multi_v7_defconfig | 5/5 73 | qemu_arm-virt-gicv3 | arm | lab-baylibre | gcc-8 | multi_v7_defc...CONFIG_SMP=n | 5/5 74 | qemu_arm-virt-gicv3 | arm | lab-collabora | gcc-8 | multi_v7_defconfig | 1/1 75 | qemu_arm-virt-gicv3 | arm | lab-collabora | gcc-8 | multi_v7_defc...CONFIG_SMP=n | 1/1 76 | qemu_arm64-virt-gicv2 | arm64 | lab-baylibre | gcc-8 | defconfig+CON...OMIZE_BASE=y | 5/5 77 | qemu_arm64-virt-gicv2 | arm64 | lab-baylibre | gcc-8 | defconfig | 5/5 78 | qemu_arm64-virt-gicv2 | arm64 | lab-collabora | gcc-8 | defconfig+CON...OMIZE_BASE=y | 5/5 79 | qemu_arm64-virt-gicv2 | arm64 | lab-collabora | gcc-8 | defconfig | 5/5 80 | qemu_arm64-virt-gicv3 | arm64 | lab-baylibre | gcc-8 | defconfig+CON...OMIZE_BASE=y | 5/5 81 | qemu_arm64-virt-gicv3 | arm64 | lab-baylibre | gcc-8 | defconfig | 5/5 82 | qemu_arm64-virt-gicv3 | arm64 | lab-collabora | gcc-8 | defconfig+CON...OMIZE_BASE=y | 5/5 83 | qemu_arm64-virt-gicv3 | arm64 | lab-collabora | gcc-8 | defconfig | 5/5 84 | qemu_i386 | i386 | lab-baylibre | gcc-8 | i386_defconfig | 1/1 85 | qemu_i386 | i386 | lab-collabora | gcc-8 | i386_defconfig | 1/1 86 | qemu_x86_64 | x86_64 | lab-baylibre | gcc-8 | x86_64_defconfig+kvm_guest | 5/5 87 | qemu_x86_64 | x86_64 | lab-baylibre | gcc-8 | x86_64_defconfig | 1/1 88 | qemu_x86_64 | x86_64 | lab-collabora | gcc-8 | x86_64_defconfig+kvm_guest | 5/5 89 | qemu_x86_64 | x86_64 | lab-collabora | gcc-8 | x86_64_defconfig | 1/1 90 | r8a7795-salvator-x | arm64 | lab-baylibre | gcc-8 | defconfig+CON...BIG_ENDIAN=y | 5/5 91 | r8a7795-salvator-x | arm64 | lab-baylibre | gcc-8 | defconfig+CON...OMIZE_BASE=y | 5/5 92 | r8a7795-salvator-x | arm64 | lab-baylibre | gcc-8 | defconfig | 0/1 93 | r8a7796-m3ulcb | arm64 | lab-baylibre | gcc-8 | defconfig+CON...OMIZE_BASE=y | 5/5 94 | r8a7796-m3ulcb | arm64 | lab-baylibre | gcc-8 | defconfig | 5/5 95 | r8a7796-m3ulcb | arm64 | lab-collabora | gcc-8 | defconfig+CON...OMIZE_BASE=y | 5/5 96 | r8a7796-m3ulcb | arm64 | lab-collabora | gcc-8 | defconfig | 5/5 97 | rk3288-rock2-square | arm | lab-collabora | gcc-8 | multi_v7_defconfig | 5/5 98 | rk3288-rock2-square | arm | lab-collabora | gcc-8 | multi_v7_defc...G_ARM_LPAE=y | 5/5 99 | rk3288-rock2-square | arm | lab-collabora | gcc-8 | multi_v7_defc...CONFIG_SMP=n | 5/5 100 | rk3288-veyron-jaq | arm | lab-collabora | gcc-8 | multi_v7_defconfig | 64/65 101 | rk3288-veyron-jaq | arm | lab-collabora | gcc-8 | multi_v7_defc...G_ARM_LPAE=y | 64/65 102 | rk3288-veyron-jaq | arm | lab-collabora | gcc-8 | multi_v7_defc...CONFIG_SMP=n | 1/1 103 | rk3399-gru-kevin | arm64 | lab-collabora | gcc-8 | defconfig+CON...OMIZE_BASE=y | 82/82 104 | rk3399-gru-kevin | arm64 | lab-collabora | gcc-8 | defconfig | 82/82 105 | sun50i-h5-lib...ch-all-h3-cc | arm64 | lab-baylibre | gcc-8 | defconfig+CON...OMIZE_BASE=y | 5/5 106 | sun50i-h5-lib...ch-all-h3-cc | arm64 | lab-baylibre | gcc-8 | defconfig | 5/5 107 | sun50i-h6-pine-h64 | arm64 | lab-baylibre | gcc-8 | defconfig+CON...OMIZE_BASE=y | 5/5 108 | sun50i-h6-pine-h64 | arm64 | lab-baylibre | gcc-8 | defconfig | 5/5 109 | sun5i-a13-olinuxino-micro | arm | lab-baylibre | gcc-8 | multi_v7_defconfig | 5/5 110 | sun5i-a13-olinuxino-micro | arm | lab-baylibre | gcc-8 | multi_v7_defc...CONFIG_SMP=n | 5/5 111 | sun5i-a13-olinuxino-micro | arm | lab-baylibre | gcc-8 | sunxi_defconfig | 5/5 112 | sun7i-a20-cubieboard2 | arm | lab-baylibre | gcc-8 | multi_v7_defconfig | 5/5 113 | sun7i-a20-cubieboard2 | arm | lab-baylibre | gcc-8 | multi_v7_defc...CONFIG_SMP=n | 5/5 114 | sun7i-a20-cubieboard2 | arm | lab-baylibre | gcc-8 | sunxi_defconfig | 5/5 115 | sun8i-h2-plus...ch-all-h3-cc | arm | lab-baylibre | gcc-8 | multi_v7_defconfig | 5/5 116 | sun8i-h2-plus...ch-all-h3-cc | arm | lab-baylibre | gcc-8 | multi_v7_defc...CONFIG_SMP=n | 5/5 117 | sun8i-h2-plus...ch-all-h3-cc | arm | lab-baylibre | gcc-8 | sunxi_defconfig | 5/5 118 | sun8i-h2-plus-orangepi-r1 | arm | lab-baylibre | gcc-8 | multi_v7_defconfig | 5/5 119 | sun8i-h2-plus-orangepi-r1 | arm | lab-baylibre | gcc-8 | multi_v7_defc...CONFIG_SMP=n | 5/5 120 | sun8i-h2-plus-orangepi-r1 | arm | lab-baylibre | gcc-8 | sunxi_defconfig | 5/5 121 | sun8i-h2-plus-orangepi-zero | arm | lab-baylibre | gcc-8 | multi_v7_defconfig | 5/5 122 | sun8i-h2-plus-orangepi-zero | arm | lab-baylibre | gcc-8 | multi_v7_defc...CONFIG_SMP=n | 5/5 123 | sun8i-h2-plus-orangepi-zero | arm | lab-baylibre | gcc-8 | sunxi_defconfig | 5/5 124 | sun8i-h3-libretech-all-h3-cc | arm | lab-baylibre | gcc-8 | multi_v7_defconfig | 5/5 125 | sun8i-h3-libretech-all-h3-cc | arm | lab-baylibre | gcc-8 | multi_v7_defc...CONFIG_SMP=n | 5/5 126 | sun8i-h3-libretech-all-h3-cc | arm | lab-baylibre | gcc-8 | sunxi_defconfig | 5/5 127 | tegra124-jetson-tk1 | arm | lab-collabora | gcc-8 | multi_v7_defconfig | 5/5 128 | tegra124-jetson-tk1 | arm | lab-collabora | gcc-8 | multi_v7_defc...G_ARM_LPAE=y | 5/5 129 | tegra124-jetson-tk1 | arm | lab-collabora | gcc-8 | multi_v7_defc...CONFIG_SMP=n | 5/5 130 | tegra124-jetson-tk1 | arm | lab-collabora | gcc-8 | tegra_defconfig | 5/5 131 | tegra124-nyan-big | arm | lab-collabora | gcc-8 | multi_v7_defconfig | 5/5 132 | tegra124-nyan-big | arm | lab-collabora | gcc-8 | multi_v7_defc...G_ARM_LPAE=y | 5/5 133 | tegra124-nyan-big | arm | lab-collabora | gcc-8 | multi_v7_defc...CONFIG_SMP=n | 5/5 134 | tegra124-nyan-big | arm | lab-collabora | gcc-8 | tegra_defconfig | 5/5 Test: baseline Tree: soc Branch: for-next Describe: v5.4-rc2-1161-g2b3cbb21ceaf URL:
https://git.kernel.org/pub/scm/linux/kernel/git/soc/soc.git
SHA: 2b3cbb21ceaf6f1a72a7136fd314b50d977d32dc Test Failures ------------- run | platform | arch | lab | compiler | defconfig | results ----+------------------------------+--------+---------------+----------+------------------------------+-------- 1 | am335x-boneblack | arm | lab-baylibre | gcc-8 | multi_v7_defconfig | 4/5 Results: 4 PASS, 1 FAIL, 0 SKIP Full config: multi_v7_defconfig Compiler: gcc-8 (arm-linux-gnueabihf-gcc (Debian 8.3.0-2) 8.3.0) Plain log:
https://storage.kernelci.org//soc/for-next/v5.4-rc2-1161-g2b3cbb21ceaf/arm/…
HTML log:
https://storage.kernelci.org//soc/for-next/v5.4-rc2-1161-g2b3cbb21ceaf/arm/…
Rootfs:
https://storage.kernelci.org/images/rootfs/buildroot/kci-2019.02-8-gd700ebb…
dmesg - 3 tests: 2 PASS, 1 FAIL, 0 SKIP * crit: never passed 1 lines run | platform | arch | lab | compiler | defconfig | results ----+------------------------------+--------+---------------+----------+------------------------------+-------- 2 | am335x-boneblack | arm | lab-baylibre | gcc-8 | multi_v7_defc...CONFIG_SMP=n | 4/5 Results: 4 PASS, 1 FAIL, 0 SKIP Full config: multi_v7_defconfig+CONFIG_SMP=n Compiler: gcc-8 (arm-linux-gnueabihf-gcc (Debian 8.3.0-2) 8.3.0) Plain log:
https://storage.kernelci.org//soc/for-next/v5.4-rc2-1161-g2b3cbb21ceaf/arm/…
HTML log:
https://storage.kernelci.org//soc/for-next/v5.4-rc2-1161-g2b3cbb21ceaf/arm/…
Rootfs:
https://storage.kernelci.org/images/rootfs/buildroot/kci-2019.02-8-gd700ebb…
dmesg - 3 tests: 2 PASS, 1 FAIL, 0 SKIP * crit: never passed 1 lines run | platform | arch | lab | compiler | defconfig | results ----+------------------------------+--------+---------------+----------+------------------------------+-------- 3 | am335x-boneblack | arm | lab-baylibre | gcc-8 | omap2plus_defconfig | 4/5 Results: 4 PASS, 1 FAIL, 0 SKIP Full config: omap2plus_defconfig Compiler: gcc-8 (arm-linux-gnueabihf-gcc (Debian 8.3.0-2) 8.3.0) Plain log:
https://storage.kernelci.org//soc/for-next/v5.4-rc2-1161-g2b3cbb21ceaf/arm/…
HTML log:
https://storage.kernelci.org//soc/for-next/v5.4-rc2-1161-g2b3cbb21ceaf/arm/…
Rootfs:
https://storage.kernelci.org/images/rootfs/buildroot/kci-2019.02-8-gd700ebb…
dmesg - 3 tests: 2 PASS, 1 FAIL, 0 SKIP * crit: never passed 1 lines run | platform | arch | lab | compiler | defconfig | results ----+------------------------------+--------+---------------+----------+------------------------------+-------- 4 | bcm2836-rpi-2-b | arm | lab-collabora | gcc-8 | bcm2835_defconfig | 0/1 Results: 0 PASS, 1 FAIL, 0 SKIP Full config: bcm2835_defconfig Compiler: gcc-8 (arm-linux-gnueabihf-gcc (Debian 8.3.0-2) 8.3.0) Plain log:
https://storage.kernelci.org//soc/for-next/v5.4-rc2-1161-g2b3cbb21ceaf/arm/…
HTML log:
https://storage.kernelci.org//soc/for-next/v5.4-rc2-1161-g2b3cbb21ceaf/arm/…
Rootfs:
https://storage.kernelci.org/images/rootfs/buildroot/kci-2019.02-8-gd700ebb…
1 tests: 0 PASS, 1 FAIL, 0 SKIP * login: failing since 44 days (last pass: v5.3-881-g8c3e4c106c06, first fail: v5.4-rc1-3-g4705d9f7f6f0) run | platform | arch | lab | compiler | defconfig | results ----+------------------------------+--------+---------------+----------+------------------------------+-------- 7 | bcm2837-rpi-3-b | arm | lab-baylibre | gcc-8 | bcm2835_defconfig | 0/1 Results: 0 PASS, 1 FAIL, 0 SKIP Full config: bcm2835_defconfig Compiler: gcc-8 (arm-linux-gnueabihf-gcc (Debian 8.3.0-2) 8.3.0) Plain log:
https://storage.kernelci.org//soc/for-next/v5.4-rc2-1161-g2b3cbb21ceaf/arm/…
HTML log:
https://storage.kernelci.org//soc/for-next/v5.4-rc2-1161-g2b3cbb21ceaf/arm/…
Rootfs:
https://storage.kernelci.org/images/rootfs/buildroot/kci-2019.02-8-gd700ebb…
1 tests: 0 PASS, 1 FAIL, 0 SKIP * login: failing since 44 days (last pass: v5.3-881-g8c3e4c106c06, first fail: v5.4-rc1-3-g4705d9f7f6f0) run | platform | arch | lab | compiler | defconfig | results ----+------------------------------+--------+---------------+----------+------------------------------+-------- 9 | bcm2837-rpi-3-b | arm64 | lab-baylibre | gcc-8 | defconfig | 4/5 Results: 4 PASS, 1 FAIL, 0 SKIP Full config: defconfig Compiler: gcc-8 (aarch64-linux-gnu-gcc (Debian 8.3.0-2) 8.3.0) Plain log:
https://storage.kernelci.org//soc/for-next/v5.4-rc2-1161-g2b3cbb21ceaf/arm6…
HTML log:
https://storage.kernelci.org//soc/for-next/v5.4-rc2-1161-g2b3cbb21ceaf/arm6…
Rootfs:
https://storage.kernelci.org/images/rootfs/buildroot/kci-2019.02-8-gd700ebb…
dmesg - 3 tests: 2 PASS, 1 FAIL, 0 SKIP * crit: new failure (last pass: v5.4-rc2-1157-g83a362c02a60) 1 lines run | platform | arch | lab | compiler | defconfig | results ----+------------------------------+--------+---------------+----------+------------------------------+-------- 10 | da850-lcdk | arm | lab-baylibre | gcc-8 | davinci_all_defconfig | 4/5 Results: 4 PASS, 1 FAIL, 0 SKIP Full config: davinci_all_defconfig Compiler: gcc-8 (arm-linux-gnueabihf-gcc (Debian 8.3.0-2) 8.3.0) Plain log:
https://storage.kernelci.org//soc/for-next/v5.4-rc2-1161-g2b3cbb21ceaf/arm/…
HTML log:
https://storage.kernelci.org//soc/for-next/v5.4-rc2-1161-g2b3cbb21ceaf/arm/…
Rootfs:
https://storage.kernelci.org/images/rootfs/buildroot/kci-2019.02-8-gd700ebb…
dmesg - 3 tests: 2 PASS, 1 FAIL, 0 SKIP * alert: never passed 2 lines run | platform | arch | lab | compiler | defconfig | results ----+------------------------------+--------+---------------+----------+------------------------------+-------- 11 | da850-lcdk | arm | lab-baylibre | gcc-8 | multi_v5_defconfig | 4/5 Results: 4 PASS, 1 FAIL, 0 SKIP Full config: multi_v5_defconfig Compiler: gcc-8 (arm-linux-gnueabihf-gcc (Debian 8.3.0-2) 8.3.0) Plain log:
https://storage.kernelci.org//soc/for-next/v5.4-rc2-1161-g2b3cbb21ceaf/arm/…
HTML log:
https://storage.kernelci.org//soc/for-next/v5.4-rc2-1161-g2b3cbb21ceaf/arm/…
Rootfs:
https://storage.kernelci.org/images/rootfs/buildroot/kci-2019.02-8-gd700ebb…
dmesg - 3 tests: 2 PASS, 1 FAIL, 0 SKIP * alert: never passed 2 lines run | platform | arch | lab | compiler | defconfig | results ----+------------------------------+--------+---------------+----------+------------------------------+-------- 12 | exynos4412-odroidx2 | arm | lab-collabora | gcc-8 | exynos_defconfig | 4/5 Results: 4 PASS, 1 FAIL, 0 SKIP Full config: exynos_defconfig Compiler: gcc-8 (arm-linux-gnueabihf-gcc (Debian 8.3.0-2) 8.3.0) Plain log:
https://storage.kernelci.org//soc/for-next/v5.4-rc2-1161-g2b3cbb21ceaf/arm/…
HTML log:
https://storage.kernelci.org//soc/for-next/v5.4-rc2-1161-g2b3cbb21ceaf/arm/…
Rootfs:
https://storage.kernelci.org/images/rootfs/buildroot/kci-2019.02-8-gd700ebb…
dmesg - 3 tests: 2 PASS, 1 FAIL, 0 SKIP * alert: never passed 1 lines run | platform | arch | lab | compiler | defconfig | results ----+------------------------------+--------+---------------+----------+------------------------------+-------- 13 | exynos4412-odroidx2 | arm | lab-collabora | gcc-8 | multi_v7_defconfig | 4/5 Results: 4 PASS, 1 FAIL, 0 SKIP Full config: multi_v7_defconfig Compiler: gcc-8 (arm-linux-gnueabihf-gcc (Debian 8.3.0-2) 8.3.0) Plain log:
https://storage.kernelci.org//soc/for-next/v5.4-rc2-1161-g2b3cbb21ceaf/arm/…
HTML log:
https://storage.kernelci.org//soc/for-next/v5.4-rc2-1161-g2b3cbb21ceaf/arm/…
Rootfs:
https://storage.kernelci.org/images/rootfs/buildroot/kci-2019.02-8-gd700ebb…
dmesg - 3 tests: 2 PASS, 1 FAIL, 0 SKIP * alert: never passed 1 lines run | platform | arch | lab | compiler | defconfig | results ----+------------------------------+--------+---------------+----------+------------------------------+-------- 14 | exynos4412-odroidx2 | arm | lab-collabora | gcc-8 | multi_v7_defc...CONFIG_SMP=n | 4/5 Results: 4 PASS, 1 FAIL, 0 SKIP Full config: multi_v7_defconfig+CONFIG_SMP=n Compiler: gcc-8 (arm-linux-gnueabihf-gcc (Debian 8.3.0-2) 8.3.0) Plain log:
https://storage.kernelci.org//soc/for-next/v5.4-rc2-1161-g2b3cbb21ceaf/arm/…
HTML log:
https://storage.kernelci.org//soc/for-next/v5.4-rc2-1161-g2b3cbb21ceaf/arm/…
Rootfs:
https://storage.kernelci.org/images/rootfs/buildroot/kci-2019.02-8-gd700ebb…
dmesg - 3 tests: 2 PASS, 1 FAIL, 0 SKIP * alert: never passed 1 lines run | platform | arch | lab | compiler | defconfig | results ----+------------------------------+--------+---------------+----------+------------------------------+-------- 23 | exynos5800-peach-pi | arm | lab-collabora | gcc-8 | exynos_defconfig | 126/132 Results: 126 PASS, 6 FAIL, 0 SKIP Full config: exynos_defconfig Compiler: gcc-8 (arm-linux-gnueabihf-gcc (Debian 8.3.0-2) 8.3.0) Plain log:
https://storage.kernelci.org//soc/for-next/v5.4-rc2-1161-g2b3cbb21ceaf/arm/…
HTML log:
https://storage.kernelci.org//soc/for-next/v5.4-rc2-1161-g2b3cbb21ceaf/arm/…
Rootfs:
https://storage.kernelci.org/images/rootfs/buildroot/kci-2019.02-8-gd700ebb…
bootrr - 128 tests: 122 PASS, 6 FAIL, 0 SKIP * exynos5-subcmu-DISP-probed: never passed * exynos5-subcmu-GSC-probed: never passed * exynos5-subcmu-MFC-probed: never passed * samsung-i2s0-probed: never passed * xhci-hcd_0-probed: never passed * xhci-hcd_1-probed: never passed run | platform | arch | lab | compiler | defconfig | results ----+------------------------------+--------+---------------+----------+------------------------------+-------- 24 | exynos5800-peach-pi | arm | lab-collabora | gcc-8 | multi_v7_defconfig | 126/132 Results: 126 PASS, 6 FAIL, 0 SKIP Full config: multi_v7_defconfig Compiler: gcc-8 (arm-linux-gnueabihf-gcc (Debian 8.3.0-2) 8.3.0) Plain log:
https://storage.kernelci.org//soc/for-next/v5.4-rc2-1161-g2b3cbb21ceaf/arm/…
HTML log:
https://storage.kernelci.org//soc/for-next/v5.4-rc2-1161-g2b3cbb21ceaf/arm/…
Rootfs:
https://storage.kernelci.org/images/rootfs/buildroot/kci-2019.02-8-gd700ebb…
bootrr - 128 tests: 122 PASS, 6 FAIL, 0 SKIP * exynos5-subcmu-DISP-probed: never passed * exynos5-subcmu-GSC-probed: never passed * exynos5-subcmu-MFC-probed: never passed * samsung-i2s0-probed: never passed * xhci-hcd_0-probed: never passed * xhci-hcd_1-probed: never passed run | platform | arch | lab | compiler | defconfig | results ----+------------------------------+--------+---------------+----------+------------------------------+-------- 25 | exynos5800-peach-pi | arm | lab-collabora | gcc-8 | multi_v7_defc...G_ARM_LPAE=y | 126/132 Results: 126 PASS, 6 FAIL, 0 SKIP Full config: multi_v7_defconfig+CONFIG_EFI=y+CONFIG_ARM_LPAE=y Compiler: gcc-8 (arm-linux-gnueabihf-gcc (Debian 8.3.0-2) 8.3.0) Plain log:
https://storage.kernelci.org//soc/for-next/v5.4-rc2-1161-g2b3cbb21ceaf/arm/…
HTML log:
https://storage.kernelci.org//soc/for-next/v5.4-rc2-1161-g2b3cbb21ceaf/arm/…
Rootfs:
https://storage.kernelci.org/images/rootfs/buildroot/kci-2019.02-8-gd700ebb…
bootrr - 128 tests: 122 PASS, 6 FAIL, 0 SKIP * exynos5-subcmu-DISP-probed: never passed * exynos5-subcmu-GSC-probed: never passed * exynos5-subcmu-MFC-probed: never passed * samsung-i2s0-probed: never passed * xhci-hcd_0-probed: never passed * xhci-hcd_1-probed: never passed run | platform | arch | lab | compiler | defconfig | results ----+------------------------------+--------+---------------+----------+------------------------------+-------- 26 | exynos5800-peach-pi | arm | lab-collabora | gcc-8 | multi_v7_defc...CONFIG_SMP=n | 126/132 Results: 126 PASS, 6 FAIL, 0 SKIP Full config: multi_v7_defconfig+CONFIG_SMP=n Compiler: gcc-8 (arm-linux-gnueabihf-gcc (Debian 8.3.0-2) 8.3.0) Plain log:
https://storage.kernelci.org//soc/for-next/v5.4-rc2-1161-g2b3cbb21ceaf/arm/…
HTML log:
https://storage.kernelci.org//soc/for-next/v5.4-rc2-1161-g2b3cbb21ceaf/arm/…
Rootfs:
https://storage.kernelci.org/images/rootfs/buildroot/kci-2019.02-8-gd700ebb…
bootrr - 128 tests: 122 PASS, 6 FAIL, 0 SKIP * exynos5-subcmu-DISP-probed: never passed * exynos5-subcmu-GSC-probed: never passed * exynos5-subcmu-MFC-probed: never passed * samsung-i2s0-probed: never passed * xhci-hcd_0-probed: never passed * xhci-hcd_1-probed: never passed run | platform | arch | lab | compiler | defconfig | results ----+------------------------------+--------+---------------+----------+------------------------------+-------- 92 | r8a7795-salvator-x | arm64 | lab-baylibre | gcc-8 | defconfig | 0/1 Results: 0 PASS, 1 FAIL, 0 SKIP Full config: defconfig Compiler: gcc-8 (aarch64-linux-gnu-gcc (Debian 8.3.0-2) 8.3.0) Plain log:
https://storage.kernelci.org//soc/for-next/v5.4-rc2-1161-g2b3cbb21ceaf/arm6…
HTML log:
https://storage.kernelci.org//soc/for-next/v5.4-rc2-1161-g2b3cbb21ceaf/arm6…
Rootfs:
https://storage.kernelci.org/images/rootfs/buildroot/kci-2019.02-8-gd700ebb…
1 tests: 0 PASS, 1 FAIL, 0 SKIP * login: new failure (last pass: v5.4-rc2-1157-g83a362c02a60) run | platform | arch | lab | compiler | defconfig | results ----+------------------------------+--------+---------------+----------+------------------------------+-------- 100 | rk3288-veyron-jaq | arm | lab-collabora | gcc-8 | multi_v7_defconfig | 64/65 Results: 64 PASS, 1 FAIL, 0 SKIP Full config: multi_v7_defconfig Compiler: gcc-8 (arm-linux-gnueabihf-gcc (Debian 8.3.0-2) 8.3.0) Plain log:
https://storage.kernelci.org//soc/for-next/v5.4-rc2-1161-g2b3cbb21ceaf/arm/…
HTML log:
https://storage.kernelci.org//soc/for-next/v5.4-rc2-1161-g2b3cbb21ceaf/arm/…
Rootfs:
https://storage.kernelci.org/images/rootfs/buildroot/kci-2019.02-8-gd700ebb…
bootrr - 61 tests: 60 PASS, 1 FAIL, 0 SKIP * rk3x-i2c5-probed: never passed run | platform | arch | lab | compiler | defconfig | results ----+------------------------------+--------+---------------+----------+------------------------------+-------- 101 | rk3288-veyron-jaq | arm | lab-collabora | gcc-8 | multi_v7_defc...G_ARM_LPAE=y | 64/65 Results: 64 PASS, 1 FAIL, 0 SKIP Full config: multi_v7_defconfig+CONFIG_EFI=y+CONFIG_ARM_LPAE=y Compiler: gcc-8 (arm-linux-gnueabihf-gcc (Debian 8.3.0-2) 8.3.0) Plain log:
https://storage.kernelci.org//soc/for-next/v5.4-rc2-1161-g2b3cbb21ceaf/arm/…
HTML log:
https://storage.kernelci.org//soc/for-next/v5.4-rc2-1161-g2b3cbb21ceaf/arm/…
Rootfs:
https://storage.kernelci.org/images/rootfs/buildroot/kci-2019.02-8-gd700ebb…
bootrr - 61 tests: 60 PASS, 1 FAIL, 0 SKIP * rk3x-i2c5-probed: never passed
5 years, 6 months
1
0
0
0
soc/for-next boot: 220 boots: 4 failed, 208 passed with 8 offline (v5.4-rc2-1161-g2b3cbb21ceaf)
by kernelci.org bot
soc/for-next boot: 220 boots: 4 failed, 208 passed with 8 offline (v5.4-rc2-1161-g2b3cbb21ceaf) Full Boot Summary:
https://kernelci.org/boot/all/job/soc/branch/for-next/kernel/v5.4-rc2-1161-…
Full Build Summary:
https://kernelci.org/build/soc/branch/for-next/kernel/v5.4-rc2-1161-g2b3cbb…
Tree: soc Branch: for-next Git Describe: v5.4-rc2-1161-g2b3cbb21ceaf Git Commit: 2b3cbb21ceaf6f1a72a7136fd314b50d977d32dc Git URL:
https://git.kernel.org/pub/scm/linux/kernel/git/soc/soc.git
Tested: 81 unique boards, 25 SoC families, 28 builds out of 215 Boot Failures Detected: arm: bcm2835_defconfig: gcc-8: bcm2835-rpi-b: 1 failed lab bcm2836-rpi-2-b: 1 failed lab bcm2837-rpi-3-b: 1 failed lab arm64: defconfig+CONFIG_CPU_BIG_ENDIAN=y: gcc-8: meson-gxl-s805x-libretech-ac: 1 failed lab Offline Platforms: arm: sunxi_defconfig: gcc-8 sun5i-r8-chip: 1 offline lab sun7i-a20-bananapi: 1 offline lab multi_v7_defconfig: gcc-8 qcom-apq8064-cm-qs600: 1 offline lab sun5i-r8-chip: 1 offline lab sun7i-a20-bananapi: 1 offline lab qcom_defconfig: gcc-8 qcom-apq8064-cm-qs600: 1 offline lab arm64: defconfig: gcc-8 sun50i-a64-pine64-plus: 1 offline lab defconfig+CONFIG_RANDOMIZE_BASE=y: gcc-8 sun50i-a64-pine64-plus: 1 offline lab --- For more info write to <info(a)kernelci.org>
5 years, 6 months
1
0
0
0
mainline 5.4.0-rc7/bf9294798930: no regressions found in project mainline on OE
by Linaro QA
Summary ------------------------------------------------------------------------ kernel: 5.4.0-rc7 git repo:
https://git.kernel.org/pub/scm/linux/kernel/git/torvalds/linux.git
git branch: master git commit: bf929479893052b1c7bfe23a4e7a903643076350 git describe: v5.4-rc7-58-gbf9294798930 Test details:
https://qa-reports.linaro.org/lkft/linux-mainline-oe/build/v5.4-rc7-58-gbf9…
No regressions (compared to build v5.4-rc7-49-g0e3f1ad80fc8) Fixes (compared to build v5.4-rc7-49-g0e3f1ad80fc8) ------------------------------------------------------------------------ qemu_arm64: kselftest: * seccomp_seccomp_benchmark Boards, architectures and test suites: ------------------------------------- dragonboard-410c - arm64 * build - pass: 1, hi6220-hikey - arm64 * build - pass: 1, i386 * build - pass: 1, juno-r2 - arm64 * build - pass: 1, * kselftest - fail: 32, pass: 95, skip: 14, xfail: 37 * kvm-unit-tests - fail: 1, pass: 12, skip: 3, * libgpiod - pass: 117, * libhugetlbfs - pass: 90, skip: 1, * ltp-cap_bounds-tests - pass: 1, * ltp-commands-tests - pass: 28, skip: 14, * ltp-containers-tests - pass: 80, * ltp-cpuhotplug-tests - pass: 5, skip: 1, * ltp-dio-tests - pass: 19, skip: 11, * ltp-fcntl-locktests-tests - pass: 1, * ltp-filecaps-tests - pass: 1, * ltp-fs-tests - pass: 59, skip: 7, xfail: 1 * ltp-fs_bind-tests - pass: 1, * ltp-fs_perms_simple-tests - pass: 18, * ltp-fsx-tests - pass: 1, * ltp-hugetlb-tests - pass: 21, * ltp-io-tests - pass: 2, * ltp-ipc-tests - pass: 8, * ltp-math-tests - pass: 10, * ltp-mm-tests - pass: 56, skip: 18, xfail: 1 * ltp-nptl-tests - pass: 1, * ltp-open-posix-tests - pass: 1693, skip: 42, xfail: 4 * ltp-pty-tests - pass: 4, * ltp-sched-tests - pass: 6, skip: 4, * ltp-securebits-tests - pass: 3, * ltp-syscalls-tests - pass: 1099, skip: 149, xfail: 2 * network-basic-tests - pass: 10, skip: 1, * v4l2-compliance - pass: 43, xfail: 2 qemu_arm * kselftest - fail: 33, pass: 85, skip: 14, xfail: 46 * libgpiod - pass: 117, * libhugetlbfs - pass: 87, skip: 1, * ltp-cap_bounds-tests - pass: 1, * ltp-commands-tests - pass: 28, skip: 14, * ltp-containers-tests - pass: 80, * ltp-cpuhotplug-tests - pass: 5, skip: 1, * ltp-cve-tests - pass: 31, skip: 9, * ltp-dio-tests - pass: 18, skip: 11, xfail: 1 * ltp-fcntl-locktests-tests - pass: 1, * ltp-filecaps-tests - pass: 1, * ltp-fs-tests - pass: 60, skip: 7, * ltp-fs_bind-tests - pass: 1, * ltp-fs_perms_simple-tests - pass: 18, * ltp-fsx-tests - pass: 1, * ltp-hugetlb-tests - pass: 20, skip: 1, * ltp-io-tests - pass: 1, xfail: 1 * ltp-ipc-tests - pass: 8, * ltp-math-tests - pass: 10, * ltp-mm-tests - pass: 52, skip: 22, xfail: 1 * ltp-nptl-tests - pass: 1, * ltp-pty-tests - pass: 4, * ltp-sched-tests - pass: 4, skip: 6, * ltp-securebits-tests - pass: 3, * ltp-syscalls-tests - fail: 1, pass: 1137, skip: 110, xfail: 2 * perf - fail: 10, pass: 46, skip: 12, xfail: 2 * spectre-meltdown-checker-test - pass: 12, * v4l2-compliance - pass: 43, xfail: 2 qemu_arm64 * kselftest - fail: 33, pass: 93, skip: 14, xfail: 38 * libgpiod - pass: 117, * libhugetlbfs - pass: 90, skip: 1, * ltp-cap_bounds-tests - pass: 1, * ltp-commands-tests - pass: 28, skip: 14, * ltp-containers-tests - pass: 80, * ltp-cpuhotplug-tests - pass: 5, skip: 1, * ltp-cve-tests - pass: 29, skip: 11, * ltp-dio-tests - pass: 19, skip: 11, * ltp-fcntl-locktests-tests - pass: 1, * ltp-filecaps-tests - pass: 1, * ltp-fs-tests - pass: 59, skip: 7, xfail: 1 * ltp-fs_bind-tests - pass: 1, * ltp-fs_perms_simple-tests - pass: 18, * ltp-fsx-tests - pass: 1, * ltp-hugetlb-tests - pass: 21, * ltp-io-tests - pass: 1, xfail: 1 * ltp-ipc-tests - pass: 8, * ltp-math-tests - pass: 10, * ltp-mm-tests - pass: 56, skip: 18, xfail: 1 * ltp-nptl-tests - pass: 1, * ltp-pty-tests - pass: 4, * ltp-sched-tests - pass: 4, skip: 6, * ltp-securebits-tests - pass: 3, * ltp-syscalls-tests - fail: 2, pass: 1082, skip: 165, xfail: 1 * perf - fail: 6, pass: 56, skip: 9, xfail: 1 * spectre-meltdown-checker-test - pass: 12, * v4l2-compliance - pass: 43, xfail: 2 qemu_i386 * kselftest - fail: 32, pass: 117, skip: 16, xfail: 40 * libgpiod - pass: 117, * libhugetlbfs - pass: 87, skip: 1, * ltp-cap_bounds-tests - pass: 1, * ltp-commands-tests - pass: 28, skip: 14, * ltp-containers-tests - pass: 80, * ltp-cpuhotplug-tests - pass: 5, skip: 1, * ltp-cve-tests - fail: 1, pass: 31, skip: 6, xfail: 2 * ltp-dio-tests - pass: 19, skip: 11, * ltp-fcntl-locktests-tests - pass: 1, * ltp-filecaps-tests - pass: 1, * ltp-fs-tests - pass: 62, skip: 5, * ltp-fs_bind-tests - pass: 1, * ltp-fs_perms_simple-tests - pass: 18, * ltp-fsx-tests - pass: 1, * ltp-hugetlb-tests - pass: 20, skip: 1, * ltp-io-tests - pass: 1, xfail: 1 * ltp-ipc-tests - pass: 8, * ltp-math-tests - pass: 10, * ltp-mm-tests - pass: 51, skip: 23, xfail: 1 * ltp-nptl-tests - pass: 1, * ltp-pty-tests - pass: 4, * ltp-sched-tests - pass: 10, * ltp-securebits-tests - pass: 3, * ltp-syscalls-tests - fail: 2, pass: 1144, skip: 104, * perf - fail: 10, pass: 55, skip: 10, xfail: 1 * spectre-meltdown-checker-test - pass: 12, * v4l2-compliance - pass: 42, xfail: 2 qemu_x86_64 * kselftest - fail: 24, pass: 123, skip: 15, xfail: 35 * libgpiod - pass: 117, * libhugetlbfs - pass: 90, skip: 1, * ltp-cap_bounds-tests - pass: 1, * ltp-commands-tests - pass: 28, skip: 14, * ltp-containers-tests - pass: 80, * ltp-cpuhotplug-tests - pass: 5, skip: 1, * ltp-cve-tests - pass: 34, skip: 6, * ltp-dio-tests - pass: 19, skip: 11, * ltp-fcntl-locktests-tests - pass: 1, * ltp-filecaps-tests - pass: 1, * ltp-fs-tests - pass: 62, skip: 5, * ltp-fs_bind-tests - pass: 1, * ltp-fs_perms_simple-tests - pass: 18, * ltp-fsx-tests - pass: 1, * ltp-hugetlb-tests - pass: 21, * ltp-io-tests - pass: 1, xfail: 1 * ltp-ipc-tests - pass: 8, * ltp-math-tests - pass: 10, * ltp-mm-tests - pass: 56, skip: 18, xfail: 1 * ltp-nptl-tests - pass: 1, * ltp-pty-tests - pass: 4, * ltp-sched-tests - pass: 10, * ltp-securebits-tests - pass: 3, * ltp-syscalls-tests - fail: 1, pass: 1075, skip: 174, * perf - fail: 4, pass: 63, skip: 10, * spectre-meltdown-checker-test - pass: 12, * v4l2-compliance - pass: 42, xfail: 2 x15 - arm * build - pass: 1, * install-android-platform-tools-r2600 - pass: 2, * libhugetlbfs - pass: 87, skip: 1, x86_64 * build - pass: 1, -- Linaro QA
https://qa-reports.linaro.org
5 years, 6 months
1
0
0
0
← Newer
1
...
56
57
58
59
60
61
62
...
119
Older →
Jump to page:
1
2
3
4
5
6
7
8
9
10
11
12
13
14
15
16
17
18
19
20
21
22
23
24
25
26
27
28
29
30
31
32
33
34
35
36
37
38
39
40
41
42
43
44
45
46
47
48
49
50
51
52
53
54
55
56
57
58
59
60
61
62
63
64
65
66
67
68
69
70
71
72
73
74
75
76
77
78
79
80
81
82
83
84
85
86
87
88
89
90
91
92
93
94
95
96
97
98
99
100
101
102
103
104
105
106
107
108
109
110
111
112
113
114
115
116
117
118
119
Results per page:
10
25
50
100
200